develooper Front page | perl.perl5.porters | Postings from December 2012

Smoke [blead] v5.17.6-313-g9e440ec FAIL(Xm) linux 3.2.0-31-generic [debian] (x86_64/8 cpu) {blead_g++}

From:
George Greer
Date:
December 14, 2012 07:41
Subject:
Smoke [blead] v5.17.6-313-g9e440ec FAIL(Xm) linux 3.2.0-31-generic [debian] (x86_64/8 cpu) {blead_g++}
Message ID:
201212140741.qBE7fQm2026252@m-l.org
Smoke logs available at http://m-l.org/~perl/smoke/perl/linux/blead_g++/log9e440eccb3896f01c2e619c212ed4ed156d9d910.log.gz

Automated smoke report for 5.17.7 patch 9e440eccb3896f01c2e619c212ed4ed156d9d910 v5.17.6-313-g9e440ec
zwei: Intel(R) Core(TM) i7 CPU 920 @ 2.67GHz (GenuineIntel 2668MHz) (x86_64/8 cpu)
    on        linux - 3.2.0-31-generic [debian]
    using     g++ version 4.7.2
    smoketime 1 day 13 hours 33 minutes (average 1 hour 33 minutes)

Summary: FAIL(Xm)

O = OK  F = Failure(s), extended report at the bottom
X = Failure(s) under TEST but not under harness
? = still running or test results not (yet) available
Build failures during:       - = unknown or N/A
c = Configure, m = make, M = make (after miniperl), t = make test-prep

v5.17.6-313-g9e440ec  Configuration (common) -Dcc=g++ -O
----------- ---------------------------------------------------------
O O O X O X O X 
O O O X O O O X -Accflags=-DPERL_POISON
m -  - m -  - -Duse64bitall -Accflags=-DPERL_GLOBAL_STRUCT_PRIVATE
X X O X X X O X -Dusemorebits -Accflags=-DPERL_GLOBAL_STRUCT
X X O X X X O X -Dmad
X X O X X X O X -Accflags=-DPERL_OLD_COPY_ON_WRITE
X X O X O O O X -Duseithreads
O O O X X X O X -Duseithreads -Accflags=-DPERL_POISON
m -  - m -  - -Duseithreads -Duse64bitall -Accflags=-DPERL_GLOBAL_STRUCT_PRIVATE
O O O X X X O X -Duseithreads -Dusemorebits -Accflags=-DPERL_GLOBAL_STRUCT
O O O X O O O X -Duseithreads -Dmad
X X O X X X O X -Duseithreads -Accflags=-DPERL_OLD_COPY_ON_WRITE
| | | | | +- LC_ALL = en_US.utf8 -DDEBUGGING
| | | | +--- PERLIO = perlio -DDEBUGGING
| | | +----- PERLIO = stdio  -DDEBUGGING
| | +------- LC_ALL = en_US.utf8
| +--------- PERLIO = perlio
+----------- PERLIO = stdio 

Locally applied patches:
    uncommitted-changes
    SMOKE9e440eccb3896f01c2e619c212ed4ed156d9d910

Failures: (common-args) -Dcc=g++ -O
[en_US.utf8] 
[en_US.utf8] -Accflags=-DPERL_POISON
[en_US.utf8] -DDEBUGGING -Accflags=-DPERL_POISON
[en_US.utf8] -Duseithreads -Accflags=-DPERL_POISON
[en_US.utf8] -Duseithreads -Dusemorebits -Accflags=-DPERL_GLOBAL_STRUCT
[en_US.utf8] -Duseithreads -Dmad
[en_US.utf8] -DDEBUGGING -Duseithreads -Dmad
Inconsistent test results (between TEST and harness):
    ../t/lib/croak.t........................ .................................................. FAILED at test 32
    ../t/op/lex.t........................... ..................................................... FAILED at test 5

[perlio] -DDEBUGGING
[stdio] -Dmad
[stdio] -DDEBUGGING -Dmad
[stdio] -Duseithreads
Inconsistent test results (between TEST and harness):
    ../ext/File-DosGlob/t/DosGlob.t......... ................................... FAILED at test 21

[en_US.utf8] -DDEBUGGING
[en_US.utf8] -Duseithreads
Inconsistent test results (between TEST and harness):
    ../t/comp/require.t..................... ............................................... FAILED at test 47
    ../t/lib/croak.t........................ .................................................. FAILED at test 32
    ../t/op/lex.t........................... ..................................................... FAILED at test 5

[stdio] -Dusemorebits -Accflags=-DPERL_GLOBAL_STRUCT
Inconsistent test results (between TEST and harness):
    ../lib/Benchmark.t...................... ................................................ FAILED at test 15

[perlio] -Dusemorebits -Accflags=-DPERL_GLOBAL_STRUCT
[perlio] -Duseithreads
Inconsistent test results (between TEST and harness):
    ../t/comp/require.t..................... ............................................... FAILED at test 47

[en_US.utf8] -Dusemorebits -Accflags=-DPERL_GLOBAL_STRUCT
[en_US.utf8] -Dmad
[en_US.utf8] -DDEBUGGING -Dmad
Inconsistent test results (between TEST and harness):
    ../t/comp/require.t..................... ............................................... FAILED at test 47
    ../t/lib/croak.t........................ .................................................. FAILED at test 32
    ../t/op/lex.t........................... ..................................................... FAILED at test 5
    ../ext/File-DosGlob/t/DosGlob.t......... ................................... FAILED at test 21

[stdio] -DDEBUGGING -Dusemorebits -Accflags=-DPERL_GLOBAL_STRUCT
Inconsistent test results (between TEST and harness):
    ../t/cpan/Module-Build/t/test_type.t.... ................................ FAILED--non-zero wait status: 139
    ../t/cpan/ExtUtils-MakeMaker/t/basic.t.. .............................. FAILED at test 23
    ../t/cpan/IO-Compress/t/001zlib-generic-rawdeflate.t ................. FAILED--non-zero wait status: 139
    ../t/cpan/Module-Build/t/write_default_maniskip.t .................... FAILED--non-zero wait status: 139
    ../t/cpan/Module-Build/t/basic.t........ .................................... FAILED--non-zero wait status: 139
    ../t/cpan/IO-Compress/t/002any-rawdeflate.t .......................... FAILED--non-zero wait status: 139
    ../t/cpan/IO-Compress/t/107multi-bzip2.t ............................. FAILED--non-zero wait status: 139
    ../t/cpan/Module-Build/t/mymeta.t....... ................................... FAILED--non-zero wait status: 139
    ../t/cpan/DB_File/t/db-hash.t........... ....................................... FAILED--non-zero wait status: 139
    ../t/cpan/IO-Compress/t/108anyunc-gzip.t ............................. FAILED--non-zero wait status: 139
    ../t/cpan/Module-Build/t/test_types.t... ............................... FAILED--non-zero wait status: 139
    ../ext/File-Glob/t/rt114984.t........... ..................................... FAILED--non-zero wait status: 139
    ../t/cpan/Test-Harness/t/testargs.t..... ................................. FAILED--non-zero wait status: 139
    ../ext/File-Glob/t/global.t............. ....................................... FAILED--non-zero wait status: 139
    ../t/cpan/Test-Harness/t/proverun.t..... ................................. FAILED--non-zero wait status: 139
    ../t/cpan/Test-Harness/t/prove.t........ .................................... FAILED--non-zero wait status: 139
    ../t/cpan/CPANPLUS/t/02_CPANPLUS-Internals.t ......................... FAILED--non-zero wait status: 139
    ../t/cpan/IO-Compress/t/001zlib-generic-zip.t ........................ FAILED--non-zero wait status: 139
    ../t/cpan/CPANPLUS/t/07_CPANPLUS-Internals-Extract.t ................. FAILED--non-zero wait status: 139
    ../t/cpan/CPANPLUS/t/04_CPANPLUS-Module.t ............................ FAILED--non-zero wait status: 139
    ../t/cpan/Module-Build/t/metadata.t..... ................................. FAILED--non-zero wait status: 139
    ../t/cpan/CPANPLUS/t/09_CPANPLUS-Internals-Search.t .................. FAILED--non-zero wait status: 139
    ../t/cpan/CPANPLUS/t/06_CPANPLUS-Internals-Constants.t ............... FAILED--non-zero wait status: 139
    ../ext/Pod-Html/t/cache.t............... ......................................... FAILED--non-zero wait status: 139
    ../t/cpan/Module-Build/t/properties/license.t ........................ FAILED--non-zero wait status: 139
    ../t/cpan/CPANPLUS/t/19_CPANPLUS-Dist.t. .............................. FAILED--non-zero wait status: 139
    ../t/dist/B-Deparse/t/core.t............ ........................................ FAILED--non-zero wait status: 139
    ../t/cpan/IO-Compress/t/102tied-bzip2.t. .............................. FAILED--non-zero wait status: 139
    ../t/cpan/Archive-Tar/t/03_file.t....... ................................... FAILED--non-zero wait status: 139
    ../t/cpan/CPANPLUS/t/03_CPANPLUS-Internals-Source.t .................. FAILED--non-zero wait status: 139
    ../t/cpan/CPANPLUS/t/15_CPANPLUS-Shell.t ............................. FAILED--non-zero wait status: 139
    ../t/cpan/Module-Build/t/properties/requires.t ....................... FAILED--non-zero wait status: 139
    ../lib/DBM_Filter/t/01error.t........... ..................................... FAILED--non-zero wait status: 139
    ../t/cpan/CPANPLUS/t/08_CPANPLUS-Backend.t ........................... FAILED--non-zero wait status: 139
    ../t/cpan/Module-Build/t/properties/needs_compiler.t ................. FAILED--non-zero wait status: 139
    ../t/cpan/IO-Compress/t/102tied-rawdeflate.t ......................... FAILED--non-zero wait status: 139
    ../t/cpan/IO-Compress/t/104destroy-bzip2.t ........................... FAILED--non-zero wait status: 139
    ../t/cpan/CPANPLUS/t/05_CPANPLUS-Internals-Fetch.t ................... FAILED--non-zero wait status: 139
    ../t/cpan/Archive-Tar/t/05_iter.t....... ................................... FAILED--non-zero wait status: 139
    ../t/cpan/Module-Build/t/properties/dist_suffix.t .................... FAILED--non-zero wait status: 139
    ../t/cpan/Module-Build/t/metadata2.t.... ................................ FAILED--non-zero wait status: 139
    ../t/cpan/Module-Build/t/actions/installdeps.t ....................... FAILED--non-zero wait status: 139
    ../t/cpan/Module-Build/t/runthrough.t... ............................... FAILED at test 13
    ../ext/File-Glob/t/case.t............... ......................................... FAILED--non-zero wait status: 139
    ../t/cpan/ExtUtils-MakeMaker/t/revision.t ............................ FAILED--non-zero wait status: 139
    ../t/cpan/IO-Compress/t/108anyunc-deflate.t .......................... FAILED--non-zero wait status: 139
    ../t/cpan/IO-Compress/t/105oneshot-zip-only.t ........................ FAILED--non-zero wait status: 139
    ../t/cpan/Module-Build/t/compat.t....... ................................... FAILED at test 4
    ../t/cpan/Module-Build/t/sample.t....... ................................... FAILED--non-zero wait status: 139
    ../t/cpan/Module-Build/t/new_from_context.t .......................... FAILED--non-zero wait status: 139
    ../t/cpan/Module-Build/t/properties/module_name.t .................... FAILED--non-zero wait status: 139
    ../t/cpan/ExtUtils-MakeMaker/t/maketext_filter.t ..................... FAILED--non-zero wait status: 139
    ../t/cpan/Test-Harness/t/state.t........ .................................... FAILED--non-zero wait status: 139
    ../t/cpan/IO-Compress/t/010examples-bzip2.t .......................... FAILED at test 2
    ../t/cpan/IO-Compress/t/cz-03zlib-v1.t.. .............................. FAILED--non-zero wait status: 139
    ../t/cpan/Test-Harness/t/proveenv.t..... ................................. FAILED--non-zero wait status: 139
    ../t/cpan/ExtUtils-MakeMaker/t/cd.t..... ................................. FAILED--non-zero wait status: 139
    ../t/cpan/Module-Build/t/extend.t....... ................................... FAILED--non-zero wait status: 139
    ../t/cpan/CPANPLUS-Dist-Build/t/02_CPANPLUS-Dist-Build.t ............. FAILED at test 5
    ../t/cpan/Module-Build/t/actions/manifest_skip.t ..................... FAILED--non-zero wait status: 139
    ../t/cpan/CPANPLUS/t/40_CPANPLUS-Internals-Report.t .................. FAILED--non-zero wait status: 139
    ../t/cpan/Module-Build/t/parents.t...... .................................. FAILED--non-zero wait status: 139
    ../t/cpan/Module-Build/t/notes.t........ .................................... FAILED--non-zero wait status: 139
    ../t/dist/IO/t/io_dir.t................. ............................................. FAILED--non-zero wait status: 139
    ../t/cpan/Module-Build/t/bundle_inc.t... ............................... FAILED--non-zero wait status: 139
    ../ext/File-Glob/t/basic.t.............. ........................................ FAILED--non-zero wait status: 139
    ../t/cpan/Module-Build/t/versions.t..... ................................. FAILED--non-zero wait status: 139
    ../t/cpan/Module-Build/t/install.t...... .................................. FAILED--non-zero wait status: 139
    ../t/cpan/ExtUtils-MakeMaker/t/00compile.t ........................... FAILED--non-zero wait status: 139
    ../t/cpan/Module-Build/t/debug.t........ .................................... FAILED--non-zero wait status: 139
    ../t/op/svleak.t........................ .................................................. FAILED--non-zero wait status: 139
    ../t/cpan/Module-Build/t/install_extra_target.t ...................... FAILED--non-zero wait status: 139
    ../t/cpan/IO-Compress/t/105oneshot-zip-bzip2-only.t .................. FAILED--non-zero wait status: 139
    ../lib/DBM_Filter/t/02core.t............ ...................................... FAILED--non-zero wait status: 139
    ../t/cpan/IO-Compress/t/110encode-bzip2.t ............................ FAILED--non-zero wait status: 139
    ../t/cpan/Module-Build/t/xs.t........... ....................................... FAILED--non-zero wait status: 139
    ../t/cpan/IO-Compress/t/cz-14gzopen.t... ............................... FAILED--non-zero wait status: 139
    ../t/cpan/Compress-Raw-Zlib/t/07bufsize.t ............................ FAILED--non-zero wait status: 139
    ../ext/DynaLoader/t/DynaLoader.t........ .................................. FAILED--non-zero wait status: 139
    ../t/cpan/Module-Build/t/properties/release_status.t ................. FAILED--non-zero wait status: 139
    ../t/cpan/Module-Build/t/destinations.t. .............................. FAILED--non-zero wait status: 139
    ../t/op/coresubs.t...................... ................................................ FAILED--non-zero wait status: 139
    ../t/cpan/IO-Compress/t/cz-05examples.t. .............................. FAILED at test 2
    ../ext/File-Glob/t/taint.t.............. ........................................ FAILED--non-zero wait status: 139
    ../ext/NDBM_File/t/ndbm.t............... ......................................... FAILED--non-zero wait status: 139
    ../t/cpan/Module-Build/t/script_dist.t.. .............................. FAILED--non-zero wait status: 139
    ../lib/h2xs.t........................... ..................................................... FAILED at test 3
    ../t/cpan/Module-Build/t/perl_mb_opt.t.. .............................. FAILED--non-zero wait status: 139
    ../t/cpan/IO-Compress/t/107multi-rawdeflate.t ........................ FAILED--non-zero wait status: 139
    ../t/cpan/Archive-Tar/t/02_methods.t.... ................................ FAILED--non-zero wait status: 139
    ../t/op/taint.t......................... ................................................... FAILED--non-zero wait status: 139
    ../t/cpan/Archive-Tar/t/06_error.t...... .................................. FAILED--non-zero wait status: 139
    ../t/cpan/IO-Zlib/t/external.t.......... ...................................... FAILED--non-zero wait status: 139
    ../t/cpan/CPANPLUS/t/01_CPANPLUS-Configure.t ......................... FAILED--non-zero wait status: 139
    ../lib/ExtUtils/t/Embed.t............... ......................................... FAILED--non-zero wait status: 139
    ../t/cpan/IO-Compress/t/010examples-zlib.t ........................... FAILED at test 2
    ../t/op/coreamp.t....................... ................................................. FAILED--non-zero wait status: 139
    ../lib/DBM_Filter/t/encode.t............ ...................................... FAILED--non-zero wait status: 139
    ../ext/SDBM_File/t/sdbm.t............... ......................................... FAILED--non-zero wait status: 139
    ../t/cpan/Module-Build/t/tilde.t........ .................................... FAILED--non-zero wait status: 139
    ../t/cpan/Module-Build/t/help.t......... ..................................... FAILED--non-zero wait status: 139
    ../t/cpan/IO-Compress/t/104destroy-deflate.t ......................... FAILED--non-zero wait status: 139
    ../t/cpan/Module-Build/t/ppm.t.......... ...................................... FAILED--non-zero wait status: 139
    ../ext/File-DosGlob/t/DosGlob.t......... ................................... FAILED at test 21
    ../lib/warnings.t....................... ................................................. FAILED--non-zero wait status: 139
    ../t/dist/XSLoader/t/XSLoader.t......... ..................................... FAILED--non-zero wait status: 139
    ../t/cpan/Module-Build/t/use_tap_harness.t ........................... FAILED--non-zero wait status: 139
    ../t/cpan/Perl-OSType/t/00-compile.t.... ................................ FAILED--non-zero wait status: 139
    ../t/dist/B-Deparse/t/deparse.t......... ..................................... FAILED--non-zero wait status: 139
    ../t/cpan/Module-Build/t/test_file_exts.t ............................ FAILED--non-zero wait status: 139
    ../t/cpan/Test-Harness/t/proverc.t...... .................................. FAILED--non-zero wait status: 139
    ../t/cpan/Archive-Tar/t/04_resolved_issues.t ......................... FAILED--non-zero wait status: 139
    ../t/cpan/CPANPLUS/t/20_CPANPLUS-Dist-MM.t ........................... FAILED--non-zero wait status: 139
    ../lib/DirHandle.t...................... ................................................ FAILED--non-zero wait status: 139
    ../t/cpan/Module-Build/t/ext.t.......... ...................................... FAILED--non-zero wait status: 139
    ../t/cpan/Archive-Extract/t/01_Archive-Extract.t ..................... FAILED--non-zero wait status: 139
    ../t/cpan/IO-Compress/t/001zlib-generic-gzip.t ....................... FAILED--non-zero wait status: 139
    ../t/cpan/IO-Compress/t/100generic-rawdeflate.t ...................... FAILED--non-zero wait status: 139
    ../lib/overload.t....................... ................................................. FAILED--non-zero wait status: 139
    ../t/op/tie_fetch_count.t............... ......................................... FAILED--non-zero wait status: 139
    ../lib/strict.t......................... ................................................... FAILED--non-zero wait status: 139
    ../t/cpan/Module-Build/t/PL_files.t..... ................................. FAILED--non-zero wait status: 139
    ../t/cpan/Module-Build/t/compat/exit.t.. .............................. FAILED at test 1
    ../t/cpan/CPANPLUS/t/25_CPANPLUS.t...... .................................. FAILED--non-zero wait status: 139
    ../t/cpan/Module-Build/t/add_property.t. .............................. FAILED--non-zero wait status: 139
    ../t/cpan/IO-Compress/t/cz-06gzsetp.t... ............................... FAILED--non-zero wait status: 139
    ../t/cpan/Module-Build/t/resume.t....... ................................... FAILED--non-zero wait status: 139
    ../lib/charnames.t...................... ................................................ FAILED--non-zero wait status: 139
    ../lib/DBM_Filter/t/null.t.............. ........................................ FAILED--non-zero wait status: 139
    ../t/cpan/Module-Build/t/00-compile.t... ............................... FAILED at test 1
    ../t/cpan/IO-Compress/t/105oneshot-bzip2.t ........................... FAILED--non-zero wait status: 139
    ../t/cpan/Module-Build/t/properties/share_dir.t ...................... FAILED--non-zero wait status: 139
    ../t/cpan/CPANPLUS/t/10_CPANPLUS-Error.t ............................. FAILED--non-zero wait status: 139
    ../t/cpan/Test-Harness/t/000-load.t..... ................................. FAILED--non-zero wait status: 139
    ../t/cpan/Test-Harness/t/state_results.t ............................. FAILED--non-zero wait status: 139
    ../t/cpan/CPANPLUS/t/00_CPANPLUS-Internals-Utils.t ................... FAILED--non-zero wait status: 139
    ../t/cpan/CPANPLUS/t/21_CPANPLUS-Dist-No-Build.t ..................... FAILED--non-zero wait status: 139
    ../t/cpan/IO-Compress/t/105oneshot-rawdeflate.t ...................... FAILED--non-zero wait status: 139
    ../lib/DBM_Filter/t/utf8.t.............. ........................................ FAILED--non-zero wait status: 139
    ../t/cpan/Compress-Raw-Zlib/t/02zlib.t.. .............................. FAILED--non-zero wait status: 139
    ../ext/GDBM_File/t/gdbm.t............... ......................................... FAILED--non-zero wait status: 139
    ../t/cpan/CPANPLUS/t/30_CPANPLUS-Internals-Selfupdate.t .............. FAILED--non-zero wait status: 139
    ../t/cpan/Archive-Tar/t/01_use.t........ .................................... FAILED--non-zero wait status: 139
    ../lib/DBM_Filter/t/int32.t............. ....................................... FAILED--non-zero wait status: 139
    ../t/cpan/Module-Build/t/files.t........ .................................... FAILED--non-zero wait status: 139
    ../t/cpan/IO-Compress/t/004gziphdr.t.... ................................ FAILED--non-zero wait status: 139
    ../t/cpan/CPANPLUS-Dist-Build/t/01_CPANPLUS-Dist-Build-Constants.t ... FAILED--non-zero wait status: 139
    ../t/cpan/Module-Build/t/manifypods.t... ............................... FAILED--non-zero wait status: 139

[perlio] -DDEBUGGING -Dusemorebits -Accflags=-DPERL_GLOBAL_STRUCT
Inconsistent test results (between TEST and harness):
    ../t/cpan/Module-Build/t/test_type.t.... ................................ FAILED--non-zero wait status: 139
    ../t/cpan/ExtUtils-MakeMaker/t/basic.t.. .............................. FAILED at test 23
    ../t/cpan/IO-Compress/t/001zlib-generic-rawdeflate.t ................. FAILED--non-zero wait status: 139
    ../t/cpan/Module-Build/t/write_default_maniskip.t .................... FAILED--non-zero wait status: 139
    ../t/cpan/Module-Build/t/basic.t........ .................................... FAILED--non-zero wait status: 139
    ../t/cpan/IO-Compress/t/002any-rawdeflate.t .......................... FAILED--non-zero wait status: 139
    ../t/cpan/IO-Compress/t/107multi-bzip2.t ............................. FAILED--non-zero wait status: 139
    ../t/cpan/Module-Build/t/mymeta.t....... ................................... FAILED--non-zero wait status: 139
    ../t/cpan/DB_File/t/db-hash.t........... ....................................... FAILED--non-zero wait status: 139
    ../t/cpan/IO-Compress/t/108anyunc-gzip.t ............................. FAILED--non-zero wait status: 139
    ../t/comp/require.t..................... ............................................... FAILED at test 47
    ../t/cpan/IO-Compress/t/104destroy-gzip.t ............................ FAILED--non-zero wait status: 139
    ../t/cpan/Module-Build/t/test_types.t... ............................... FAILED--non-zero wait status: 139
    ../t/cpan/IO-Compress/t/005defhdr.t..... ................................. FAILED--non-zero wait status: 139
    ../ext/File-Glob/t/rt114984.t........... ..................................... FAILED--non-zero wait status: 139
    ../t/cpan/Test-Harness/t/testargs.t..... ................................. FAILED--non-zero wait status: 139
    ../ext/File-Glob/t/global.t............. ....................................... FAILED--non-zero wait status: 139
    ../t/cpan/Test-Harness/t/proverun.t..... ................................. FAILED--non-zero wait status: 139
    ../t/cpan/Test-Harness/t/prove.t........ .................................... FAILED--non-zero wait status: 139
    ../t/cpan/CPANPLUS/t/02_CPANPLUS-Internals.t ......................... FAILED--non-zero wait status: 139
    ../t/cpan/IO-Compress/t/001zlib-generic-zip.t ........................ FAILED--non-zero wait status: 139
    ../t/cpan/CPANPLUS/t/07_CPANPLUS-Internals-Extract.t ................. FAILED--non-zero wait status: 139
    ../t/cpan/CPANPLUS/t/04_CPANPLUS-Module.t ............................ FAILED--non-zero wait status: 139
    ../t/cpan/Module-Build/t/metadata.t..... ................................. FAILED--non-zero wait status: 139
    ../t/cpan/IO-Compress/t/108anyunc-bzip2.t ............................ FAILED--non-zero wait status: 139
    ../t/cpan/CPANPLUS/t/09_CPANPLUS-Internals-Search.t .................. FAILED--non-zero wait status: 139
    ../t/cpan/CPANPLUS/t/06_CPANPLUS-Internals-Constants.t ............... FAILED--non-zero wait status: 139
    ../ext/Pod-Html/t/cache.t............... ......................................... FAILED--non-zero wait status: 139
    ../t/cpan/Module-Build/t/properties/license.t ........................ FAILED--non-zero wait status: 139
    ../t/cpan/CPANPLUS/t/19_CPANPLUS-Dist.t. .............................. FAILED--non-zero wait status: 139
    ../t/dist/B-Deparse/t/core.t............ ........................................ FAILED--non-zero wait status: 139
    ../t/dist/ExtUtils-Command/t/eu_command.t ............................ FAILED--non-zero wait status: 139
    ../t/cpan/IO-Compress/t/102tied-bzip2.t. .............................. FAILED--non-zero wait status: 139
    ../t/cpan/Archive-Tar/t/03_file.t....... ................................... FAILED--non-zero wait status: 139
    ../t/cpan/CPANPLUS/t/03_CPANPLUS-Internals-Source.t .................. FAILED--non-zero wait status: 139
    ../t/cpan/CPANPLUS/t/15_CPANPLUS-Shell.t ............................. FAILED--non-zero wait status: 139
    ../t/cpan/Module-Build/t/properties/requires.t ....................... FAILED--non-zero wait status: 139
    ../t/cpan/IO-Compress/t/107multi-deflate.t ........................... FAILED--non-zero wait status: 139
    ../lib/DBM_Filter/t/01error.t........... ..................................... FAILED--non-zero wait status: 139
    ../t/cpan/CPANPLUS/t/08_CPANPLUS-Backend.t ........................... FAILED--non-zero wait status: 139
    ../t/cpan/Module-Build/t/properties/needs_compiler.t ................. FAILED--non-zero wait status: 139
    ../t/cpan/IO-Compress/t/102tied-rawdeflate.t ......................... FAILED--non-zero wait status: 139
    ../t/cpan/IO-Compress/t/104destroy-bzip2.t ........................... FAILED--non-zero wait status: 139
    ../t/cpan/IO-Compress/t/103newtied-gzip.t ............................ FAILED--non-zero wait status: 139
    ../t/cpan/CPANPLUS/t/05_CPANPLUS-Internals-Fetch.t ................... FAILED--non-zero wait status: 139
    ../t/cpan/Archive-Tar/t/05_iter.t....... ................................... FAILED--non-zero wait status: 139
    ../t/cpan/IO-Compress/t/006zip.t........ .................................... FAILED--non-zero wait status: 139
    ../t/cpan/IO-Compress/t/105oneshot-gzip.t ............................ FAILED--non-zero wait status: 139
    ../t/cpan/Module-Build/t/properties/dist_suffix.t .................... FAILED--non-zero wait status: 139
    ../t/cpan/Module-Build/t/metadata2.t.... ................................ FAILED--non-zero wait status: 139
    ../t/cpan/Module-Build/t/actions/installdeps.t ....................... FAILED--non-zero wait status: 139
    ../t/cpan/Module-Build/t/runthrough.t... ............................... FAILED at test 13
    ../ext/File-Glob/t/case.t............... ......................................... FAILED--non-zero wait status: 139
    ../t/cpan/ExtUtils-MakeMaker/t/revision.t ............................ FAILED--non-zero wait status: 139
    ../t/cpan/IO-Compress/t/108anyunc-deflate.t .......................... FAILED--non-zero wait status: 139
    ../t/cpan/IO-Compress/t/105oneshot-zip-only.t ........................ FAILED--non-zero wait status: 139
    ../t/cpan/Module-Build/t/compat.t....... ................................... FAILED at test 4
    ../t/cpan/Module-Build/t/sample.t....... ................................... FAILED--non-zero wait status: 139
    ../t/cpan/Module-Build/t/new_from_context.t .......................... FAILED--non-zero wait status: 139
    ../t/cpan/Module-Build/t/properties/module_name.t .................... FAILED--non-zero wait status: 139
    ../t/cpan/ExtUtils-MakeMaker/t/maketext_filter.t ..................... FAILED--non-zero wait status: 139
    ../t/cpan/IO-Compress/t/104destroy-zip.t ............................. FAILED--non-zero wait status: 139
    ../t/cpan/Test-Harness/t/state.t........ .................................... FAILED--non-zero wait status: 139
    ../t/cpan/IO-Compress/t/010examples-bzip2.t .......................... FAILED at test 2
    ../t/cpan/IO-Compress/t/cz-03zlib-v1.t.. .............................. FAILED--non-zero wait status: 139
    ../t/cpan/ExtUtils-MakeMaker/t/cd.t..... ................................. FAILED--non-zero wait status: 139
    ../t/cpan/Module-Build/t/extend.t....... ................................... FAILED--non-zero wait status: 139
    ../t/cpan/CPANPLUS-Dist-Build/t/02_CPANPLUS-Dist-Build.t ............. FAILED at test 5
    ../t/cpan/Module-Build/t/actions/manifest_skip.t ..................... FAILED--non-zero wait status: 139
    ../t/cpan/CPANPLUS/t/40_CPANPLUS-Internals-Report.t .................. FAILED--non-zero wait status: 139
    ../t/cpan/Module-Build/t/parents.t...... .................................. FAILED--non-zero wait status: 139
    ../t/cpan/Module-Build/t/notes.t........ .................................... FAILED--non-zero wait status: 139
    ../t/dist/IO/t/io_dir.t................. ............................................. FAILED--non-zero wait status: 139
    ../t/cpan/Module-Build/t/bundle_inc.t... ............................... FAILED--non-zero wait status: 139
    ../ext/File-Glob/t/basic.t.............. ........................................ FAILED--non-zero wait status: 139
    ../t/cpan/Module-Build/t/versions.t..... ................................. FAILED--non-zero wait status: 139
    ../t/cpan/Module-Build/t/install.t...... .................................. FAILED--non-zero wait status: 139
    ../t/cpan/ExtUtils-MakeMaker/t/00compile.t ........................... FAILED--non-zero wait status: 139
    ../t/cpan/IO-Zlib/t/getline.t........... ....................................... FAILED--non-zero wait status: 139
    ../t/cpan/Module-Build/t/debug.t........ .................................... FAILED--non-zero wait status: 139
    ../t/op/svleak.t........................ .................................................. FAILED--non-zero wait status: 139
    ../t/cpan/Module-Build/t/install_extra_target.t ...................... FAILED--non-zero wait status: 139
    ../lib/DBM_Filter/t/compress.t.......... .................................... FAILED--non-zero wait status: 139
    ../t/cpan/IO-Compress/t/105oneshot-zip-bzip2-only.t .................. FAILED--non-zero wait status: 139
    ../lib/DBM_Filter/t/02core.t............ ...................................... FAILED--non-zero wait status: 139
    ../t/cpan/IO-Compress/t/110encode-bzip2.t ............................ FAILED--non-zero wait status: 139
    ../t/cpan/IO-Compress/t/101truncate-bzip2.t .......................... FAILED--non-zero wait status: 139
    ../t/cpan/Module-Build/t/xs.t........... ....................................... FAILED--non-zero wait status: 139
    ../t/cpan/IO-Compress/t/cz-14gzopen.t... ............................... FAILED--non-zero wait status: 139
    ../t/cpan/Compress-Raw-Zlib/t/07bufsize.t ............................ FAILED--non-zero wait status: 139
    ../ext/DynaLoader/t/DynaLoader.t........ .................................. FAILED--non-zero wait status: 139
    ../t/cpan/IO-Compress/t/050interop-gzip.t ............................ FAILED--non-zero wait status: 139
    ../t/cpan/Module-Build/t/properties/release_status.t ................. FAILED--non-zero wait status: 139
    ../t/cpan/Module-Build/t/destinations.t. .............................. FAILED--non-zero wait status: 139
    ../t/op/coresubs.t...................... ................................................ FAILED--non-zero wait status: 139
    ../t/cpan/IO-Compress/t/cz-05examples.t. .............................. FAILED at test 2
    ../ext/File-Glob/t/taint.t.............. ........................................ FAILED--non-zero wait status: 139
    ../ext/NDBM_File/t/ndbm.t............... ......................................... FAILED--non-zero wait status: 139
    ../t/cpan/Module-Build/t/script_dist.t.. .............................. FAILED--non-zero wait status: 139
    ../lib/h2xs.t........................... ..................................................... FAILED at test 3
    ../t/cpan/IO-Zlib/t/large.t............. ......................................... FAILED--non-zero wait status: 139
    ../t/cpan/Module-Build/t/perl_mb_opt.t.. .............................. FAILED--non-zero wait status: 139
    ../t/cpan/IO-Compress/t/101truncate-gzip.t ........................... FAILED--non-zero wait status: 139
    ../t/cpan/Archive-Tar/t/02_methods.t.... ................................ FAILED--non-zero wait status: 139
    ../t/op/taint.t......................... ................................................... FAILED--non-zero wait status: 139
    ../t/cpan/Archive-Tar/t/06_error.t...... .................................. FAILED--non-zero wait status: 139
    ../t/cpan/IO-Zlib/t/external.t.......... ...................................... FAILED--non-zero wait status: 139
    ../t/cpan/CPANPLUS/t/01_CPANPLUS-Configure.t ......................... FAILED--non-zero wait status: 139
    ../lib/ExtUtils/t/Embed.t............... ......................................... FAILED--non-zero wait status: 139
    ../t/cpan/IO-Compress/t/010examples-zlib.t ........................... FAILED at test 2
    ../t/op/coreamp.t....................... ................................................. FAILED--non-zero wait status: 139
    ../lib/DBM_Filter/t/encode.t............ ...................................... FAILED--non-zero wait status: 139
    ../ext/SDBM_File/t/sdbm.t............... ......................................... FAILED--non-zero wait status: 139
    ../t/cpan/Module-Build/t/tilde.t........ .................................... FAILED--non-zero wait status: 139
    ../t/cpan/Module-Build/t/help.t......... ..................................... FAILED--non-zero wait status: 139
    ../t/cpan/Module-Build/t/ppm.t.......... ...................................... FAILED--non-zero wait status: 139
    ../t/cpan/IO-Compress/t/002any-zip.t.... ................................ FAILED--non-zero wait status: 139
    ../t/cpan/IO-Compress/t/101truncate-deflate.t ........................ FAILED--non-zero wait status: 139
    ../ext/File-DosGlob/t/DosGlob.t......... ................................... FAILED at test 21
    ../t/cpan/IO-Compress/t/107multi-gzip.t. .............................. FAILED--non-zero wait status: 139
    ../lib/warnings.t....................... ................................................. FAILED--non-zero wait status: 139
    ../t/cpan/Module-Build/t/use_tap_harness.t ........................... FAILED--non-zero wait status: 139
    ../t/cpan/IO-Compress/t/107multi-zip.t.. .............................. FAILED--non-zero wait status: 139
    ../t/dist/B-Deparse/t/deparse.t......... ..................................... FAILED--non-zero wait status: 139
    ../t/cpan/Module-Build/t/test_file_exts.t ............................ FAILED--non-zero wait status: 139
    ../t/cpan/Test-Harness/t/proverc.t...... .................................. FAILED--non-zero wait status: 139
    ../t/cpan/Archive-Tar/t/04_resolved_issues.t ......................... FAILED--non-zero wait status: 139
    ../t/cpan/CPANPLUS/t/20_CPANPLUS-Dist-MM.t ........................... FAILED--non-zero wait status: 139
    ../lib/DirHandle.t...................... ................................................ FAILED--non-zero wait status: 139
    ../t/cpan/DB_File/t/db-btree.t.......... ...................................... FAILED--non-zero wait status: 139
    ../t/cpan/Module-Build/t/ext.t.......... ...................................... FAILED--non-zero wait status: 139
    ../t/cpan/Archive-Extract/t/01_Archive-Extract.t ..................... FAILED--non-zero wait status: 139
    ../t/cpan/IO-Compress/t/001zlib-generic-gzip.t ....................... FAILED--non-zero wait status: 139
    ../t/cpan/IO-Compress/t/100generic-rawdeflate.t ...................... FAILED--non-zero wait status: 139
    ../lib/overload.t....................... ................................................. FAILED--non-zero wait status: 139
    ../t/op/tie_fetch_count.t............... ......................................... FAILED--non-zero wait status: 139
    ../lib/strict.t......................... ................................................... FAILED--non-zero wait status: 139
    ../t/cpan/Module-Build/t/PL_files.t..... ................................. FAILED--non-zero wait status: 139
    ../t/cpan/Module-Build/t/compat/exit.t.. .............................. FAILED at test 1
    ../t/cpan/IO-Compress/t/108anyunc-rawdeflate.t ....................... FAILED--non-zero wait status: 139
    ../t/cpan/CPANPLUS/t/25_CPANPLUS.t...... .................................. FAILED--non-zero wait status: 139
    ../t/cpan/Module-Build/t/add_property.t. .............................. FAILED--non-zero wait status: 139
    ../t/cpan/IO-Compress/t/cz-06gzsetp.t... ............................... FAILED--non-zero wait status: 139
    ../t/cpan/Module-Build/t/resume.t....... ................................... FAILED--non-zero wait status: 139
    ../lib/charnames.t...................... ................................................ FAILED--non-zero wait status: 139
    ../lib/DBM_Filter/t/null.t.............. ........................................ FAILED--non-zero wait status: 139
    ../t/cpan/Pod-Parser/t/pod/selfcheck.t.. .............................. FAILED--non-zero wait status: 139
    ../t/cpan/Module-Build/t/00-compile.t... ............................... FAILED at test 1
    ../t/cpan/IO-Compress/t/105oneshot-bzip2.t ........................... FAILED--non-zero wait status: 139
    ../t/cpan/Module-Build/t/properties/share_dir.t ...................... FAILED--non-zero wait status: 139
    ../t/cpan/CPANPLUS/t/10_CPANPLUS-Error.t ............................. FAILED--non-zero wait status: 139
    ../t/cpan/IO-Compress/t/101truncate-zip.t ............................ FAILED--non-zero wait status: 139
    ../t/cpan/Test-Harness/t/state_results.t ............................. FAILED--non-zero wait status: 139
    ../t/cpan/IO-Compress/t/102tied-gzip.t.. .............................. FAILED--non-zero wait status: 139
    ../t/cpan/CPANPLUS/t/00_CPANPLUS-Internals-Utils.t ................... FAILED--non-zero wait status: 139
    ../t/cpan/CPANPLUS/t/21_CPANPLUS-Dist-No-Build.t ..................... FAILED--non-zero wait status: 139
    ../t/cpan/IO-Compress/t/105oneshot-rawdeflate.t ...................... FAILED--non-zero wait status: 139
    ../lib/DBM_Filter/t/utf8.t.............. ........................................ FAILED--non-zero wait status: 139
    ../ext/GDBM_File/t/gdbm.t............... ......................................... FAILED--non-zero wait status: 139
    ../t/cpan/CPANPLUS/t/30_CPANPLUS-Internals-Selfupdate.t .............. FAILED--non-zero wait status: 139
    ../t/cpan/Archive-Tar/t/01_use.t........ .................................... FAILED--non-zero wait status: 139
    ../lib/DBM_Filter/t/int32.t............. ....................................... FAILED--non-zero wait status: 139
    ../t/cpan/Module-Build/t/files.t........ .................................... FAILED--non-zero wait status: 139
    ../t/cpan/IO-Compress/t/004gziphdr.t.... ................................ FAILED--non-zero wait status: 139
    ../t/cpan/CPANPLUS-Dist-Build/t/01_CPANPLUS-Dist-Build-Constants.t ... FAILED--non-zero wait status: 139
    ../t/cpan/Module-Build/t/manifypods.t... ............................... FAILED--non-zero wait status: 139

[en_US.utf8] -DDEBUGGING -Dusemorebits -Accflags=-DPERL_GLOBAL_STRUCT
Inconsistent test results (between TEST and harness):
    ../t/cpan/Module-Build/t/test_type.t.... ................................ FAILED--non-zero wait status: 139
    ../t/cpan/ExtUtils-MakeMaker/t/basic.t.. .............................. FAILED at test 23
    ../t/cpan/IO-Compress/t/001zlib-generic-rawdeflate.t ................. FAILED--non-zero wait status: 139
    ../t/cpan/Module-Build/t/write_default_maniskip.t .................... FAILED--non-zero wait status: 139
    ../t/cpan/Module-Build/t/basic.t........ .................................... FAILED--non-zero wait status: 139
    ../t/cpan/IO-Compress/t/002any-rawdeflate.t .......................... FAILED--non-zero wait status: 139
    ../t/cpan/IO-Compress/t/107multi-bzip2.t ............................. FAILED--non-zero wait status: 139
    ../t/cpan/Module-Build/t/mymeta.t....... ................................... FAILED--non-zero wait status: 139
    ../t/cpan/DB_File/t/db-hash.t........... ....................................... FAILED--non-zero wait status: 139
    ../t/cpan/IO-Compress/t/108anyunc-gzip.t ............................. FAILED--non-zero wait status: 139
    ../t/comp/require.t..................... ............................................... FAILED at test 47
    ../t/cpan/IO-Compress/t/104destroy-gzip.t ............................ FAILED--non-zero wait status: 139
    ../t/cpan/Module-Build/t/test_types.t... ............................... FAILED--non-zero wait status: 139
    ../t/cpan/IO-Compress/t/005defhdr.t..... ................................. FAILED--non-zero wait status: 139
    ../ext/File-Glob/t/rt114984.t........... ..................................... FAILED--non-zero wait status: 139
    ../t/cpan/IO-Zlib/t/basic.t............. ......................................... FAILED--non-zero wait status: 139
    ../t/cpan/Test-Harness/t/testargs.t..... ................................. FAILED--non-zero wait status: 139
    ../ext/File-Glob/t/global.t............. ....................................... FAILED--non-zero wait status: 139
    ../t/cpan/Test-Harness/t/proverun.t..... ................................. FAILED--non-zero wait status: 139
    ../t/cpan/Test-Harness/t/prove.t........ .................................... FAILED--non-zero wait status: 139
    ../t/cpan/IO-Compress/t/108anyunc-transparent.t ...................... FAILED--non-zero wait status: 139
    ../t/cpan/CPANPLUS/t/02_CPANPLUS-Internals.t ......................... FAILED--non-zero wait status: 139
    ../t/cpan/CPANPLUS/t/07_CPANPLUS-Internals-Extract.t ................. FAILED--non-zero wait status: 139
    ../t/cpan/CPANPLUS/t/04_CPANPLUS-Module.t ............................ FAILED--non-zero wait status: 139
    ../t/cpan/Module-Build/t/metadata.t..... ................................. FAILED--non-zero wait status: 139
    ../t/cpan/IO-Compress/t/108anyunc-bzip2.t ............................ FAILED--non-zero wait status: 139
    ../t/cpan/CPANPLUS/t/09_CPANPLUS-Internals-Search.t .................. FAILED--non-zero wait status: 139
    ../t/cpan/CPANPLUS/t/06_CPANPLUS-Internals-Constants.t ............... FAILED--non-zero wait status: 139
    ../ext/Pod-Html/t/cache.t............... ......................................... FAILED--non-zero wait status: 139
    ../t/cpan/Module-Build/t/properties/license.t ........................ FAILED--non-zero wait status: 139
    ../t/cpan/CPANPLUS/t/19_CPANPLUS-Dist.t. .............................. FAILED--non-zero wait status: 139
    ../t/dist/B-Deparse/t/core.t............ ........................................ FAILED--non-zero wait status: 139
    ../t/cpan/IO-Compress/t/102tied-bzip2.t. .............................. FAILED--non-zero wait status: 139
    ../t/lib/croak.t........................ .................................................. FAILED at test 32
    ../t/cpan/Archive-Tar/t/03_file.t....... ................................... FAILED--non-zero wait status: 139
    ../t/cpan/CPANPLUS/t/03_CPANPLUS-Internals-Source.t .................. FAILED--non-zero wait status: 139
    ../t/cpan/CPANPLUS/t/15_CPANPLUS-Shell.t ............................. FAILED--non-zero wait status: 139
    ../t/cpan/Module-Build/t/properties/requires.t ....................... FAILED--non-zero wait status: 139
    ../t/cpan/IO-Compress/t/107multi-deflate.t ........................... FAILED--non-zero wait status: 139
    ../lib/DBM_Filter/t/01error.t........... ..................................... FAILED--non-zero wait status: 139
    ../t/cpan/CPANPLUS/t/08_CPANPLUS-Backend.t ........................... FAILED--non-zero wait status: 139
    ../t/cpan/Module-Build/t/properties/needs_compiler.t ................. FAILED--non-zero wait status: 139
    ../t/cpan/IO-Compress/t/102tied-rawdeflate.t ......................... FAILED--non-zero wait status: 139
    ../t/cpan/IO-Compress/t/104destroy-bzip2.t ........................... FAILED--non-zero wait status: 139
    ../t/cpan/CPANPLUS/t/05_CPANPLUS-Internals-Fetch.t ................... FAILED--non-zero wait status: 139
    ../t/cpan/Archive-Tar/t/05_iter.t....... ................................... FAILED--non-zero wait status: 139
    ../t/cpan/IO-Compress/t/006zip.t........ .................................... FAILED--non-zero wait status: 139
    ../t/cpan/Module-Build/t/properties/dist_suffix.t .................... FAILED--non-zero wait status: 139
    ../t/cpan/Module-Build/t/metadata2.t.... ................................ FAILED--non-zero wait status: 139
    ../t/cpan/Module-Build/t/actions/installdeps.t ....................... FAILED--non-zero wait status: 139
    ../t/cpan/Test-Harness/t/perl5lib.t..... ................................. FAILED--non-zero wait status: 139
    ../t/cpan/Module-Build/t/runthrough.t... ............................... FAILED at test 13
    ../ext/File-Glob/t/case.t............... ......................................... FAILED--non-zero wait status: 139
    ../t/cpan/ExtUtils-MakeMaker/t/revision.t ............................ FAILED--non-zero wait status: 139
    ../t/cpan/IO-Compress/t/108anyunc-deflate.t .......................... FAILED--non-zero wait status: 139
    ../t/cpan/IO-Compress/t/105oneshot-zip-only.t ........................ FAILED--non-zero wait status: 139
    ../t/cpan/Module-Build/t/compat.t....... ................................... FAILED at test 4
    ../t/cpan/Module-Build/t/sample.t....... ................................... FAILED--non-zero wait status: 139
    ../t/cpan/Module-Build/t/new_from_context.t .......................... FAILED--non-zero wait status: 139
    ../t/op/lex.t........................... ..................................................... FAILED at test 5
    ../t/cpan/Module-Build/t/properties/module_name.t .................... FAILED--non-zero wait status: 139
    ../t/cpan/ExtUtils-MakeMaker/t/maketext_filter.t ..................... FAILED--non-zero wait status: 139
    ../t/cpan/Test-Harness/t/state.t........ .................................... FAILED--non-zero wait status: 139
    ../t/cpan/IO-Compress/t/010examples-bzip2.t .......................... FAILED at test 2
    ../t/cpan/IO-Compress/t/cz-03zlib-v1.t.. .............................. FAILED--non-zero wait status: 139
    ../t/cpan/Test-Harness/t/proveenv.t..... ................................. FAILED--non-zero wait status: 139
    ../t/cpan/ExtUtils-MakeMaker/t/cd.t..... ................................. FAILED--non-zero wait status: 139
    ../t/cpan/Module-Build/t/extend.t....... ................................... FAILED--non-zero wait status: 139
    ../t/cpan/CPANPLUS-Dist-Build/t/02_CPANPLUS-Dist-Build.t ............. FAILED at test 5
    ../t/cpan/Module-Build/t/actions/manifest_skip.t ..................... FAILED--non-zero wait status: 139
    ../t/cpan/CPANPLUS/t/40_CPANPLUS-Internals-Report.t .................. FAILED--non-zero wait status: 139
    ../t/cpan/Module-Build/t/parents.t...... .................................. FAILED--non-zero wait status: 139
    ../t/cpan/Module-Build/t/notes.t........ .................................... FAILED--non-zero wait status: 139
    ../t/dist/IO/t/io_dir.t................. ............................................. FAILED--non-zero wait status: 139
    ../t/cpan/Module-Build/t/bundle_inc.t... ............................... FAILED--non-zero wait status: 139
    ../ext/File-Glob/t/basic.t.............. ........................................ FAILED--non-zero wait status: 139
    ../t/cpan/Module-Build/t/versions.t..... ................................. FAILED--non-zero wait status: 139
    ../t/cpan/Module-Build/t/install.t...... .................................. FAILED--non-zero wait status: 139
    ../t/cpan/ExtUtils-MakeMaker/t/00compile.t ........................... FAILED--non-zero wait status: 139
    ../t/cpan/Module-Build/t/debug.t........ .................................... FAILED--non-zero wait status: 139
    ../t/op/svleak.t........................ .................................................. FAILED--non-zero wait status: 139
    ../t/cpan/Module-Build/t/install_extra_target.t ...................... FAILED--non-zero wait status: 139
    ../t/cpan/IO-Compress/t/105oneshot-zip-bzip2-only.t .................. FAILED--non-zero wait status: 139
    ../lib/DBM_Filter/t/02core.t............ ...................................... FAILED--non-zero wait status: 139
    ../t/cpan/IO-Compress/t/110encode-bzip2.t ............................ FAILED--non-zero wait status: 139
    ../t/cpan/IO-Compress/t/101truncate-bzip2.t .......................... FAILED--non-zero wait status: 139
    ../t/cpan/Module-Build/t/xs.t........... ....................................... FAILED--non-zero wait status: 139
    ../t/cpan/IO-Compress/t/cz-14gzopen.t... ............................... FAILED--non-zero wait status: 139
    ../t/cpan/Compress-Raw-Zlib/t/07bufsize.t ............................ FAILED--non-zero wait status: 139
    ../ext/DynaLoader/t/DynaLoader.t........ .................................. FAILED--non-zero wait status: 139
    ../t/cpan/IO-Compress/t/050interop-gzip.t ............................ FAILED--non-zero wait status: 139
    ../t/cpan/Module-Build/t/properties/release_status.t ................. FAILED--non-zero wait status: 139
    ../t/cpan/Module-Build/t/destinations.t. .............................. FAILED--non-zero wait status: 139
    ../t/op/coresubs.t...................... ................................................ FAILED--non-zero wait status: 139
    ../t/cpan/IO-Compress/t/cz-05examples.t. .............................. FAILED at test 2
    ../ext/File-Glob/t/taint.t.............. ........................................ FAILED--non-zero wait status: 139
    ../ext/NDBM_File/t/ndbm.t............... ......................................... FAILED--non-zero wait status: 139
    ../t/cpan/Module-Build/t/script_dist.t.. .............................. FAILED--non-zero wait status: 139
    ../lib/h2xs.t........................... ..................................................... FAILED at test 3
    ../t/cpan/IO-Zlib/t/large.t............. ......................................... FAILED--non-zero wait status: 139
    ../t/cpan/Module-Build/t/perl_mb_opt.t.. .............................. FAILED--non-zero wait status: 139
    ../t/cpan/IO-Compress/t/107multi-rawdeflate.t ........................ FAILED--non-zero wait status: 139
    ../t/cpan/Archive-Tar/t/02_methods.t.... ................................ FAILED--non-zero wait status: 139
    ../t/op/taint.t......................... ................................................... FAILED--non-zero wait status: 139
    ../t/cpan/Archive-Tar/t/06_error.t...... .................................. FAILED--non-zero wait status: 139
    ../t/cpan/CPANPLUS/t/01_CPANPLUS-Configure.t ......................... FAILED--non-zero wait status: 139
    ../lib/ExtUtils/t/Embed.t............... ......................................... FAILED--non-zero wait status: 139
    ../t/cpan/IO-Compress/t/010examples-zlib.t ........................... FAILED at test 2
    ../t/op/coreamp.t....................... ................................................. FAILED--non-zero wait status: 139
    ../lib/DBM_Filter/t/encode.t............ ...................................... FAILED--non-zero wait status: 139
    ../ext/SDBM_File/t/sdbm.t............... ......................................... FAILED--non-zero wait status: 139
    ../t/cpan/Module-Build/t/tilde.t........ .................................... FAILED--non-zero wait status: 139
    ../t/cpan/Module-Build/t/help.t......... ..................................... FAILED--non-zero wait status: 139
    ../t/cpan/IO-Compress/t/104destroy-deflate.t ......................... FAILED--non-zero wait status: 139
    ../t/cpan/Module-Build/t/ppm.t.......... ...................................... FAILED--non-zero wait status: 139
    ../t/cpan/IO-Compress/t/101truncate-deflate.t ........................ FAILED--non-zero wait status: 139
    ../ext/File-DosGlob/t/DosGlob.t......... ................................... FAILED at test 21
    ../t/dist/XSLoader/t/XSLoader.t......... ..................................... FAILED--non-zero wait status: 139
    ../t/cpan/Module-Build/t/use_tap_harness.t ........................... FAILED--non-zero wait status: 139
    ../t/cpan/Perl-OSType/t/00-compile.t.... ................................ FAILED--non-zero wait status: 139
    ../t/dist/B-Deparse/t/deparse.t......... ..................................... FAILED--non-zero wait status: 139
    ../t/cpan/Module-Build/t/test_file_exts.t ............................ FAILED--non-zero wait status: 139
    ../t/cpan/Test-Harness/t/proverc.t...... .................................. FAILED--non-zero wait status: 139
    ../t/cpan/Archive-Tar/t/04_resolved_issues.t ......................... FAILED--non-zero wait status: 139
    ../t/cpan/CPANPLUS/t/20_CPANPLUS-Dist-MM.t ........................... FAILED--non-zero wait status: 139
    ../lib/DirHandle.t...................... ................................................ FAILED--non-zero wait status: 139
    ../t/cpan/Module-Build/t/ext.t.......... ...................................... FAILED--non-zero wait status: 139
    ../t/cpan/Archive-Extract/t/01_Archive-Extract.t ..................... FAILED--non-zero wait status: 139
    ../lib/overload.t....................... ................................................. FAILED--non-zero wait status: 139
    ../t/cpan/Module-Build/t/PL_files.t..... ................................. FAILED--non-zero wait status: 139
    ../t/cpan/Module-Build/t/compat/exit.t.. .............................. FAILED at test 1
    ../t/cpan/IO-Compress/t/001zlib-generic-deflate.t .................... FAILED--non-zero wait status: 139
    ../t/cpan/IO-Compress/t/108anyunc-rawdeflate.t ....................... FAILED--non-zero wait status: 139
    ../t/cpan/CPANPLUS/t/25_CPANPLUS.t...... .................................. FAILED--non-zero wait status: 139
    ../t/cpan/Module-Build/t/add_property.t. .............................. FAILED--non-zero wait status: 139
    ../t/cpan/IO-Compress/t/cz-06gzsetp.t... ............................... FAILED--non-zero wait status: 139
    ../t/cpan/IO-Compress/t/103newtied-deflate.t ......................... FAILED--non-zero wait status: 139
    ../t/cpan/Module-Build/t/resume.t....... ................................... FAILED--non-zero wait status: 139
    ../lib/charnames.t...................... ................................................ FAILED--non-zero wait status: 139
    ../lib/DBM_Filter/t/null.t.............. ........................................ FAILED--non-zero wait status: 139
    ../t/cpan/Module-Build/t/00-compile.t... ............................... FAILED at test 1
    ../t/cpan/IO-Compress/t/105oneshot-bzip2.t ........................... FAILED--non-zero wait status: 139
    ../t/cpan/Module-Build/t/properties/share_dir.t ...................... FAILED--non-zero wait status: 139
    ../t/cpan/CPANPLUS/t/10_CPANPLUS-Error.t ............................. FAILED--non-zero wait status: 139
    ../t/cpan/IO-Compress/t/101truncate-zip.t ............................ FAILED--non-zero wait status: 139
    ../t/cpan/Test-Harness/t/000-load.t..... ................................. FAILED--non-zero wait status: 139
    ../t/cpan/Test-Harness/t/state_results.t ............................. FAILED--non-zero wait status: 139
    ../t/cpan/CPANPLUS/t/00_CPANPLUS-Internals-Utils.t ................... FAILED--non-zero wait status: 139
    ../t/cpan/CPANPLUS/t/21_CPANPLUS-Dist-No-Build.t ..................... FAILED--non-zero wait status: 139
    ../t/cpan/IO-Compress/t/105oneshot-rawdeflate.t ...................... FAILED--non-zero wait status: 139
    ../lib/DBM_Filter/t/utf8.t.............. ........................................ FAILED--non-zero wait status: 139
    ../ext/GDBM_File/t/gdbm.t............... ......................................... FAILED--non-zero wait status: 139
    ../t/cpan/CPANPLUS/t/30_CPANPLUS-Internals-Selfupdate.t .............. FAILED--non-zero wait status: 139
    ../t/cpan/Archive-Tar/t/01_use.t........ .................................... FAILED--non-zero wait status: 139
    ../lib/DBM_Filter/t/int32.t............. ....................................... FAILED--non-zero wait status: 139
    ../t/cpan/Module-Build/t/files.t........ .................................... FAILED--non-zero wait status: 139
    ../t/cpan/IO-Compress/t/cz-01version.t.. .............................. FAILED--non-zero wait status: 139
    ../t/cpan/IO-Compress/t/004gziphdr.t.... ................................ FAILED--non-zero wait status: 139
    ../t/cpan/CPANPLUS-Dist-Build/t/01_CPANPLUS-Dist-Build-Constants.t ... FAILED--non-zero wait status: 139
    ../t/cpan/Module-Build/t/manifypods.t... ............................... FAILED--non-zero wait status: 139

[perlio] -Dmad
[perlio] -DDEBUGGING -Dmad
Inconsistent test results (between TEST and harness):
    ../t/comp/require.t..................... ............................................... FAILED at test 47
    ../ext/File-DosGlob/t/DosGlob.t......... ................................... FAILED at test 21

[stdio] -Accflags=-DPERL_OLD_COPY_ON_WRITE
Inconsistent test results (between TEST and harness):
    ../ext/Devel-Peek/t/Peek.t.............. ........................................ FAILED at test 39
    ../ext/File-DosGlob/t/DosGlob.t......... ................................... FAILED at test 21

[perlio] -Accflags=-DPERL_OLD_COPY_ON_WRITE
Inconsistent test results (between TEST and harness):
    ../t/comp/require.t..................... ............................................... FAILED at test 47
    ../ext/Devel-Peek/t/Peek.t.............. ........................................ FAILED at test 39
    ../ext/File-DosGlob/t/DosGlob.t......... ................................... FAILED at test 21

[en_US.utf8] -Accflags=-DPERL_OLD_COPY_ON_WRITE
Inconsistent test results (between TEST and harness):
    ../t/comp/require.t..................... ............................................... FAILED at test 47
    ../t/lib/croak.t........................ .................................................. FAILED at test 32
    ../t/op/lex.t........................... ..................................................... FAILED at test 5
    ../ext/Devel-Peek/t/Peek.t.............. ........................................ FAILED at test 39
    ../ext/File-DosGlob/t/DosGlob.t......... ................................... FAILED at test 21

[stdio] -DDEBUGGING -Accflags=-DPERL_OLD_COPY_ON_WRITE
Inconsistent test results (between TEST and harness):
    ../ext/PerlIO-encoding/t/encoding.t..... ............................... FAILED--expected 24 tests, saw 19
    ../ext/Devel-Peek/t/Peek.t.............. ........................................ FAILED at test 39
    ../ext/File-DosGlob/t/DosGlob.t......... ................................... FAILED at test 21

[perlio] -DDEBUGGING -Accflags=-DPERL_OLD_COPY_ON_WRITE
Inconsistent test results (between TEST and harness):
    ../ext/PerlIO-encoding/t/encoding.t..... ............................... FAILED--expected 24 tests, saw 19
    ../t/comp/require.t..................... ............................................... FAILED at test 47
    ../ext/Devel-Peek/t/Peek.t.............. ........................................ FAILED at test 39
    ../ext/File-DosGlob/t/DosGlob.t......... ................................... FAILED at test 21

[en_US.utf8] -DDEBUGGING -Accflags=-DPERL_OLD_COPY_ON_WRITE
Inconsistent test results (between TEST and harness):
    ../ext/PerlIO-encoding/t/encoding.t..... ............................... FAILED--expected 24 tests, saw 19
    ../t/comp/require.t..................... ............................................... FAILED at test 47
    ../t/lib/croak.t........................ .................................................. FAILED at test 32
    ../t/op/lex.t........................... ..................................................... FAILED at test 5
    ../ext/Devel-Peek/t/Peek.t.............. ........................................ FAILED at test 39
    ../ext/File-DosGlob/t/DosGlob.t......... ................................... FAILED at test 21

[en_US.utf8] -DDEBUGGING -Duseithreads
Inconsistent test results (between TEST and harness):
    ../t/cpan/ExtUtils-MakeMaker/t/basic.t.. .............................. FAILED at test 22
    ../t/cpan/ExtUtils-MakeMaker/t/recurs.t. .............................. FAILED at test 6
    ../t/cpan/ExtUtils-MakeMaker/t/miniperl.t ............................ FAILED at test 5
    ../t/cpan/CPANPLUS/t/04_CPANPLUS-Module.t ............................ FAILED at test 109
    ../t/lib/croak.t........................ .................................................. FAILED at test 32
    ../t/op/lex.t........................... ..................................................... FAILED at test 5
    ../t/dist/ExtUtils-Install/t/InstallWithMM.t ......................... FAILED at test 4
    ../t/cpan/ExtUtils-MakeMaker/t/pm_to_blib.t .......................... FAILED at test 4
    ../t/cpan/CPANPLUS/t/20_CPANPLUS-Dist-MM.t ........................... FAILED at test 11
    ../t/cpan/ExtUtils-MakeMaker/t/INSTALL_BASE.t ........................ FAILED at test 5

[stdio] -DDEBUGGING -Duseithreads -Accflags=-DPERL_POISON
Inconsistent test results (between TEST and harness):
    ../t/cpan/Module-Build/t/test_type.t.... ................................ FAILED--non-zero wait status: 139
    ../t/cpan/ExtUtils-MakeMaker/t/basic.t.. .............................. FAILED at test 22
    ../t/cpan/IO-Compress/t/001zlib-generic-rawdeflate.t ................. FAILED--non-zero wait status: 139
    ../t/cpan/Module-Build/t/write_default_maniskip.t .................... FAILED--non-zero wait status: 139
    ../t/cpan/IO-Compress/t/109merge-gzip.t. .............................. FAILED--non-zero wait status: 139
    ../t/cpan/Module-Build/t/basic.t........ .................................... FAILED--non-zero wait status: 139
    ../t/cpan/IO-Compress/t/002any-rawdeflate.t .......................... FAILED--non-zero wait status: 139
    ../t/cpan/IO-Compress/t/002any-transparent.t ......................... FAILED--non-zero wait status: 139
    ../t/cpan/IO-Compress/t/107multi-bzip2.t ............................. FAILED--non-zero wait status: 139
    ../t/cpan/ExtUtils-MakeMaker/t/recurs.t. .............................. FAILED at test 6
    ../t/cpan/Module-Build/t/mymeta.t....... ................................... FAILED--non-zero wait status: 139
    ../t/cpan/DB_File/t/db-hash.t........... ....................................... FAILED--non-zero wait status: 139
    ../t/cpan/IO-Compress/t/100generic-gzip.t ............................ FAILED--non-zero wait status: 139
    ../t/cpan/IO-Compress/t/108anyunc-gzip.t ............................. FAILED--non-zero wait status: 139
    ../t/cpan/IO-Compress/t/100generic-bzip2.t ........................... FAILED--non-zero wait status: 139
    ../t/cpan/IO-Compress/t/104destroy-gzip.t ............................ FAILED--non-zero wait status: 139
    ../t/cpan/Module-Build/t/test_types.t... ............................... FAILED--non-zero wait status: 139
    ../t/cpan/IO-Compress/t/005defhdr.t..... ................................. FAILED--non-zero wait status: 139
    ../t/cpan/ExtUtils-MakeMaker/t/miniperl.t ............................ FAILED at test 5
    ../ext/File-Glob/t/rt114984.t........... ..................................... FAILED--non-zero wait status: 139
    ../t/cpan/IO-Zlib/t/basic.t............. ......................................... FAILED--non-zero wait status: 139
    ../t/cpan/Test-Harness/t/testargs.t..... ................................. FAILED--non-zero wait status: 139
    ../ext/File-Glob/t/global.t............. ....................................... FAILED--non-zero wait status: 139
    ../t/cpan/Test-Harness/t/proverun.t..... ................................. FAILED--non-zero wait status: 139
    ../t/cpan/Test-Harness/t/prove.t........ .................................... FAILED--non-zero wait status: 139
    ../t/cpan/IO-Compress/t/108anyunc-transparent.t ...................... FAILED--non-zero wait status: 139
    ../t/cpan/CPANPLUS/t/02_CPANPLUS-Internals.t ......................... FAILED--non-zero wait status: 139
    ../t/cpan/IO-Compress/t/001zlib-generic-zip.t ........................ FAILED--non-zero wait status: 139
    ../t/cpan/CPANPLUS/t/07_CPANPLUS-Internals-Extract.t ................. FAILED--non-zero wait status: 139
    ../t/cpan/CPANPLUS/t/04_CPANPLUS-Module.t ............................ FAILED at test 109
    ../t/io/perlio.t........................ .................................................. FAILED--non-zero wait status: 139
    ../t/cpan/Module-Build/t/metadata.t..... ................................. FAILED--non-zero wait status: 139
    ../t/cpan/IO-Compress/t/108anyunc-bzip2.t ............................ FAILED--non-zero wait status: 139
    ../t/cpan/CPANPLUS/t/09_CPANPLUS-Internals-Search.t .................. FAILED--non-zero wait status: 139
    ../t/cpan/CPANPLUS/t/06_CPANPLUS-Internals-Constants.t ............... FAILED--non-zero wait status: 139
    ../ext/Pod-Html/t/cache.t............... ......................................... FAILED--non-zero wait status: 139
    ../t/cpan/IO-Compress/t/002any-deflate.t ............................. FAILED--non-zero wait status: 139
    ../t/cpan/Module-Build/t/properties/license.t ........................ FAILED--non-zero wait status: 139
    ../t/cpan/CPANPLUS/t/19_CPANPLUS-Dist.t. .............................. FAILED--non-zero wait status: 139
    ../t/dist/B-Deparse/t/core.t............ ........................................ FAILED--non-zero wait status: 139
    ../t/dist/ExtUtils-Command/t/eu_command.t ............................ FAILED--non-zero wait status: 139
    ../t/cpan/IO-Compress/t/102tied-bzip2.t. .............................. FAILED--non-zero wait status: 139
    ../t/cpan/IO-Compress/t/105oneshot-zip.t ............................. FAILED--non-zero wait status: 139
    ../t/lib/croak.t........................ .................................................. FAILED--non-zero wait status: 139
    ../t/cpan/Archive-Tar/t/03_file.t....... ................................... FAILED--non-zero wait status: 139
    ../t/cpan/IO-Compress/t/102tied-deflate.t ............................ FAILED--non-zero wait status: 139
    ../t/cpan/CPANPLUS/t/03_CPANPLUS-Internals-Source.t .................. FAILED--non-zero wait status: 139
    ../t/cpan/IO-Zlib/t/uncomp2.t........... ....................................... FAILED--non-zero wait status: 139
    ../t/porting/diag.t..................... ............................................... FAILED--non-zero wait status: 139
    ../t/cpan/CPANPLUS/t/15_CPANPLUS-Shell.t ............................. FAILED--non-zero wait status: 139
    ../t/cpan/IO-Compress/t/103newtied-rawdeflate.t ...................... FAILED--non-zero wait status: 139
    ../t/cpan/Module-Build/t/properties/requires.t ....................... FAILED--non-zero wait status: 139
    ../t/cpan/IO-Compress/t/107multi-deflate.t ........................... FAILED--non-zero wait status: 139
    ../t/cpan/Compress-Raw-Bzip2/t/09limitoutput.t ....................... FAILED--non-zero wait status: 139
    ../lib/DBM_Filter/t/01error.t........... ..................................... FAILED--non-zero wait status: 139
    ../t/cpan/CPANPLUS/t/08_CPANPLUS-Backend.t ........................... FAILED--non-zero wait status: 139
    ../t/cpan/Module-Build/t/properties/needs_compiler.t ................. FAILED--non-zero wait status: 139
    ../t/cpan/IO-Compress/t/100generic-deflate.t ......................... FAILED--non-zero wait status: 139
    ../t/cpan/IO-Compress/t/102tied-rawdeflate.t ......................... FAILED--non-zero wait status: 139
    ../t/cpan/IO-Compress/t/104destroy-bzip2.t ........................... FAILED--non-zero wait status: 139
    ../t/cpan/IO-Compress/t/103newtied-gzip.t ............................ FAILED--non-zero wait status: 139
    ../t/cpan/CPANPLUS/t/05_CPANPLUS-Internals-Fetch.t ................... FAILED--non-zero wait status: 139
    ../t/cpan/Archive-Tar/t/05_iter.t....... ................................... FAILED--non-zero wait status: 139
    ../t/cpan/IO-Compress/t/006zip.t........ .................................... FAILED--non-zero wait status: 139
    ../lib/subs.t........................... ..................................................... FAILED--non-zero wait status: 139
    ../t/cpan/IO-Compress/t/106prime-deflate.t ........................... FAILED--non-zero wait status: 139
    ../t/cpan/IO-Compress/t/101truncate-rawdeflate.t ..................... FAILED--non-zero wait status: 139
    ../t/cpan/IO-Compress/t/105oneshot-gzip.t ............................ FAILED--non-zero wait status: 139
    ../t/cpan/Module-Build/t/properties/dist_suffix.t .................... FAILED--non-zero wait status: 139
    ../t/op/local.t......................... ................................................... FAILED--non-zero wait status: 139
    ../t/cpan/Module-Build/t/metadata2.t.... ................................ FAILED--non-zero wait status: 139
    ../t/cpan/Module-Build/t/actions/installdeps.t ....................... FAILED--non-zero wait status: 139
    ../t/cpan/Test-Harness/t/perl5lib.t..... ................................. FAILED--non-zero wait status: 139
    ../t/cpan/IO-Compress/t/110encode-gzip.t ............................. FAILED--non-zero wait status: 139
    ../t/cpan/Module-Build/t/runthrough.t... ............................... FAILED at test 13
    ../ext/File-Glob/t/case.t............... ......................................... FAILED--non-zero wait status: 139
    ../t/cpan/ExtUtils-MakeMaker/t/revision.t ............................ FAILED--non-zero wait status: 139
    ../t/cpan/IO-Compress/t/108anyunc-deflate.t .......................... FAILED--non-zero wait status: 139
    ../t/cpan/IO-Compress/t/105oneshot-zip-only.t ........................ FAILED--non-zero wait status: 139
    ../t/cpan/Module-Build/t/compat.t....... ................................... FAILED at test 4
    ../t/cpan/Module-Build/t/sample.t....... ................................... FAILED--non-zero wait status: 139
    ../t/cpan/Module-Build/t/new_from_context.t .......................... FAILED--non-zero wait status: 139
    ../t/cpan/IO-Compress/t/108anyunc-zip.t. .............................. FAILED--non-zero wait status: 139
    ../t/cpan/Module-Build/t/properties/module_name.t .................... FAILED--non-zero wait status: 139
    ../t/cpan/ExtUtils-MakeMaker/t/maketext_filter.t ..................... FAILED--non-zero wait status: 139
    ../t/cpan/IO-Compress/t/104destroy-zip.t ............................. FAILED--non-zero wait status: 139
    ../t/cpan/Test-Harness/t/state.t........ .................................... FAILED--non-zero wait status: 139
    ../t/cpan/IO-Compress/t/109merge-rawdeflate.t ........................ FAILED--non-zero wait status: 139
    ../t/cpan/IO-Compress/t/010examples-bzip2.t .......................... FAILED at test 2
    ../t/cpan/IO-Compress/t/cz-03zlib-v1.t.. .............................. FAILED--non-zero wait status: 139
    ../t/cpan/Test-Harness/t/proveenv.t..... ................................. FAILED--non-zero wait status: 139
    ../t/cpan/ExtUtils-MakeMaker/t/cd.t..... ................................. FAILED--non-zero wait status: 139
    ../t/cpan/IO-Compress/t/000prereq.t..... ................................. FAILED--non-zero wait status: 139
    ../t/op/defins.t........................ .................................................. FAILED--non-zero wait status: 139
    ../t/cpan/Module-Build/t/extend.t....... ................................... FAILED--non-zero wait status: 139
    ../t/cpan/IO-Compress/t/002any-gzip.t... ............................... FAILED--non-zero wait status: 139
    ../t/cpan/IO-Compress/t/110encode-rawdeflate.t ....................... FAILED--non-zero wait status: 139
    ../t/cpan/CPANPLUS-Dist-Build/t/02_CPANPLUS-Dist-Build.t ............. FAILED at test 5
    ../t/cpan/IO-Compress/t/105oneshot-zip-store-only.t .................. FAILED--non-zero wait status: 139
    ../t/cpan/Module-Build/t/actions/manifest_skip.t ..................... FAILED--non-zero wait status: 139
    ../t/cpan/IO-Compress/t/103newtied-bzip2.t ........................... FAILED--non-zero wait status: 139
    ../t/cpan/CPANPLUS/t/40_CPANPLUS-Internals-Report.t .................. FAILED--non-zero wait status: 139
    ../t/cpan/Module-Build/t/parents.t...... .................................. FAILED--non-zero wait status: 139
    ../t/cpan/Module-Build/t/notes.t........ .................................... FAILED--non-zero wait status: 139
    ../t/dist/ExtUtils-Install/t/InstallWithMM.t ......................... FAILED at test 4
    ../t/dist/IO/t/io_dir.t................. ............................................. FAILED--non-zero wait status: 139
    ../t/cpan/ExtUtils-MakeMaker/t/pm_to_blib.t .......................... FAILED at test 4
    ../t/cpan/Module-Build/t/bundle_inc.t... ............................... FAILED--non-zero wait status: 139
    ../ext/File-Glob/t/basic.t.............. ........................................ FAILED--non-zero wait status: 139
    ../t/cpan/Module-Build/t/versions.t..... ................................. FAILED--non-zero wait status: 139
    ../t/cpan/Module-Build/t/install.t...... .................................. FAILED--non-zero wait status: 139
    ../t/cpan/ExtUtils-MakeMaker/t/00compile.t ........................... FAILED--non-zero wait status: 139
    ../t/cpan/IO-Zlib/t/getline.t........... ....................................... FAILED--non-zero wait status: 139
    ../t/cpan/IO-Compress/t/globmapper.t.... ................................ FAILED--non-zero wait status: 139
    ../t/porting/customized.t............... ......................................... FAILED--non-zero wait status: 139
    ../t/cpan/IO-Zlib/t/tied.t.............. .......................................... FAILED--non-zero wait status: 139
    ../t/cpan/Module-Build/t/debug.t........ .................................... FAILED--non-zero wait status: 139
    ../t/dist/ExtUtils-Command/t/cp.t....... ................................... FAILED--non-zero wait status: 139
    ../t/op/svleak.t........................ .................................................. FAILED--non-zero wait status: 139
    ../t/cpan/IO-Compress/t/109merge-deflate.t ........................... FAILED--non-zero wait status: 139
    ../t/cpan/Module-Build/t/install_extra_target.t ...................... FAILED--non-zero wait status: 139
    ../lib/DBM_Filter/t/compress.t.......... .................................... FAILED--non-zero wait status: 139
    ../t/cpan/IO-Compress/t/105oneshot-zip-bzip2-only.t .................. FAILED--non-zero wait status: 139
    ../lib/DBM_Filter/t/02core.t............ ...................................... FAILED--non-zero wait status: 139
    ../t/cpan/IO-Compress/t/110encode-bzip2.t ............................ FAILED--non-zero wait status: 139
    ../t/cpan/IO-Compress/t/101truncate-bzip2.t .......................... FAILED--non-zero wait status: 139
    ../t/cpan/Module-Build/t/xs.t........... ....................................... FAILED--non-zero wait status: 139
    ../t/cpan/IO-Compress/t/cz-14gzopen.t... ............................... FAILED--non-zero wait status: 139
    ../t/cpan/Compress-Raw-Zlib/t/07bufsize.t ............................ FAILED--non-zero wait status: 139
    ../t/cpan/ExtUtils-MakeMaker/t/PL_FILES.t ............................ FAILED at test 3
    ../ext/DynaLoader/t/DynaLoader.t........ .................................. FAILED--non-zero wait status: 139
    ../t/cpan/IO-Compress/t/106prime-rawdeflate.t ........................ FAILED--non-zero wait status: 139
    ../t/cpan/ExtUtils-Constant/t/Constant.t ............................. FAILED at test 3
    ../t/cpan/IO-Zlib/t/getc.t.............. .......................................... FAILED--non-zero wait status: 139
    ../t/cpan/IO-Compress/t/050interop-gzip.t ............................ FAILED--non-zero wait status: 139
    ../t/cpan/Module-Build/t/properties/release_status.t ................. FAILED--non-zero wait status: 139
    ../t/cpan/Module-Build/t/destinations.t. .............................. FAILED--non-zero wait status: 139
    ../t/op/lex_assign.t.................... .............................................. FAILED--non-zero wait status: 139
    ../t/op/coresubs.t...................... ................................................ FAILED--non-zero wait status: 139
    ../t/cpan/IO-Compress/t/cz-05examples.t. .............................. FAILED at test 2
    ../ext/File-Glob/t/taint.t.............. ........................................ FAILED--non-zero wait status: 139
    ../ext/NDBM_File/t/ndbm.t............... ......................................... FAILED--non-zero wait status: 139
    ../t/cpan/Module-Build/t/script_dist.t.. .............................. FAILED--non-zero wait status: 139
    ../lib/h2xs.t........................... ..................................................... FAILED at test 3
    ../t/cpan/IO-Compress/t/105oneshot-deflate.t ......................... FAILED--non-zero wait status: 139
    ../t/cpan/IO-Compress/t/104destroy-rawdeflate.t ...................... FAILED--non-zero wait status: 139
    ../t/cpan/IO-Zlib/t/large.t............. ......................................... FAILED--non-zero wait status: 139
    ../t/cpan/Module-Build/t/perl_mb_opt.t.. .............................. FAILED--non-zero wait status: 139
    ../t/cpan/IO-Compress/t/107multi-rawdeflate.t ........................ FAILED--non-zero wait status: 139
    ../t/cpan/IO-Compress/t/101truncate-gzip.t ........................... FAILED--non-zero wait status: 139
    ../t/cpan/Archive-Tar/t/02_methods.t.... ................................ FAILED--non-zero wait status: 139
    ../t/cpan/IO-Compress/t/103newtied-zip.t ............................. FAILED--non-zero wait status: 139
    ../t/op/taint.t......................... ................................................... FAILED--non-zero wait status: 139
    ../t/cpan/IO-Compress/t/106prime-bzip2.t ............................. FAILED--non-zero wait status: 139
    ../t/cpan/Archive-Tar/t/06_error.t...... .................................. FAILED--non-zero wait status: 139
    ../t/cpan/IO-Zlib/t/external.t.......... ...................................... FAILED--non-zero wait status: 139
    ../t/porting/maintainers.t.............. ........................................ FAILED--non-zero wait status: 139
    ../t/cpan/CPANPLUS/t/01_CPANPLUS-Configure.t ......................... FAILED--non-zero wait status: 139
    ../lib/ExtUtils/t/Embed.t............... ......................................... FAILED--non-zero wait status: 139
    ../t/cpan/IO-Compress/t/010examples-zlib.t ........................... FAILED at test 2
    ../t/cpan/IO-Compress/t/106prime-gzip.t. .............................. FAILED--non-zero wait status: 139
    ../t/cpan/IO-Zlib/t/import.t............ ........................................ FAILED--non-zero wait status: 139
    ../lib/AnyDBM_File.t.................... .............................................. FAILED--non-zero wait status: 139
    ../t/op/coreamp.t....................... ................................................. FAILED--non-zero wait status: 139
    ../lib/DBM_Filter/t/encode.t............ ...................................... FAILED--non-zero wait status: 139
    ../ext/SDBM_File/t/sdbm.t............... ......................................... FAILED--non-zero wait status: 139
    ../t/cpan/Module-Build/t/tilde.t........ .................................... FAILED--non-zero wait status: 139
    ../t/cpan/Module-Build/t/help.t......... ..................................... FAILED--non-zero wait status: 139
    ../t/cpan/IO-Compress/t/001bzip2.t...... .................................. FAILED--non-zero wait status: 139
    ../t/cpan/IO-Compress/t/104destroy-deflate.t ......................... FAILED--non-zero wait status: 139
    ../lib/feature.t........................ .................................................. FAILED--non-zero wait status: 139
    ../t/cpan/Module-Build/t/ppm.t.......... ...................................... FAILED--non-zero wait status: 139
    ../t/cpan/IO-Compress/t/002any-zip.t.... ................................ FAILED--non-zero wait status: 139
    ../t/cpan/IO-Compress/t/101truncate-deflate.t ........................ FAILED--non-zero wait status: 139
    ../t/porting/exec-bit.t................. ........................................... FAILED--non-zero wait status: 139
    ../ext/File-DosGlob/t/DosGlob.t......... ................................... FAILED--non-zero wait status: 139
    ../t/cpan/IO-Compress/t/107multi-gzip.t. .............................. FAILED--non-zero wait status: 139
    ../lib/warnings.t....................... ................................................. FAILED at test 410
    ../t/dist/XSLoader/t/XSLoader.t......... ..................................... FAILED--non-zero wait status: 139
    ../t/cpan/Module-Build/t/use_tap_harness.t ........................... FAILED--non-zero wait status: 139
    ../t/cpan/IO-Compress/t/107multi-zip.t.. .............................. FAILED--non-zero wait status: 139
    ../t/cpan/IO-Compress/t/100generic-zip.t ............................. FAILED--non-zero wait status: 139
    ../t/cpan/Perl-OSType/t/00-compile.t.... ................................ FAILED--non-zero wait status: 139
    ../t/dist/B-Deparse/t/deparse.t......... ..................................... FAILED--non-zero wait status: 139
    ../t/cpan/Module-Build/t/test_file_exts.t ............................ FAILED--non-zero wait status: 139
    ../t/cpan/Test-Harness/t/proverc.t...... .................................. FAILED--non-zero wait status: 139
    ../t/cpan/Archive-Tar/t/04_resolved_issues.t ......................... FAILED--non-zero wait status: 139
    ../t/cpan/Compress-Raw-Zlib/t/18lvalue.t ............................. FAILED--non-zero wait status: 139
    ../t/cpan/CPANPLUS/t/20_CPANPLUS-Dist-MM.t ........................... FAILED at test 11
    ../t/cpan/IO-Compress/t/01misc.t........ .................................... FAILED--non-zero wait status: 139
    ../lib/DirHandle.t...................... ................................................ FAILED--non-zero wait status: 139
    ../t/cpan/DB_File/t/db-btree.t.......... ...................................... FAILED--non-zero wait status: 139
    ../t/cpan/Module-Build/t/ext.t.......... ...................................... FAILED--non-zero wait status: 139
    ../t/cpan/Archive-Extract/t/01_Archive-Extract.t ..................... FAILED--non-zero wait status: 139
    ../t/cpan/IO-Compress/t/001zlib-generic-gzip.t ....................... FAILED--non-zero wait status: 139
    ../t/op/readdir.t....................... ................................................. FAILED--non-zero wait status: 139
    ../t/cpan/IO-Compress/t/100generic-rawdeflate.t ...................... FAILED--non-zero wait status: 139
    ../t/cpan/ExtUtils-MakeMaker/t/xs.t..... ................................. FAILED at test 4
    ../lib/overload.t....................... ................................................. FAILED--non-zero wait status: 139
    ../t/op/tie_fetch_count.t............... ......................................... FAILED--non-zero wait status: 139
    ../t/cpan/IO-Compress/t/111const-deflate.t ........................... FAILED--non-zero wait status: 139
    ../lib/strict.t......................... ................................................... FAILED--non-zero wait status: 139
    ../t/cpan/IO-Zlib/t/uncomp1.t........... ....................................... FAILED--non-zero wait status: 139
    ../t/cpan/Module-Build/t/PL_files.t..... ................................. FAILED--non-zero wait status: 139
    ../t/cpan/Compress-Raw-Zlib/t/09limitoutput.t ........................ FAILED--non-zero wait status: 139
    ../t/cpan/ExtUtils-MakeMaker/t/INSTALL_BASE.t ........................ FAILED at test 5
    ../t/op/dbm.t........................... ..................................................... FAILED at test 1
    ../t/cpan/IO-Compress/t/110encode-zip.t. .............................. FAILED--non-zero wait status: 139
    ../t/cpan/Module-Build/t/compat/exit.t.. .............................. FAILED at test 1
    ../t/cpan/IO-Compress/t/001zlib-generic-deflate.t .................... FAILED--non-zero wait status: 139
    ../t/cpan/IO-Compress/t/108anyunc-rawdeflate.t ....................... FAILED--non-zero wait status: 139
    ../t/cpan/IO-Compress/t/105oneshot-gzip-only.t ....................... FAILED--non-zero wait status: 139
    ../t/op/glob.t.......................... .................................................... FAILED--non-zero wait status: 139
    ../t/cpan/IO-Compress/t/cz-08encoding.t. .............................. FAILED--non-zero wait status: 139
    ../t/cpan/CPANPLUS/t/25_CPANPLUS.t...... .................................. FAILED--non-zero wait status: 139
    ../t/cpan/Module-Build/t/add_property.t. .............................. FAILED--non-zero wait status: 139
    ../t/cpan/IO-Compress/t/cz-06gzsetp.t... ............................... FAILED--non-zero wait status: 139
    ../t/cpan/IO-Compress/t/103newtied-deflate.t ......................... FAILED--non-zero wait status: 139
    ../t/cpan/Module-Build/t/resume.t....... ................................... FAILED--non-zero wait status: 139
    ../t/cpan/IO-Compress/t/110encode-deflate.t .......................... FAILED--non-zero wait status: 139
    ../lib/charnames.t...................... ................................................ FAILED--non-zero wait status: 139
    ../t/cpan/IO-Compress/t/020isize.t...... .................................. FAILED--non-zero wait status: 139
    ../lib/DBM_Filter/t/null.t.............. ........................................ FAILED--non-zero wait status: 139
    ../t/cpan/Pod-Parser/t/pod/selfcheck.t.. .............................. FAILED--non-zero wait status: 139
    ../t/cpan/IO-Compress/t/102tied-zip.t... ............................... FAILED--non-zero wait status: 139
    ../t/cpan/Module-Build/t/00-compile.t... ............................... FAILED at test 1
    ../t/cpan/IO-Compress/t/105oneshot-bzip2.t ........................... FAILED--non-zero wait status: 139
    ../t/cpan/Module-Build/t/properties/share_dir.t ...................... FAILED--non-zero wait status: 139
    ../t/cpan/CPANPLUS/t/10_CPANPLUS-Error.t ............................. FAILED--non-zero wait status: 139
    ../t/cpan/IO-Compress/t/101truncate-zip.t ............................ FAILED--non-zero wait status: 139
    ../t/cpan/Test-Harness/t/000-load.t..... ................................. FAILED--non-zero wait status: 139
    ../t/cpan/Test-Harness/t/state_results.t ............................. FAILED--non-zero wait status: 139
    ../t/cpan/IO-Compress/t/102tied-gzip.t.. .............................. FAILED--non-zero wait status: 139
    ../t/cpan/CPANPLUS/t/00_CPANPLUS-Internals-Utils.t ................... FAILED--non-zero wait status: 139
    ../t/cpan/IO-Compress/t/106prime-zip.t.. .............................. FAILED--non-zero wait status: 139
    ../t/cpan/CPANPLUS/t/21_CPANPLUS-Dist-No-Build.t ..................... FAILED--non-zero wait status: 139
    ../t/cpan/IO-Compress/t/105oneshot-rawdeflate.t ...................... FAILED--non-zero wait status: 139
    ../lib/DBM_Filter/t/utf8.t.............. ........................................ FAILED--non-zero wait status: 139
    ../t/cpan/Compress-Raw-Zlib/t/02zlib.t.. .............................. FAILED--non-zero wait status: 139
    ../ext/GDBM_File/t/gdbm.t............... ......................................... FAILED--non-zero wait status: 139
    ../t/cpan/CPANPLUS/t/30_CPANPLUS-Internals-Selfupdate.t .............. FAILED--non-zero wait status: 139
    ../t/cpan/Archive-Tar/t/01_use.t........ .................................... FAILED--non-zero wait status: 139
    ../lib/DBM_Filter/t/int32.t............. ....................................... FAILED--non-zero wait status: 139
    ../t/cpan/Module-Build/t/files.t........ .................................... FAILED--non-zero wait status: 139
    ../t/cpan/IO-Compress/t/cz-01version.t.. .............................. FAILED--non-zero wait status: 139
    ../t/cpan/IO-Compress/t/004gziphdr.t.... ................................ FAILED--non-zero wait status: 139
    ../t/cpan/CPANPLUS-Dist-Build/t/01_CPANPLUS-Dist-Build-Constants.t ... FAILED--non-zero wait status: 139
    ../t/cpan/Module-Build/t/manifypods.t... ............................... FAILED--non-zero wait status: 139

[perlio] -DDEBUGGING -Duseithreads -Accflags=-DPERL_POISON
Inconsistent test results (between TEST and harness):
    ../t/cpan/Module-Build/t/test_type.t.... ................................ FAILED--non-zero wait status: 139
    ../t/cpan/ExtUtils-MakeMaker/t/basic.t.. .............................. FAILED at test 22
    ../t/cpan/IO-Compress/t/001zlib-generic-rawdeflate.t ................. FAILED--non-zero wait status: 139
    ../t/cpan/Module-Build/t/write_default_maniskip.t .................... FAILED--non-zero wait status: 139
    ../t/cpan/IO-Compress/t/109merge-gzip.t. .............................. FAILED--non-zero wait status: 139
    ../t/cpan/Module-Build/t/basic.t........ .................................... FAILED--non-zero wait status: 139
    ../t/cpan/IO-Compress/t/002any-rawdeflate.t .......................... FAILED--non-zero wait status: 139
    ../t/cpan/IO-Compress/t/002any-transparent.t ......................... FAILED--non-zero wait status: 139
    ../t/cpan/IO-Compress/t/107multi-bzip2.t ............................. FAILED--non-zero wait status: 139
    ../t/cpan/ExtUtils-MakeMaker/t/recurs.t. .............................. FAILED at test 6
    ../t/cpan/Module-Build/t/mymeta.t....... ................................... FAILED--non-zero wait status: 139
    ../t/cpan/DB_File/t/db-hash.t........... ....................................... FAILED--non-zero wait status: 139
    ../t/cpan/IO-Compress/t/100generic-gzip.t ............................ FAILED--non-zero wait status: 139
    ../t/cpan/IO-Compress/t/108anyunc-gzip.t ............................. FAILED--non-zero wait status: 139
    ../t/cpan/IO-Compress/t/100generic-bzip2.t ........................... FAILED--non-zero wait status: 139
    ../t/comp/require.t..................... ............................................... FAILED at test 47
    ../t/cpan/IO-Compress/t/104destroy-gzip.t ............................ FAILED--non-zero wait status: 139
    ../t/cpan/Module-Build/t/test_types.t... ............................... FAILED--non-zero wait status: 139
    ../t/cpan/IO-Compress/t/005defhdr.t..... ................................. FAILED--non-zero wait status: 139
    ../t/cpan/ExtUtils-MakeMaker/t/miniperl.t ............................ FAILED at test 5
    ../ext/File-Glob/t/rt114984.t........... ..................................... FAILED--non-zero wait status: 139
    ../t/cpan/IO-Zlib/t/basic.t............. ......................................... FAILED--non-zero wait status: 139
    ../t/cpan/Test-Harness/t/testargs.t..... ................................. FAILED--non-zero wait status: 139
    ../ext/File-Glob/t/global.t............. ....................................... FAILED--non-zero wait status: 139
    ../t/cpan/Test-Harness/t/proverun.t..... ................................. FAILED--non-zero wait status: 139
    ../t/cpan/Test-Harness/t/prove.t........ .................................... FAILED--non-zero wait status: 139
    ../t/cpan/IO-Compress/t/108anyunc-transparent.t ...................... FAILED--non-zero wait status: 139
    ../t/cpan/CPANPLUS/t/02_CPANPLUS-Internals.t ......................... FAILED--non-zero wait status: 139
    ../t/cpan/IO-Compress/t/001zlib-generic-zip.t ........................ FAILED--non-zero wait status: 139
    ../t/cpan/CPANPLUS/t/07_CPANPLUS-Internals-Extract.t ................. FAILED--non-zero wait status: 139
    ../t/cpan/CPANPLUS/t/04_CPANPLUS-Module.t ............................ FAILED at test 109
    ../t/io/perlio.t........................ .................................................. FAILED--non-zero wait status: 139
    ../t/cpan/Module-Build/t/metadata.t..... ................................. FAILED--non-zero wait status: 139
    ../t/cpan/IO-Compress/t/108anyunc-bzip2.t ............................ FAILED--non-zero wait status: 139
    ../t/cpan/CPANPLUS/t/09_CPANPLUS-Internals-Search.t .................. FAILED--non-zero wait status: 139
    ../t/cpan/CPANPLUS/t/06_CPANPLUS-Internals-Constants.t ............... FAILED--non-zero wait status: 139
    ../ext/Pod-Html/t/cache.t............... ......................................... FAILED--non-zero wait status: 139
    ../t/cpan/IO-Compress/t/002any-deflate.t ............................. FAILED--non-zero wait status: 139
    ../t/cpan/Module-Build/t/properties/license.t ........................ FAILED--non-zero wait status: 139
    ../t/cpan/CPANPLUS/t/19_CPANPLUS-Dist.t. .............................. FAILED--non-zero wait status: 139
    ../t/dist/B-Deparse/t/core.t............ ........................................ FAILED--non-zero wait status: 139
    ../t/dist/ExtUtils-Command/t/eu_command.t ............................ FAILED--non-zero wait status: 139
    ../t/cpan/IO-Compress/t/102tied-bzip2.t. .............................. FAILED--non-zero wait status: 139
    ../t/cpan/IO-Compress/t/105oneshot-zip.t ............................. FAILED--non-zero wait status: 139
    ../t/lib/croak.t........................ .................................................. FAILED--non-zero wait status: 139
    ../t/cpan/Archive-Tar/t/03_file.t....... ................................... FAILED--non-zero wait status: 139
    ../t/cpan/IO-Compress/t/102tied-deflate.t ............................ FAILED--non-zero wait status: 139
    ../t/cpan/CPANPLUS/t/03_CPANPLUS-Internals-Source.t .................. FAILED--non-zero wait status: 139
    ../t/cpan/IO-Zlib/t/uncomp2.t........... ....................................... FAILED--non-zero wait status: 139
    ../t/porting/diag.t..................... ............................................... FAILED--non-zero wait status: 139
    ../t/cpan/CPANPLUS/t/15_CPANPLUS-Shell.t ............................. FAILED--non-zero wait status: 139
    ../t/cpan/IO-Compress/t/103newtied-rawdeflate.t ...................... FAILED--non-zero wait status: 139
    ../t/cpan/Module-Build/t/properties/requires.t ....................... FAILED--non-zero wait status: 139
    ../t/cpan/IO-Compress/t/107multi-deflate.t ........................... FAILED--non-zero wait status: 139
    ../t/cpan/Compress-Raw-Bzip2/t/09limitoutput.t ....................... FAILED--non-zero wait status: 139
    ../lib/DBM_Filter/t/01error.t........... ..................................... FAILED--non-zero wait status: 139
    ../t/cpan/CPANPLUS/t/08_CPANPLUS-Backend.t ........................... FAILED--non-zero wait status: 139
    ../t/cpan/Module-Build/t/properties/needs_compiler.t ................. FAILED--non-zero wait status: 139
    ../t/cpan/IO-Compress/t/100generic-deflate.t ......................... FAILED--non-zero wait status: 139
    ../t/cpan/IO-Compress/t/102tied-rawdeflate.t ......................... FAILED--non-zero wait status: 139
    ../t/cpan/IO-Compress/t/104destroy-bzip2.t ........................... FAILED--non-zero wait status: 139
    ../t/cpan/IO-Compress/t/103newtied-gzip.t ............................ FAILED--non-zero wait status: 139
    ../t/cpan/CPANPLUS/t/05_CPANPLUS-Internals-Fetch.t ................... FAILED--non-zero wait status: 139
    ../t/cpan/Archive-Tar/t/05_iter.t....... ................................... FAILED--non-zero wait status: 139
    ../t/cpan/IO-Compress/t/006zip.t........ .................................... FAILED--non-zero wait status: 139
    ../lib/subs.t........................... ..................................................... FAILED--non-zero wait status: 139
    ../t/cpan/IO-Compress/t/106prime-deflate.t ........................... FAILED--non-zero wait status: 139
    ../t/cpan/IO-Compress/t/101truncate-rawdeflate.t ..................... FAILED--non-zero wait status: 139
    ../t/cpan/IO-Compress/t/105oneshot-gzip.t ............................ FAILED--non-zero wait status: 139
    ../t/cpan/Module-Build/t/properties/dist_suffix.t .................... FAILED--non-zero wait status: 139
    ../t/op/local.t......................... ................................................... FAILED--non-zero wait status: 139
    ../t/cpan/Module-Build/t/metadata2.t.... ................................ FAILED--non-zero wait status: 139
    ../t/cpan/Module-Build/t/actions/installdeps.t ....................... FAILED--non-zero wait status: 139
    ../t/cpan/Test-Harness/t/perl5lib.t..... ................................. FAILED--non-zero wait status: 139
    ../t/cpan/IO-Compress/t/110encode-gzip.t ............................. FAILED--non-zero wait status: 139
    ../t/cpan/Module-Build/t/runthrough.t... ............................... FAILED at test 13
    ../ext/File-Glob/t/case.t............... ......................................... FAILED--non-zero wait status: 139
    ../t/cpan/ExtUtils-MakeMaker/t/revision.t ............................ FAILED--non-zero wait status: 139
    ../t/cpan/IO-Compress/t/108anyunc-deflate.t .......................... FAILED--non-zero wait status: 139
    ../t/cpan/IO-Compress/t/105oneshot-zip-only.t ........................ FAILED--non-zero wait status: 139
    ../t/cpan/Module-Build/t/compat.t....... ................................... FAILED at test 4
    ../t/cpan/Module-Build/t/sample.t....... ................................... FAILED--non-zero wait status: 139
    ../t/cpan/Module-Build/t/new_from_context.t .......................... FAILED--non-zero wait status: 139
    ../t/cpan/IO-Compress/t/108anyunc-zip.t. .............................. FAILED--non-zero wait status: 139
    ../t/cpan/Module-Build/t/properties/module_name.t .................... FAILED--non-zero wait status: 139
    ../t/cpan/ExtUtils-MakeMaker/t/maketext_filter.t ..................... FAILED--non-zero wait status: 139
    ../t/cpan/IO-Compress/t/104destroy-zip.t ............................. FAILED--non-zero wait status: 139
    ../t/cpan/Test-Harness/t/state.t........ .................................... FAILED--non-zero wait status: 139
    ../t/cpan/IO-Compress/t/109merge-rawdeflate.t ........................ FAILED--non-zero wait status: 139
    ../t/cpan/IO-Compress/t/010examples-bzip2.t .......................... FAILED at test 2
    ../t/cpan/IO-Compress/t/cz-03zlib-v1.t.. .............................. FAILED--non-zero wait status: 139
    ../t/cpan/Test-Harness/t/proveenv.t..... ................................. FAILED--non-zero wait status: 139
    ../t/cpan/ExtUtils-MakeMaker/t/cd.t..... ................................. FAILED--non-zero wait status: 139
    ../t/cpan/IO-Compress/t/000prereq.t..... ................................. FAILED--non-zero wait status: 139
    ../t/op/defins.t........................ .................................................. FAILED--non-zero wait status: 139
    ../t/cpan/Module-Build/t/extend.t....... ................................... FAILED--non-zero wait status: 139
    ../t/cpan/IO-Compress/t/002any-gzip.t... ............................... FAILED--non-zero wait status: 139
    ../t/cpan/IO-Compress/t/110encode-rawdeflate.t ....................... FAILED--non-zero wait status: 139
    ../t/cpan/CPANPLUS-Dist-Build/t/02_CPANPLUS-Dist-Build.t ............. FAILED at test 5
    ../t/cpan/IO-Compress/t/105oneshot-zip-store-only.t .................. FAILED--non-zero wait status: 139
    ../t/cpan/Module-Build/t/actions/manifest_skip.t ..................... FAILED--non-zero wait status: 139
    ../t/cpan/IO-Compress/t/103newtied-bzip2.t ........................... FAILED--non-zero wait status: 139
    ../t/cpan/CPANPLUS/t/40_CPANPLUS-Internals-Report.t .................. FAILED--non-zero wait status: 139
    ../t/cpan/Module-Build/t/parents.t...... .................................. FAILED--non-zero wait status: 139
    ../t/cpan/Module-Build/t/notes.t........ .................................... FAILED--non-zero wait status: 139
    ../t/dist/ExtUtils-Install/t/InstallWithMM.t ......................... FAILED at test 4
    ../t/dist/IO/t/io_dir.t................. ............................................. FAILED--non-zero wait status: 139
    ../t/cpan/ExtUtils-MakeMaker/t/pm_to_blib.t .......................... FAILED at test 4
    ../t/cpan/Module-Build/t/bundle_inc.t... ............................... FAILED--non-zero wait status: 139
    ../ext/File-Glob/t/basic.t.............. ........................................ FAILED--non-zero wait status: 139
    ../t/cpan/Module-Build/t/versions.t..... ................................. FAILED--non-zero wait status: 139
    ../t/cpan/Module-Build/t/install.t...... .................................. FAILED--non-zero wait status: 139
    ../t/cpan/ExtUtils-MakeMaker/t/00compile.t ........................... FAILED--non-zero wait status: 139
    ../t/cpan/IO-Zlib/t/getline.t........... ....................................... FAILED--non-zero wait status: 139
    ../t/cpan/IO-Compress/t/globmapper.t.... ................................ FAILED--non-zero wait status: 139
    ../t/porting/customized.t............... ......................................... FAILED--non-zero wait status: 139
    ../t/cpan/IO-Zlib/t/tied.t.............. .......................................... FAILED--non-zero wait status: 139
    ../t/cpan/Module-Build/t/debug.t........ .................................... FAILED--non-zero wait status: 139
    ../t/dist/ExtUtils-Command/t/cp.t....... ................................... FAILED--non-zero wait status: 139
    ../t/op/svleak.t........................ .................................................. FAILED--non-zero wait status: 139
    ../t/cpan/IO-Compress/t/109merge-deflate.t ........................... FAILED--non-zero wait status: 139
    ../t/cpan/Module-Build/t/install_extra_target.t ...................... FAILED--non-zero wait status: 139
    ../lib/DBM_Filter/t/compress.t.......... .................................... FAILED--non-zero wait status: 139
    ../t/cpan/IO-Compress/t/105oneshot-zip-bzip2-only.t .................. FAILED--non-zero wait status: 139
    ../lib/DBM_Filter/t/02core.t............ ...................................... FAILED--non-zero wait status: 139
    ../t/cpan/IO-Compress/t/110encode-bzip2.t ............................ FAILED--non-zero wait status: 139
    ../t/cpan/IO-Compress/t/101truncate-bzip2.t .......................... FAILED--non-zero wait status: 139
    ../t/cpan/Module-Build/t/xs.t........... ....................................... FAILED--non-zero wait status: 139
    ../t/cpan/IO-Compress/t/cz-14gzopen.t... ............................... FAILED--non-zero wait status: 139
    ../t/cpan/Compress-Raw-Zlib/t/07bufsize.t ............................ FAILED--non-zero wait status: 139
    ../t/cpan/ExtUtils-MakeMaker/t/PL_FILES.t ............................ FAILED at test 3
    ../ext/DynaLoader/t/DynaLoader.t........ .................................. FAILED--non-zero wait status: 139
    ../t/cpan/IO-Compress/t/106prime-rawdeflate.t ........................ FAILED--non-zero wait status: 139
    ../t/cpan/ExtUtils-Constant/t/Constant.t ............................. FAILED at test 3
    ../t/cpan/IO-Zlib/t/getc.t.............. .......................................... FAILED--non-zero wait status: 139
    ../t/cpan/IO-Compress/t/050interop-gzip.t ............................ FAILED--non-zero wait status: 139
    ../t/cpan/Module-Build/t/properties/release_status.t ................. FAILED--non-zero wait status: 139
    ../t/cpan/Module-Build/t/destinations.t. .............................. FAILED--non-zero wait status: 139
    ../t/op/lex_assign.t.................... .............................................. FAILED--non-zero wait status: 139
    ../t/op/coresubs.t...................... ................................................ FAILED--non-zero wait status: 139
    ../t/cpan/IO-Compress/t/cz-05examples.t. .............................. FAILED at test 2
    ../ext/File-Glob/t/taint.t.............. ........................................ FAILED--non-zero wait status: 139
    ../ext/NDBM_File/t/ndbm.t............... ......................................... FAILED--non-zero wait status: 139
    ../t/cpan/Module-Build/t/script_dist.t.. .............................. FAILED--non-zero wait status: 139
    ../lib/h2xs.t........................... ..................................................... FAILED at test 3
    ../t/cpan/IO-Compress/t/105oneshot-deflate.t ......................... FAILED--non-zero wait status: 139
    ../t/cpan/IO-Compress/t/104destroy-rawdeflate.t ...................... FAILED--non-zero wait status: 139
    ../t/cpan/IO-Zlib/t/large.t............. ......................................... FAILED--non-zero wait status: 139
    ../t/cpan/Module-Build/t/perl_mb_opt.t.. .............................. FAILED--non-zero wait status: 139
    ../t/cpan/IO-Compress/t/107multi-rawdeflate.t ........................ FAILED--non-zero wait status: 139
    ../t/cpan/IO-Compress/t/101truncate-gzip.t ........................... FAILED--non-zero wait status: 139
    ../t/cpan/Archive-Tar/t/02_methods.t.... ................................ FAILED--non-zero wait status: 139
    ../t/cpan/IO-Compress/t/103newtied-zip.t ............................. FAILED--non-zero wait status: 139
    ../t/op/taint.t......................... ................................................... FAILED--non-zero wait status: 139
    ../t/cpan/IO-Compress/t/106prime-bzip2.t ............................. FAILED--non-zero wait status: 139
    ../t/cpan/Archive-Tar/t/06_error.t...... .................................. FAILED--non-zero wait status: 139
    ../t/cpan/IO-Zlib/t/external.t.......... ...................................... FAILED--non-zero wait status: 139
    ../t/porting/maintainers.t.............. ........................................ FAILED--non-zero wait status: 139
    ../t/cpan/CPANPLUS/t/01_CPANPLUS-Configure.t ......................... FAILED--non-zero wait status: 139
    ../lib/ExtUtils/t/Embed.t............... ......................................... FAILED--non-zero wait status: 139
    ../t/cpan/IO-Compress/t/010examples-zlib.t ........................... FAILED at test 2
    ../t/cpan/IO-Compress/t/106prime-gzip.t. .............................. FAILED--non-zero wait status: 139
    ../t/cpan/IO-Zlib/t/import.t............ ........................................ FAILED--non-zero wait status: 139
    ../lib/AnyDBM_File.t.................... .............................................. FAILED--non-zero wait status: 139
    ../t/op/coreamp.t....................... ................................................. FAILED--non-zero wait status: 139
    ../lib/DBM_Filter/t/encode.t............ ...................................... FAILED--non-zero wait status: 139
    ../ext/SDBM_File/t/sdbm.t............... ......................................... FAILED--non-zero wait status: 139
    ../t/cpan/Module-Build/t/tilde.t........ .................................... FAILED--non-zero wait status: 139
    ../t/cpan/Module-Build/t/help.t......... ..................................... FAILED--non-zero wait status: 139
    ../t/cpan/IO-Compress/t/001bzip2.t...... .................................. FAILED--non-zero wait status: 139
    ../t/cpan/IO-Compress/t/104destroy-deflate.t ......................... FAILED--non-zero wait status: 139
    ../lib/feature.t........................ .................................................. FAILED--non-zero wait status: 139
    ../t/cpan/Module-Build/t/ppm.t.......... ...................................... FAILED--non-zero wait status: 139
    ../t/cpan/IO-Compress/t/002any-zip.t.... ................................ FAILED--non-zero wait status: 139
    ../t/cpan/IO-Compress/t/101truncate-deflate.t ........................ FAILED--non-zero wait status: 139
    ../t/porting/exec-bit.t................. ........................................... FAILED--non-zero wait status: 139
    ../ext/File-DosGlob/t/DosGlob.t......... ................................... FAILED--non-zero wait status: 139
    ../t/cpan/IO-Compress/t/107multi-gzip.t. .............................. FAILED--non-zero wait status: 139
    ../lib/warnings.t....................... ................................................. FAILED at test 410
    ../t/dist/XSLoader/t/XSLoader.t......... ..................................... FAILED--non-zero wait status: 139
    ../t/cpan/Module-Build/t/use_tap_harness.t ........................... FAILED--non-zero wait status: 139
    ../t/cpan/IO-Compress/t/107multi-zip.t.. .............................. FAILED--non-zero wait status: 139
    ../t/cpan/IO-Compress/t/100generic-zip.t ............................. FAILED--non-zero wait status: 139
    ../t/cpan/Perl-OSType/t/00-compile.t.... ................................ FAILED--non-zero wait status: 139
    ../t/dist/B-Deparse/t/deparse.t......... ..................................... FAILED--non-zero wait status: 139
    ../t/cpan/Module-Build/t/test_file_exts.t ............................ FAILED--non-zero wait status: 139
    ../t/cpan/Test-Harness/t/proverc.t...... .................................. FAILED--non-zero wait status: 139
    ../t/cpan/Archive-Tar/t/04_resolved_issues.t ......................... FAILED--non-zero wait status: 139
    ../t/cpan/Compress-Raw-Zlib/t/18lvalue.t ............................. FAILED--non-zero wait status: 139
    ../t/cpan/CPANPLUS/t/20_CPANPLUS-Dist-MM.t ........................... FAILED at test 11
    ../t/cpan/IO-Compress/t/01misc.t........ .................................... FAILED--non-zero wait status: 139
    ../lib/DirHandle.t...................... ................................................ FAILED--non-zero wait status: 139
    ../t/cpan/DB_File/t/db-btree.t.......... ...................................... FAILED--non-zero wait status: 139
    ../t/cpan/Module-Build/t/ext.t.......... ...................................... FAILED--non-zero wait status: 139
    ../t/cpan/Archive-Extract/t/01_Archive-Extract.t ..................... FAILED--non-zero wait status: 139
    ../t/cpan/IO-Compress/t/001zlib-generic-gzip.t ....................... FAILED--non-zero wait status: 139
    ../t/op/readdir.t....................... ................................................. FAILED--non-zero wait status: 139
    ../t/cpan/IO-Compress/t/100generic-rawdeflate.t ...................... FAILED--non-zero wait status: 139
    ../t/cpan/ExtUtils-MakeMaker/t/xs.t..... ................................. FAILED at test 4
    ../lib/overload.t....................... ................................................. FAILED--non-zero wait status: 139
    ../t/op/tie_fetch_count.t............... ......................................... FAILED--non-zero wait status: 139
    ../t/cpan/IO-Compress/t/111const-deflate.t ........................... FAILED--non-zero wait status: 139
    ../lib/strict.t......................... ................................................... FAILED--non-zero wait status: 139
    ../t/cpan/IO-Zlib/t/uncomp1.t........... ....................................... FAILED--non-zero wait status: 139
    ../t/cpan/Module-Build/t/PL_files.t..... ................................. FAILED--non-zero wait status: 139
    ../t/cpan/Compress-Raw-Zlib/t/09limitoutput.t ........................ FAILED--non-zero wait status: 139
    ../t/cpan/ExtUtils-MakeMaker/t/INSTALL_BASE.t ........................ FAILED at test 5
    ../t/op/dbm.t........................... ..................................................... FAILED at test 1
    ../t/cpan/IO-Compress/t/110encode-zip.t. .............................. FAILED--non-zero wait status: 139
    ../t/cpan/Module-Build/t/compat/exit.t.. .............................. FAILED at test 1
    ../t/cpan/IO-Compress/t/001zlib-generic-deflate.t .................... FAILED--non-zero wait status: 139
    ../t/cpan/IO-Compress/t/108anyunc-rawdeflate.t ....................... FAILED--non-zero wait status: 139
    ../t/cpan/IO-Compress/t/105oneshot-gzip-only.t ....................... FAILED--non-zero wait status: 139
    ../t/op/glob.t.......................... .................................................... FAILED--non-zero wait status: 139
    ../t/cpan/IO-Compress/t/cz-08encoding.t. .............................. FAILED--non-zero wait status: 139
    ../t/cpan/CPANPLUS/t/25_CPANPLUS.t...... .................................. FAILED--non-zero wait status: 139
    ../t/cpan/Module-Build/t/add_property.t. .............................. FAILED--non-zero wait status: 139
    ../t/cpan/IO-Compress/t/cz-06gzsetp.t... ............................... FAILED--non-zero wait status: 139
    ../t/cpan/IO-Compress/t/103newtied-deflate.t ......................... FAILED--non-zero wait status: 139
    ../t/cpan/Module-Build/t/resume.t....... ................................... FAILED--non-zero wait status: 139
    ../t/cpan/IO-Compress/t/110encode-deflate.t .......................... FAILED--non-zero wait status: 139
    ../lib/charnames.t...................... ................................................ FAILED--non-zero wait status: 139
    ../t/cpan/IO-Compress/t/020isize.t...... .................................. FAILED--non-zero wait status: 139
    ../lib/DBM_Filter/t/null.t.............. ........................................ FAILED--non-zero wait status: 139
    ../t/cpan/Pod-Parser/t/pod/selfcheck.t.. .............................. FAILED--non-zero wait status: 139
    ../t/cpan/IO-Compress/t/102tied-zip.t... ............................... FAILED--non-zero wait status: 139
    ../t/cpan/Module-Build/t/00-compile.t... ............................... FAILED at test 1
    ../t/cpan/IO-Compress/t/105oneshot-bzip2.t ........................... FAILED--non-zero wait status: 139
    ../t/cpan/Module-Build/t/properties/share_dir.t ...................... FAILED--non-zero wait status: 139
    ../t/cpan/CPANPLUS/t/10_CPANPLUS-Error.t ............................. FAILED--non-zero wait status: 139
    ../t/cpan/IO-Compress/t/101truncate-zip.t ............................ FAILED--non-zero wait status: 139
    ../t/cpan/Test-Harness/t/000-load.t..... ................................. FAILED--non-zero wait status: 139
    ../t/cpan/Test-Harness/t/state_results.t ............................. FAILED--non-zero wait status: 139
    ../t/cpan/IO-Compress/t/102tied-gzip.t.. .............................. FAILED--non-zero wait status: 139
    ../t/cpan/CPANPLUS/t/00_CPANPLUS-Internals-Utils.t ................... FAILED--non-zero wait status: 139
    ../t/cpan/IO-Compress/t/106prime-zip.t.. .............................. FAILED--non-zero wait status: 139
    ../t/cpan/CPANPLUS/t/21_CPANPLUS-Dist-No-Build.t ..................... FAILED--non-zero wait status: 139
    ../t/cpan/IO-Compress/t/105oneshot-rawdeflate.t ...................... FAILED--non-zero wait status: 139
    ../lib/DBM_Filter/t/utf8.t.............. ........................................ FAILED--non-zero wait status: 139
    ../t/cpan/Compress-Raw-Zlib/t/02zlib.t.. .............................. FAILED--non-zero wait status: 139
    ../ext/GDBM_File/t/gdbm.t............... ......................................... FAILED--non-zero wait status: 139
    ../t/cpan/CPANPLUS/t/30_CPANPLUS-Internals-Selfupdate.t .............. FAILED--non-zero wait status: 139
    ../t/cpan/Archive-Tar/t/01_use.t........ .................................... FAILED--non-zero wait status: 139
    ../lib/DBM_Filter/t/int32.t............. ....................................... FAILED--non-zero wait status: 139
    ../t/cpan/Module-Build/t/files.t........ .................................... FAILED--non-zero wait status: 139
    ../t/cpan/IO-Compress/t/cz-01version.t.. .............................. FAILED--non-zero wait status: 139
    ../t/cpan/IO-Compress/t/004gziphdr.t.... ................................ FAILED--non-zero wait status: 139
    ../t/cpan/CPANPLUS-Dist-Build/t/01_CPANPLUS-Dist-Build-Constants.t ... FAILED--non-zero wait status: 139
    ../t/cpan/Module-Build/t/manifypods.t... ............................... FAILED--non-zero wait status: 139

[en_US.utf8] -DDEBUGGING -Duseithreads -Accflags=-DPERL_POISON
Inconsistent test results (between TEST and harness):
    ../t/cpan/Module-Build/t/test_type.t.... ................................ FAILED--non-zero wait status: 139
    ../t/cpan/ExtUtils-MakeMaker/t/basic.t.. .............................. FAILED at test 22
    ../t/cpan/IO-Compress/t/001zlib-generic-rawdeflate.t ................. FAILED--non-zero wait status: 139
    ../t/cpan/Module-Build/t/write_default_maniskip.t .................... FAILED--non-zero wait status: 139
    ../t/cpan/IO-Compress/t/109merge-gzip.t. .............................. FAILED--non-zero wait status: 139
    ../t/cpan/Module-Build/t/basic.t........ .................................... FAILED--non-zero wait status: 139
    ../t/cpan/IO-Compress/t/002any-rawdeflate.t .......................... FAILED--non-zero wait status: 139
    ../t/cpan/IO-Compress/t/002any-transparent.t ......................... FAILED--non-zero wait status: 139
    ../t/cpan/IO-Compress/t/107multi-bzip2.t ............................. FAILED--non-zero wait status: 139
    ../t/cpan/ExtUtils-MakeMaker/t/recurs.t. .............................. FAILED at test 6
    ../t/cpan/Module-Build/t/mymeta.t....... ................................... FAILED--non-zero wait status: 139
    ../t/cpan/DB_File/t/db-hash.t........... ....................................... FAILED--non-zero wait status: 139
    ../t/cpan/IO-Compress/t/100generic-gzip.t ............................ FAILED--non-zero wait status: 139
    ../t/cpan/IO-Compress/t/108anyunc-gzip.t ............................. FAILED--non-zero wait status: 139
    ../t/cpan/IO-Compress/t/100generic-bzip2.t ........................... FAILED--non-zero wait status: 139
    ../t/comp/require.t..................... ............................................... FAILED at test 47
    ../t/cpan/IO-Compress/t/104destroy-gzip.t ............................ FAILED--non-zero wait status: 139
    ../t/cpan/Module-Build/t/test_types.t... ............................... FAILED--non-zero wait status: 139
    ../t/cpan/IO-Compress/t/005defhdr.t..... ................................. FAILED--non-zero wait status: 139
    ../t/cpan/ExtUtils-MakeMaker/t/miniperl.t ............................ FAILED at test 5
    ../ext/File-Glob/t/rt114984.t........... ..................................... FAILED--non-zero wait status: 139
    ../t/cpan/IO-Zlib/t/basic.t............. ......................................... FAILED--non-zero wait status: 139
    ../t/cpan/Test-Harness/t/testargs.t..... ................................. FAILED--non-zero wait status: 139
    ../ext/File-Glob/t/global.t............. ....................................... FAILED--non-zero wait status: 139
    ../t/cpan/Test-Harness/t/proverun.t..... ................................. FAILED--non-zero wait status: 139
    ../t/cpan/Test-Harness/t/prove.t........ .................................... FAILED--non-zero wait status: 139
    ../t/cpan/IO-Compress/t/108anyunc-transparent.t ...................... FAILED--non-zero wait status: 139
    ../t/cpan/CPANPLUS/t/02_CPANPLUS-Internals.t ......................... FAILED--non-zero wait status: 139
    ../t/cpan/IO-Compress/t/001zlib-generic-zip.t ........................ FAILED--non-zero wait status: 139
    ../t/cpan/CPANPLUS/t/07_CPANPLUS-Internals-Extract.t ................. FAILED--non-zero wait status: 139
    ../t/cpan/CPANPLUS/t/04_CPANPLUS-Module.t ............................ FAILED at test 109
    ../t/io/perlio.t........................ .................................................. FAILED--non-zero wait status: 139
    ../t/cpan/Module-Build/t/metadata.t..... ................................. FAILED--non-zero wait status: 139
    ../t/cpan/IO-Compress/t/108anyunc-bzip2.t ............................ FAILED--non-zero wait status: 139
    ../t/cpan/CPANPLUS/t/09_CPANPLUS-Internals-Search.t .................. FAILED--non-zero wait status: 139
    ../t/cpan/CPANPLUS/t/06_CPANPLUS-Internals-Constants.t ............... FAILED--non-zero wait status: 139
    ../ext/Pod-Html/t/cache.t............... ......................................... FAILED--non-zero wait status: 139
    ../t/cpan/IO-Compress/t/002any-deflate.t ............................. FAILED--non-zero wait status: 139
    ../t/cpan/Module-Build/t/properties/license.t ........................ FAILED--non-zero wait status: 139
    ../t/cpan/CPANPLUS/t/19_CPANPLUS-Dist.t. .............................. FAILED--non-zero wait status: 139
    ../t/dist/B-Deparse/t/core.t............ ........................................ FAILED--non-zero wait status: 139
    ../t/dist/ExtUtils-Command/t/eu_command.t ............................ FAILED--non-zero wait status: 139
    ../t/cpan/IO-Compress/t/102tied-bzip2.t. .............................. FAILED--non-zero wait status: 139
    ../t/cpan/IO-Compress/t/105oneshot-zip.t ............................. FAILED--non-zero wait status: 139
    ../t/lib/croak.t........................ .................................................. FAILED at test 32
    ../t/cpan/Archive-Tar/t/03_file.t....... ................................... FAILED--non-zero wait status: 139
    ../t/cpan/IO-Compress/t/102tied-deflate.t ............................ FAILED--non-zero wait status: 139
    ../t/cpan/CPANPLUS/t/03_CPANPLUS-Internals-Source.t .................. FAILED--non-zero wait status: 139
    ../t/cpan/IO-Zlib/t/uncomp2.t........... ....................................... FAILED--non-zero wait status: 139
    ../t/porting/diag.t..................... ............................................... FAILED--non-zero wait status: 139
    ../t/cpan/CPANPLUS/t/15_CPANPLUS-Shell.t ............................. FAILED--non-zero wait status: 139
    ../t/cpan/IO-Compress/t/103newtied-rawdeflate.t ...................... FAILED--non-zero wait status: 139
    ../t/cpan/Module-Build/t/properties/requires.t ....................... FAILED--non-zero wait status: 139
    ../t/cpan/IO-Compress/t/107multi-deflate.t ........................... FAILED--non-zero wait status: 139
    ../t/cpan/Compress-Raw-Bzip2/t/09limitoutput.t ....................... FAILED--non-zero wait status: 139
    ../lib/DBM_Filter/t/01error.t........... ..................................... FAILED--non-zero wait status: 139
    ../t/cpan/CPANPLUS/t/08_CPANPLUS-Backend.t ........................... FAILED--non-zero wait status: 139
    ../t/cpan/Module-Build/t/properties/needs_compiler.t ................. FAILED--non-zero wait status: 139
    ../t/cpan/IO-Compress/t/100generic-deflate.t ......................... FAILED--non-zero wait status: 139
    ../t/cpan/IO-Compress/t/102tied-rawdeflate.t ......................... FAILED--non-zero wait status: 139
    ../t/cpan/IO-Compress/t/104destroy-bzip2.t ........................... FAILED--non-zero wait status: 139
    ../t/cpan/IO-Compress/t/103newtied-gzip.t ............................ FAILED--non-zero wait status: 139
    ../t/cpan/CPANPLUS/t/05_CPANPLUS-Internals-Fetch.t ................... FAILED--non-zero wait status: 139
    ../t/cpan/Archive-Tar/t/05_iter.t....... ................................... FAILED--non-zero wait status: 139
    ../t/cpan/IO-Compress/t/006zip.t........ .................................... FAILED--non-zero wait status: 139
    ../lib/subs.t........................... ..................................................... FAILED--non-zero wait status: 139
    ../t/cpan/IO-Compress/t/106prime-deflate.t ........................... FAILED--non-zero wait status: 139
    ../t/cpan/IO-Compress/t/101truncate-rawdeflate.t ..................... FAILED--non-zero wait status: 139
    ../t/cpan/IO-Compress/t/105oneshot-gzip.t ............................ FAILED--non-zero wait status: 139
    ../t/cpan/Module-Build/t/properties/dist_suffix.t .................... FAILED--non-zero wait status: 139
    ../t/op/local.t......................... ................................................... FAILED--non-zero wait status: 139
    ../t/cpan/Module-Build/t/metadata2.t.... ................................ FAILED--non-zero wait status: 139
    ../t/cpan/Module-Build/t/actions/installdeps.t ....................... FAILED--non-zero wait status: 139
    ../t/cpan/Test-Harness/t/perl5lib.t..... ................................. FAILED--non-zero wait status: 139
    ../t/cpan/IO-Compress/t/110encode-gzip.t ............................. FAILED--non-zero wait status: 139
    ../t/cpan/Module-Build/t/runthrough.t... ............................... FAILED at test 13
    ../ext/File-Glob/t/case.t............... ......................................... FAILED--non-zero wait status: 139
    ../t/cpan/ExtUtils-MakeMaker/t/revision.t ............................ FAILED--non-zero wait status: 139
    ../t/cpan/IO-Compress/t/108anyunc-deflate.t .......................... FAILED--non-zero wait status: 139
    ../t/cpan/IO-Compress/t/105oneshot-zip-only.t ........................ FAILED--non-zero wait status: 139
    ../t/cpan/Module-Build/t/compat.t....... ................................... FAILED at test 4
    ../t/cpan/Module-Build/t/sample.t....... ................................... FAILED--non-zero wait status: 139
    ../t/cpan/Module-Build/t/new_from_context.t .......................... FAILED--non-zero wait status: 139
    ../t/cpan/IO-Compress/t/108anyunc-zip.t. .............................. FAILED--non-zero wait status: 139
    ../t/op/lex.t........................... ..................................................... FAILED at test 5
    ../t/cpan/Module-Build/t/properties/module_name.t .................... FAILED--non-zero wait status: 139
    ../t/cpan/ExtUtils-MakeMaker/t/maketext_filter.t ..................... FAILED--non-zero wait status: 139
    ../t/cpan/IO-Compress/t/104destroy-zip.t ............................. FAILED--non-zero wait status: 139
    ../t/cpan/Test-Harness/t/state.t........ .................................... FAILED--non-zero wait status: 139
    ../t/cpan/IO-Compress/t/109merge-rawdeflate.t ........................ FAILED--non-zero wait status: 139
    ../t/cpan/IO-Compress/t/010examples-bzip2.t .......................... FAILED at test 2
    ../t/cpan/IO-Compress/t/cz-03zlib-v1.t.. .............................. FAILED--non-zero wait status: 139
    ../t/cpan/Test-Harness/t/proveenv.t..... ................................. FAILED--non-zero wait status: 139
    ../t/cpan/ExtUtils-MakeMaker/t/cd.t..... ................................. FAILED--non-zero wait status: 139
    ../t/cpan/IO-Compress/t/000prereq.t..... ................................. FAILED--non-zero wait status: 139
    ../t/op/defins.t........................ .................................................. FAILED--non-zero wait status: 139
    ../t/cpan/Module-Build/t/extend.t....... ................................... FAILED--non-zero wait status: 139
    ../t/cpan/IO-Compress/t/002any-gzip.t... ............................... FAILED--non-zero wait status: 139
    ../t/cpan/IO-Compress/t/110encode-rawdeflate.t ....................... FAILED--non-zero wait status: 139
    ../t/cpan/CPANPLUS-Dist-Build/t/02_CPANPLUS-Dist-Build.t ............. FAILED at test 5
    ../t/cpan/IO-Compress/t/105oneshot-zip-store-only.t .................. FAILED--non-zero wait status: 139
    ../t/cpan/Module-Build/t/actions/manifest_skip.t ..................... FAILED--non-zero wait status: 139
    ../t/cpan/IO-Compress/t/103newtied-bzip2.t ........................... FAILED--non-zero wait status: 139
    ../t/cpan/CPANPLUS/t/40_CPANPLUS-Internals-Report.t .................. FAILED--non-zero wait status: 139
    ../t/cpan/Module-Build/t/parents.t...... .................................. FAILED--non-zero wait status: 139
    ../t/cpan/Module-Build/t/notes.t........ .................................... FAILED--non-zero wait status: 139
    ../t/dist/ExtUtils-Install/t/InstallWithMM.t ......................... FAILED at test 4
    ../t/dist/IO/t/io_dir.t................. ............................................. FAILED--non-zero wait status: 139
    ../t/cpan/ExtUtils-MakeMaker/t/pm_to_blib.t .......................... FAILED at test 4
    ../t/cpan/Module-Build/t/bundle_inc.t... ............................... FAILED--non-zero wait status: 139
    ../ext/File-Glob/t/basic.t.............. ........................................ FAILED--non-zero wait status: 139
    ../t/cpan/Module-Build/t/versions.t..... ................................. FAILED--non-zero wait status: 139
    ../t/cpan/Module-Build/t/install.t...... .................................. FAILED--non-zero wait status: 139
    ../t/cpan/ExtUtils-MakeMaker/t/00compile.t ........................... FAILED--non-zero wait status: 139
    ../t/cpan/IO-Zlib/t/getline.t........... ....................................... FAILED--non-zero wait status: 139
    ../t/cpan/IO-Compress/t/globmapper.t.... ................................ FAILED--non-zero wait status: 139
    ../t/porting/customized.t............... ......................................... FAILED--non-zero wait status: 139
    ../t/cpan/IO-Zlib/t/tied.t.............. .......................................... FAILED--non-zero wait status: 139
    ../t/cpan/Module-Build/t/debug.t........ .................................... FAILED--non-zero wait status: 139
    ../t/dist/ExtUtils-Command/t/cp.t....... ................................... FAILED--non-zero wait status: 139
    ../t/op/svleak.t........................ .................................................. FAILED--non-zero wait status: 139
    ../t/cpan/IO-Compress/t/109merge-deflate.t ........................... FAILED--non-zero wait status: 139
    ../t/cpan/Module-Build/t/install_extra_target.t ...................... FAILED--non-zero wait status: 139
    ../lib/DBM_Filter/t/compress.t.......... .................................... FAILED--non-zero wait status: 139
    ../t/cpan/IO-Compress/t/105oneshot-zip-bzip2-only.t .................. FAILED--non-zero wait status: 139
    ../lib/DBM_Filter/t/02core.t............ ...................................... FAILED--non-zero wait status: 139
    ../t/cpan/IO-Compress/t/110encode-bzip2.t ............................ FAILED--non-zero wait status: 139
    ../t/cpan/IO-Compress/t/101truncate-bzip2.t .......................... FAILED--non-zero wait status: 139
    ../t/cpan/Module-Build/t/xs.t........... ....................................... FAILED--non-zero wait status: 139
    ../t/cpan/IO-Compress/t/cz-14gzopen.t... ............................... FAILED--non-zero wait status: 139
    ../t/cpan/Compress-Raw-Zlib/t/07bufsize.t ............................ FAILED--non-zero wait status: 139
    ../t/cpan/ExtUtils-MakeMaker/t/PL_FILES.t ............................ FAILED at test 3
    ../ext/DynaLoader/t/DynaLoader.t........ .................................. FAILED--non-zero wait status: 139
    ../t/cpan/IO-Compress/t/106prime-rawdeflate.t ........................ FAILED--non-zero wait status: 139
    ../t/cpan/ExtUtils-Constant/t/Constant.t ............................. FAILED at test 3
    ../t/cpan/IO-Zlib/t/getc.t.............. .......................................... FAILED--non-zero wait status: 139
    ../t/cpan/IO-Compress/t/050interop-gzip.t ............................ FAILED--non-zero wait status: 139
    ../t/cpan/Module-Build/t/properties/release_status.t ................. FAILED--non-zero wait status: 139
    ../t/cpan/Module-Build/t/destinations.t. .............................. FAILED--non-zero wait status: 139
    ../t/op/lex_assign.t.................... .............................................. FAILED--non-zero wait status: 139
    ../t/op/coresubs.t...................... ................................................ FAILED--non-zero wait status: 139
    ../t/cpan/IO-Compress/t/cz-05examples.t. .............................. FAILED at test 2
    ../ext/File-Glob/t/taint.t.............. ........................................ FAILED--non-zero wait status: 139
    ../ext/NDBM_File/t/ndbm.t............... ......................................... FAILED--non-zero wait status: 139
    ../t/cpan/Module-Build/t/script_dist.t.. .............................. FAILED--non-zero wait status: 139
    ../lib/h2xs.t........................... ..................................................... FAILED at test 3
    ../t/cpan/IO-Compress/t/105oneshot-deflate.t ......................... FAILED--non-zero wait status: 139
    ../t/cpan/IO-Compress/t/104destroy-rawdeflate.t ...................... FAILED--non-zero wait status: 139
    ../t/cpan/IO-Zlib/t/large.t............. ......................................... FAILED--non-zero wait status: 139
    ../t/cpan/Module-Build/t/perl_mb_opt.t.. .............................. FAILED--non-zero wait status: 139
    ../t/cpan/IO-Compress/t/107multi-rawdeflate.t ........................ FAILED--non-zero wait status: 139
    ../t/cpan/IO-Compress/t/101truncate-gzip.t ........................... FAILED--non-zero wait status: 139
    ../t/cpan/Archive-Tar/t/02_methods.t.... ................................ FAILED--non-zero wait status: 139
    ../t/cpan/IO-Compress/t/103newtied-zip.t ............................. FAILED--non-zero wait status: 139
    ../t/op/taint.t......................... ................................................... FAILED--non-zero wait status: 139
    ../t/cpan/IO-Compress/t/106prime-bzip2.t ............................. FAILED--non-zero wait status: 139
    ../t/cpan/Archive-Tar/t/06_error.t...... .................................. FAILED--non-zero wait status: 139
    ../t/cpan/IO-Zlib/t/external.t.......... ...................................... FAILED--non-zero wait status: 139
    ../t/porting/maintainers.t.............. ........................................ FAILED--non-zero wait status: 139
    ../t/cpan/CPANPLUS/t/01_CPANPLUS-Configure.t ......................... FAILED--non-zero wait status: 139
    ../lib/ExtUtils/t/Embed.t............... ......................................... FAILED--non-zero wait status: 139
    ../t/cpan/IO-Compress/t/010examples-zlib.t ........................... FAILED at test 2
    ../t/cpan/IO-Compress/t/106prime-gzip.t. .............................. FAILED--non-zero wait status: 139
    ../t/cpan/IO-Zlib/t/import.t............ ........................................ FAILED--non-zero wait status: 139
    ../lib/AnyDBM_File.t.................... .............................................. FAILED--non-zero wait status: 139
    ../t/op/coreamp.t....................... ................................................. FAILED--non-zero wait status: 139
    ../lib/DBM_Filter/t/encode.t............ ...................................... FAILED--non-zero wait status: 139
    ../ext/SDBM_File/t/sdbm.t............... ......................................... FAILED--non-zero wait status: 139
    ../t/cpan/Module-Build/t/tilde.t........ .................................... FAILED--non-zero wait status: 139
    ../t/cpan/Module-Build/t/help.t......... ..................................... FAILED--non-zero wait status: 139
    ../t/cpan/IO-Compress/t/001bzip2.t...... .................................. FAILED--non-zero wait status: 139
    ../t/cpan/IO-Compress/t/104destroy-deflate.t ......................... FAILED--non-zero wait status: 139
    ../lib/feature.t........................ .................................................. FAILED--non-zero wait status: 139
    ../t/cpan/Module-Build/t/ppm.t.......... ...................................... FAILED--non-zero wait status: 139
    ../t/cpan/IO-Compress/t/002any-zip.t.... ................................ FAILED--non-zero wait status: 139
    ../t/cpan/IO-Compress/t/101truncate-deflate.t ........................ FAILED--non-zero wait status: 139
    ../t/porting/exec-bit.t................. ........................................... FAILED--non-zero wait status: 139
    ../ext/File-DosGlob/t/DosGlob.t......... ................................... FAILED--non-zero wait status: 139
    ../t/cpan/IO-Compress/t/107multi-gzip.t. .............................. FAILED--non-zero wait status: 139
    ../lib/warnings.t....................... ................................................. FAILED at test 410
    ../t/dist/XSLoader/t/XSLoader.t......... ..................................... FAILED--non-zero wait status: 139
    ../t/cpan/Module-Build/t/use_tap_harness.t ........................... FAILED--non-zero wait status: 139
    ../t/cpan/IO-Compress/t/107multi-zip.t.. .............................. FAILED--non-zero wait status: 139
    ../t/cpan/IO-Compress/t/100generic-zip.t ............................. FAILED--non-zero wait status: 139
    ../t/cpan/Perl-OSType/t/00-compile.t.... ................................ FAILED--non-zero wait status: 139
    ../t/dist/B-Deparse/t/deparse.t......... ..................................... FAILED--non-zero wait status: 139
    ../t/cpan/Module-Build/t/test_file_exts.t ............................ FAILED--non-zero wait status: 139
    ../t/cpan/Test-Harness/t/proverc.t...... .................................. FAILED--non-zero wait status: 139
    ../t/cpan/Archive-Tar/t/04_resolved_issues.t ......................... FAILED--non-zero wait status: 139
    ../t/cpan/Compress-Raw-Zlib/t/18lvalue.t ............................. FAILED--non-zero wait status: 139
    ../t/cpan/CPANPLUS/t/20_CPANPLUS-Dist-MM.t ........................... FAILED at test 11
    ../t/cpan/IO-Compress/t/01misc.t........ .................................... FAILED--non-zero wait status: 139
    ../lib/DirHandle.t...................... ................................................ FAILED--non-zero wait status: 139
    ../t/cpan/DB_File/t/db-btree.t.......... ...................................... FAILED--non-zero wait status: 139
    ../t/cpan/Module-Build/t/ext.t.......... ...................................... FAILED--non-zero wait status: 139
    ../t/cpan/Archive-Extract/t/01_Archive-Extract.t ..................... FAILED--non-zero wait status: 139
    ../t/cpan/IO-Compress/t/001zlib-generic-gzip.t ....................... FAILED--non-zero wait status: 139
    ../t/op/readdir.t....................... ................................................. FAILED--non-zero wait status: 139
    ../t/cpan/IO-Compress/t/100generic-rawdeflate.t ...................... FAILED--non-zero wait status: 139
    ../t/cpan/ExtUtils-MakeMaker/t/xs.t..... ................................. FAILED at test 4
    ../lib/overload.t....................... ................................................. FAILED--non-zero wait status: 139
    ../t/op/tie_fetch_count.t............... ......................................... FAILED--non-zero wait status: 139
    ../t/cpan/IO-Compress/t/111const-deflate.t ........................... FAILED--non-zero wait status: 139
    ../lib/strict.t......................... ................................................... FAILED--non-zero wait status: 139
    ../t/cpan/IO-Zlib/t/uncomp1.t........... ....................................... FAILED--non-zero wait status: 139
    ../t/cpan/Module-Build/t/PL_files.t..... ................................. FAILED--non-zero wait status: 139
    ../t/cpan/Compress-Raw-Zlib/t/09limitoutput.t ........................ FAILED--non-zero wait status: 139
    ../t/cpan/ExtUtils-MakeMaker/t/INSTALL_BASE.t ........................ FAILED at test 5
    ../t/op/dbm.t........................... ..................................................... FAILED at test 1
    ../t/cpan/IO-Compress/t/110encode-zip.t. .............................. FAILED--non-zero wait status: 139
    ../t/cpan/Module-Build/t/compat/exit.t.. .............................. FAILED at test 1
    ../t/cpan/IO-Compress/t/001zlib-generic-deflate.t .................... FAILED--non-zero wait status: 139
    ../t/cpan/IO-Compress/t/108anyunc-rawdeflate.t ....................... FAILED--non-zero wait status: 139
    ../t/cpan/IO-Compress/t/105oneshot-gzip-only.t ....................... FAILED--non-zero wait status: 139
    ../t/op/glob.t.......................... .................................................... FAILED--non-zero wait status: 139
    ../t/cpan/IO-Compress/t/cz-08encoding.t. .............................. FAILED--non-zero wait status: 139
    ../t/cpan/CPANPLUS/t/25_CPANPLUS.t...... .................................. FAILED--non-zero wait status: 139
    ../t/cpan/Module-Build/t/add_property.t. .............................. FAILED--non-zero wait status: 139
    ../t/cpan/IO-Compress/t/cz-06gzsetp.t... ............................... FAILED--non-zero wait status: 139
    ../t/cpan/IO-Compress/t/103newtied-deflate.t ......................... FAILED--non-zero wait status: 139
    ../t/cpan/Module-Build/t/resume.t....... ................................... FAILED--non-zero wait status: 139
    ../t/cpan/IO-Compress/t/110encode-deflate.t .......................... FAILED--non-zero wait status: 139
    ../lib/charnames.t...................... ................................................ FAILED--non-zero wait status: 139
    ../t/cpan/IO-Compress/t/020isize.t...... .................................. FAILED--non-zero wait status: 139
    ../lib/DBM_Filter/t/null.t.............. ........................................ FAILED--non-zero wait status: 139
    ../t/cpan/Pod-Parser/t/pod/selfcheck.t.. .............................. FAILED--non-zero wait status: 139
    ../t/cpan/IO-Compress/t/102tied-zip.t... ............................... FAILED--non-zero wait status: 139
    ../t/cpan/Module-Build/t/00-compile.t... ............................... FAILED at test 1
    ../t/cpan/IO-Compress/t/105oneshot-bzip2.t ........................... FAILED--non-zero wait status: 139
    ../t/cpan/Module-Build/t/properties/share_dir.t ...................... FAILED--non-zero wait status: 139
    ../t/cpan/CPANPLUS/t/10_CPANPLUS-Error.t ............................. FAILED--non-zero wait status: 139
    ../t/cpan/IO-Compress/t/101truncate-zip.t ............................ FAILED--non-zero wait status: 139
    ../t/cpan/Test-Harness/t/000-load.t..... ................................. FAILED--non-zero wait status: 139
    ../t/cpan/Test-Harness/t/state_results.t ............................. FAILED--non-zero wait status: 139
    ../t/cpan/IO-Compress/t/102tied-gzip.t.. .............................. FAILED--non-zero wait status: 139
    ../t/cpan/CPANPLUS/t/00_CPANPLUS-Internals-Utils.t ................... FAILED--non-zero wait status: 139
    ../t/cpan/IO-Compress/t/106prime-zip.t.. .............................. FAILED--non-zero wait status: 139
    ../t/cpan/CPANPLUS/t/21_CPANPLUS-Dist-No-Build.t ..................... FAILED--non-zero wait status: 139
    ../t/cpan/IO-Compress/t/105oneshot-rawdeflate.t ...................... FAILED--non-zero wait status: 139
    ../lib/DBM_Filter/t/utf8.t.............. ........................................ FAILED--non-zero wait status: 139
    ../t/cpan/Compress-Raw-Zlib/t/02zlib.t.. .............................. FAILED--non-zero wait status: 139
    ../ext/GDBM_File/t/gdbm.t............... ......................................... FAILED--non-zero wait status: 139
    ../t/cpan/CPANPLUS/t/30_CPANPLUS-Internals-Selfupdate.t .............. FAILED--non-zero wait status: 139
    ../t/cpan/Archive-Tar/t/01_use.t........ .................................... FAILED--non-zero wait status: 139
    ../lib/DBM_Filter/t/int32.t............. ....................................... FAILED--non-zero wait status: 139
    ../t/cpan/Module-Build/t/files.t........ .................................... FAILED--non-zero wait status: 139
    ../t/cpan/IO-Compress/t/cz-01version.t.. .............................. FAILED--non-zero wait status: 139
    ../t/cpan/IO-Compress/t/004gziphdr.t.... ................................ FAILED--non-zero wait status: 139
    ../t/cpan/CPANPLUS-Dist-Build/t/01_CPANPLUS-Dist-Build-Constants.t ... FAILED--non-zero wait status: 139
    ../t/cpan/Module-Build/t/manifypods.t... ............................... FAILED--non-zero wait status: 139

[stdio] -DDEBUGGING -Duseithreads -Dusemorebits -Accflags=-DPERL_GLOBAL_STRUCT
Inconsistent test results (between TEST and harness):
    ../t/cpan/Module-Build/t/test_type.t.... ................................ FAILED--non-zero wait status: 139
    ../t/cpan/ExtUtils-MakeMaker/t/basic.t.. .............................. FAILED at test 23
    ../t/cpan/IO-Compress/t/001zlib-generic-rawdeflate.t ................. FAILED--non-zero wait status: 139
    ../t/cpan/Module-Build/t/write_default_maniskip.t .................... FAILED--non-zero wait status: 139
    ../t/cpan/IO-Compress/t/109merge-gzip.t. .............................. FAILED--non-zero wait status: 139
    ../t/cpan/Module-Build/t/basic.t........ .................................... FAILED--non-zero wait status: 139
    ../t/cpan/IO-Compress/t/002any-rawdeflate.t .......................... FAILED--non-zero wait status: 139
    ../t/cpan/IO-Compress/t/002any-transparent.t ......................... FAILED--non-zero wait status: 139
    ../t/cpan/IO-Compress/t/107multi-bzip2.t ............................. FAILED--non-zero wait status: 139
    ../t/cpan/ExtUtils-MakeMaker/t/recurs.t. .............................. FAILED at test 6
    ../t/cpan/Module-Build/t/mymeta.t....... ................................... FAILED--non-zero wait status: 139
    ../t/cpan/DB_File/t/db-hash.t........... ....................................... FAILED--non-zero wait status: 139
    ../t/cpan/IO-Compress/t/100generic-gzip.t ............................ FAILED--non-zero wait status: 139
    ../t/cpan/IO-Compress/t/108anyunc-gzip.t ............................. FAILED--non-zero wait status: 139
    ../t/cpan/IO-Compress/t/100generic-bzip2.t ........................... FAILED--non-zero wait status: 139
    ../t/cpan/IO-Compress/t/104destroy-gzip.t ............................ FAILED--non-zero wait status: 139
    ../t/cpan/Module-Build/t/test_types.t... ............................... FAILED--non-zero wait status: 139
    ../t/cpan/IO-Compress/t/005defhdr.t..... ................................. FAILED--non-zero wait status: 139
    ../t/cpan/ExtUtils-MakeMaker/t/miniperl.t ............................ FAILED at test 5
    ../ext/File-Glob/t/rt114984.t........... ..................................... FAILED--non-zero wait status: 139
    ../t/cpan/IO-Zlib/t/basic.t............. ......................................... FAILED--non-zero wait status: 139
    ../t/cpan/Test-Harness/t/testargs.t..... ................................. FAILED--non-zero wait status: 139
    ../ext/File-Glob/t/global.t............. ....................................... FAILED--non-zero wait status: 139
    ../t/cpan/Test-Harness/t/proverun.t..... ................................. FAILED--non-zero wait status: 139
    ../t/cpan/Test-Harness/t/prove.t........ .................................... FAILED--non-zero wait status: 139
    ../t/cpan/IO-Compress/t/108anyunc-transparent.t ...................... FAILED--non-zero wait status: 139
    ../t/cpan/CPANPLUS/t/02_CPANPLUS-Internals.t ......................... FAILED--non-zero wait status: 139
    ../t/cpan/IO-Compress/t/001zlib-generic-zip.t ........................ FAILED--non-zero wait status: 139
    ../t/cpan/CPANPLUS/t/07_CPANPLUS-Internals-Extract.t ................. FAILED--non-zero wait status: 139
    ../t/cpan/CPANPLUS/t/04_CPANPLUS-Module.t ............................ FAILED--non-zero wait status: 139
    ../t/cpan/Module-Build/t/metadata.t..... ................................. FAILED--non-zero wait status: 139
    ../t/cpan/IO-Compress/t/108anyunc-bzip2.t ............................ FAILED--non-zero wait status: 139
    ../t/cpan/CPANPLUS/t/09_CPANPLUS-Internals-Search.t .................. FAILED--non-zero wait status: 139
    ../t/cpan/CPANPLUS/t/06_CPANPLUS-Internals-Constants.t ............... FAILED--non-zero wait status: 139
    ../ext/Pod-Html/t/cache.t............... ......................................... FAILED--non-zero wait status: 139
    ../t/cpan/IO-Compress/t/002any-deflate.t ............................. FAILED--non-zero wait status: 139
    ../t/cpan/Module-Build/t/properties/license.t ........................ FAILED--non-zero wait status: 139
    ../t/cpan/CPANPLUS/t/19_CPANPLUS-Dist.t. .............................. FAILED--non-zero wait status: 139
    ../t/dist/B-Deparse/t/core.t............ ........................................ FAILED--non-zero wait status: 139
    ../t/cpan/IO-Compress/t/102tied-bzip2.t. .............................. FAILED--non-zero wait status: 139
    ../t/cpan/IO-Compress/t/105oneshot-zip.t ............................. FAILED--non-zero wait status: 139
    ../t/cpan/Archive-Tar/t/03_file.t....... ................................... FAILED--non-zero wait status: 139
    ../t/cpan/IO-Compress/t/102tied-deflate.t ............................ FAILED--non-zero wait status: 139
    ../t/cpan/CPANPLUS/t/03_CPANPLUS-Internals-Source.t .................. FAILED--non-zero wait status: 139
    ../t/cpan/IO-Zlib/t/uncomp2.t........... ....................................... FAILED--non-zero wait status: 139
    ../t/cpan/CPANPLUS/t/15_CPANPLUS-Shell.t ............................. FAILED--non-zero wait status: 139
    ../t/cpan/IO-Compress/t/103newtied-rawdeflate.t ...................... FAILED--non-zero wait status: 139
    ../t/cpan/Module-Build/t/properties/requires.t ....................... FAILED--non-zero wait status: 139
    ../t/cpan/IO-Compress/t/107multi-deflate.t ........................... FAILED--non-zero wait status: 139
    ../t/cpan/Compress-Raw-Bzip2/t/09limitoutput.t ....................... FAILED--non-zero wait status: 139
    ../lib/DBM_Filter/t/01error.t........... ..................................... FAILED--non-zero wait status: 139
    ../t/cpan/CPANPLUS/t/08_CPANPLUS-Backend.t ........................... FAILED--non-zero wait status: 139
    ../t/cpan/Module-Build/t/properties/needs_compiler.t ................. FAILED--non-zero wait status: 139
    ../t/cpan/IO-Compress/t/100generic-deflate.t ......................... FAILED--non-zero wait status: 139
    ../t/cpan/IO-Compress/t/102tied-rawdeflate.t ......................... FAILED--non-zero wait status: 139
    ../t/cpan/IO-Compress/t/104destroy-bzip2.t ........................... FAILED--non-zero wait status: 139
    ../t/cpan/IO-Compress/t/103newtied-gzip.t ............................ FAILED--non-zero wait status: 139
    ../t/cpan/CPANPLUS/t/05_CPANPLUS-Internals-Fetch.t ................... FAILED--non-zero wait status: 139
    ../t/cpan/Archive-Tar/t/05_iter.t....... ................................... FAILED--non-zero wait status: 139
    ../t/cpan/IO-Compress/t/006zip.t........ .................................... FAILED--non-zero wait status: 139
    ../t/cpan/IO-Compress/t/106prime-deflate.t ........................... FAILED--non-zero wait status: 139
    ../t/cpan/IO-Compress/t/101truncate-rawdeflate.t ..................... FAILED--non-zero wait status: 139
    ../t/cpan/IO-Compress/t/105oneshot-gzip.t ............................ FAILED--non-zero wait status: 139
    ../t/cpan/Module-Build/t/properties/dist_suffix.t .................... FAILED--non-zero wait status: 139
    ../t/cpan/Module-Build/t/metadata2.t.... ................................ FAILED--non-zero wait status: 139
    ../t/cpan/Module-Build/t/actions/installdeps.t ....................... FAILED--non-zero wait status: 139
    ../t/cpan/Test-Harness/t/perl5lib.t..... ................................. FAILED--non-zero wait status: 139
    ../t/cpan/IO-Compress/t/110encode-gzip.t ............................. FAILED--non-zero wait status: 139
    ../t/cpan/Module-Build/t/runthrough.t... ............................... FAILED at test 13
    ../ext/File-Glob/t/case.t............... ......................................... FAILED--non-zero wait status: 139
    ../t/cpan/ExtUtils-MakeMaker/t/revision.t ............................ FAILED--non-zero wait status: 139
    ../t/cpan/IO-Compress/t/108anyunc-deflate.t .......................... FAILED--non-zero wait status: 139
    ../t/cpan/IO-Compress/t/105oneshot-zip-only.t ........................ FAILED--non-zero wait status: 139
    ../t/cpan/Module-Build/t/compat.t....... ................................... FAILED at test 4
    ../t/cpan/Module-Build/t/sample.t....... ................................... FAILED--non-zero wait status: 139
    ../t/cpan/Module-Build/t/new_from_context.t .......................... FAILED--non-zero wait status: 139
    ../t/cpan/IO-Compress/t/108anyunc-zip.t. .............................. FAILED--non-zero wait status: 139
    ../t/cpan/Module-Build/t/properties/module_name.t .................... FAILED--non-zero wait status: 139
    ../t/cpan/ExtUtils-MakeMaker/t/maketext_filter.t ..................... FAILED--non-zero wait status: 139
    ../t/cpan/IO-Compress/t/104destroy-zip.t ............................. FAILED--non-zero wait status: 139
    ../t/cpan/Test-Harness/t/state.t........ .................................... FAILED--non-zero wait status: 139
    ../t/cpan/IO-Compress/t/109merge-rawdeflate.t ........................ FAILED--non-zero wait status: 139
    ../t/cpan/IO-Compress/t/010examples-bzip2.t .......................... FAILED at test 2
    ../t/cpan/IO-Compress/t/cz-03zlib-v1.t.. .............................. FAILED--non-zero wait status: 139
    ../t/cpan/Test-Harness/t/proveenv.t..... ................................. FAILED--non-zero wait status: 139
    ../t/cpan/ExtUtils-MakeMaker/t/cd.t..... ................................. FAILED--non-zero wait status: 139
    ../t/cpan/IO-Compress/t/000prereq.t..... ................................. FAILED--non-zero wait status: 139
    ../t/cpan/Module-Build/t/extend.t....... ................................... FAILED--non-zero wait status: 139
    ../t/cpan/IO-Compress/t/002any-gzip.t... ............................... FAILED--non-zero wait status: 139
    ../t/cpan/IO-Compress/t/110encode-rawdeflate.t ....................... FAILED--non-zero wait status: 139
    ../t/cpan/CPANPLUS-Dist-Build/t/02_CPANPLUS-Dist-Build.t ............. FAILED at test 5
    ../t/cpan/IO-Compress/t/105oneshot-zip-store-only.t .................. FAILED--non-zero wait status: 139
    ../t/cpan/Module-Build/t/actions/manifest_skip.t ..................... FAILED--non-zero wait status: 139
    ../t/cpan/IO-Compress/t/103newtied-bzip2.t ........................... FAILED--non-zero wait status: 139
    ../t/cpan/CPANPLUS/t/40_CPANPLUS-Internals-Report.t .................. FAILED--non-zero wait status: 139
    ../t/cpan/Module-Build/t/parents.t...... .................................. FAILED--non-zero wait status: 139
    ../t/cpan/Module-Build/t/notes.t........ .................................... FAILED--non-zero wait status: 139
    ../t/dist/IO/t/io_dir.t................. ............................................. FAILED--non-zero wait status: 139
    ../t/cpan/ExtUtils-MakeMaker/t/pm_to_blib.t .......................... FAILED at test 4
    ../t/cpan/Module-Build/t/bundle_inc.t... ............................... FAILED--non-zero wait status: 139
    ../ext/File-Glob/t/basic.t.............. ........................................ FAILED--non-zero wait status: 139
    ../t/cpan/Module-Build/t/versions.t..... ................................. FAILED--non-zero wait status: 139
    ../t/cpan/Module-Build/t/install.t...... .................................. FAILED--non-zero wait status: 139
    ../t/cpan/ExtUtils-MakeMaker/t/00compile.t ........................... FAILED--non-zero wait status: 139
    ../t/cpan/IO-Zlib/t/getline.t........... ....................................... FAILED--non-zero wait status: 139
    ../t/cpan/IO-Compress/t/globmapper.t.... ................................ FAILED--non-zero wait status: 139
    ../t/cpan/IO-Zlib/t/tied.t.............. .......................................... FAILED--non-zero wait status: 139
    ../t/cpan/Module-Build/t/debug.t........ .................................... FAILED--non-zero wait status: 139
    ../t/op/svleak.t........................ .................................................. FAILED--non-zero wait status: 139
    ../t/cpan/IO-Compress/t/109merge-deflate.t ........................... FAILED--non-zero wait status: 139
    ../t/cpan/Module-Build/t/install_extra_target.t ...................... FAILED--non-zero wait status: 139
    ../lib/DBM_Filter/t/compress.t.......... .................................... FAILED--non-zero wait status: 139
    ../t/cpan/IO-Compress/t/105oneshot-zip-bzip2-only.t .................. FAILED--non-zero wait status: 139
    ../lib/DBM_Filter/t/02core.t............ ...................................... FAILED--non-zero wait status: 139
    ../t/cpan/IO-Compress/t/110encode-bzip2.t ............................ FAILED--non-zero wait status: 139
    ../t/cpan/IO-Compress/t/101truncate-bzip2.t .......................... FAILED--non-zero wait status: 139
    ../t/cpan/Module-Build/t/xs.t........... ....................................... FAILED--non-zero wait status: 139
    ../t/cpan/IO-Compress/t/cz-14gzopen.t... ............................... FAILED--non-zero wait status: 139
    ../t/cpan/Compress-Raw-Zlib/t/07bufsize.t ............................ FAILED--non-zero wait status: 139
    ../ext/DynaLoader/t/DynaLoader.t........ .................................. FAILED--non-zero wait status: 139
    ../t/cpan/IO-Compress/t/106prime-rawdeflate.t ........................ FAILED--non-zero wait status: 139
    ../t/cpan/IO-Zlib/t/getc.t.............. .......................................... FAILED--non-zero wait status: 139
    ../t/cpan/IO-Compress/t/050interop-gzip.t ............................ FAILED--non-zero wait status: 139
    ../t/cpan/Module-Build/t/properties/release_status.t ................. FAILED--non-zero wait status: 139
    ../t/cpan/Module-Build/t/destinations.t. .............................. FAILED--non-zero wait status: 139
    ../t/op/coresubs.t...................... ................................................ FAILED--non-zero wait status: 139
    ../t/cpan/IO-Compress/t/cz-05examples.t. .............................. FAILED at test 2
    ../ext/File-Glob/t/taint.t.............. ........................................ FAILED--non-zero wait status: 139
    ../ext/NDBM_File/t/ndbm.t............... ......................................... FAILED--non-zero wait status: 139
    ../t/cpan/Module-Build/t/script_dist.t.. .............................. FAILED--non-zero wait status: 139
    ../lib/h2xs.t........................... ..................................................... FAILED at test 3
    ../t/cpan/IO-Compress/t/105oneshot-deflate.t ......................... FAILED--non-zero wait status: 139
    ../t/cpan/IO-Compress/t/104destroy-rawdeflate.t ...................... FAILED--non-zero wait status: 139
    ../t/cpan/IO-Zlib/t/large.t............. ......................................... FAILED--non-zero wait status: 139
    ../t/cpan/Module-Build/t/perl_mb_opt.t.. .............................. FAILED--non-zero wait status: 139
    ../t/cpan/IO-Compress/t/107multi-rawdeflate.t ........................ FAILED--non-zero wait status: 139
    ../t/cpan/IO-Compress/t/101truncate-gzip.t ........................... FAILED--non-zero wait status: 139
    ../t/cpan/Archive-Tar/t/02_methods.t.... ................................ FAILED--non-zero wait status: 139
    ../t/cpan/IO-Compress/t/103newtied-zip.t ............................. FAILED--non-zero wait status: 139
    ../t/op/taint.t......................... ................................................... FAILED--non-zero wait status: 139
    ../t/cpan/IO-Compress/t/106prime-bzip2.t ............................. FAILED--non-zero wait status: 139
    ../t/cpan/Archive-Tar/t/06_error.t...... .................................. FAILED--non-zero wait status: 139
    ../t/cpan/IO-Zlib/t/external.t.......... ...................................... FAILED--non-zero wait status: 139
    ../t/porting/maintainers.t.............. ........................................ FAILED--non-zero wait status: 139
    ../t/cpan/CPANPLUS/t/01_CPANPLUS-Configure.t ......................... FAILED--non-zero wait status: 139
    ../lib/ExtUtils/t/Embed.t............... ......................................... FAILED--non-zero wait status: 139
    ../t/cpan/IO-Compress/t/010examples-zlib.t ........................... FAILED at test 2
    ../t/cpan/IO-Compress/t/106prime-gzip.t. .............................. FAILED--non-zero wait status: 139
    ../t/cpan/IO-Zlib/t/import.t............ ........................................ FAILED--non-zero wait status: 139
    ../t/op/coreamp.t....................... ................................................. FAILED--non-zero wait status: 139
    ../lib/DBM_Filter/t/encode.t............ ...................................... FAILED--non-zero wait status: 139
    ../ext/SDBM_File/t/sdbm.t............... ......................................... FAILED--non-zero wait status: 139
    ../t/cpan/Module-Build/t/tilde.t........ .................................... FAILED--non-zero wait status: 139
    ../t/cpan/Module-Build/t/help.t......... ..................................... FAILED--non-zero wait status: 139
    ../t/cpan/IO-Compress/t/001bzip2.t...... .................................. FAILED--non-zero wait status: 139
    ../t/cpan/IO-Compress/t/104destroy-deflate.t ......................... FAILED--non-zero wait status: 139
    ../t/cpan/Module-Build/t/ppm.t.......... ...................................... FAILED--non-zero wait status: 139
    ../t/cpan/IO-Compress/t/002any-zip.t.... ................................ FAILED--non-zero wait status: 139
    ../t/cpan/IO-Compress/t/101truncate-deflate.t ........................ FAILED--non-zero wait status: 139
    ../t/porting/exec-bit.t................. ........................................... FAILED--non-zero wait status: 139
    ../t/cpan/IO-Compress/t/107multi-gzip.t. .............................. FAILED--non-zero wait status: 139
    ../t/dist/XSLoader/t/XSLoader.t......... ..................................... FAILED--non-zero wait status: 139
    ../t/cpan/Module-Build/t/use_tap_harness.t ........................... FAILED--non-zero wait status: 139
    ../t/cpan/IO-Compress/t/107multi-zip.t.. .............................. FAILED--non-zero wait status: 139
    ../t/cpan/IO-Compress/t/100generic-zip.t ............................. FAILED--non-zero wait status: 139
    ../t/cpan/Perl-OSType/t/00-compile.t.... ................................ FAILED--non-zero wait status: 139
    ../t/dist/B-Deparse/t/deparse.t......... ..................................... FAILED--non-zero wait status: 139
    ../t/cpan/Module-Build/t/test_file_exts.t ............................ FAILED--non-zero wait status: 139
    ../t/cpan/Test-Harness/t/proverc.t...... .................................. FAILED--non-zero wait status: 139
    ../t/cpan/Archive-Tar/t/04_resolved_issues.t ......................... FAILED--non-zero wait status: 139
    ../t/cpan/Compress-Raw-Zlib/t/18lvalue.t ............................. FAILED--non-zero wait status: 139
    ../t/cpan/CPANPLUS/t/20_CPANPLUS-Dist-MM.t ........................... FAILED--non-zero wait status: 139
    ../t/cpan/IO-Compress/t/01misc.t........ .................................... FAILED--non-zero wait status: 139
    ../lib/DirHandle.t...................... ................................................ FAILED--non-zero wait status: 139
    ../t/cpan/DB_File/t/db-btree.t.......... ...................................... FAILED--non-zero wait status: 139
    ../t/cpan/Module-Build/t/ext.t.......... ...................................... FAILED--non-zero wait status: 139
    ../t/cpan/Archive-Extract/t/01_Archive-Extract.t ..................... FAILED--non-zero wait status: 139
    ../t/cpan/IO-Compress/t/001zlib-generic-gzip.t ....................... FAILED--non-zero wait status: 139
    ../t/cpan/IO-Compress/t/100generic-rawdeflate.t ...................... FAILED--non-zero wait status: 139
    ../lib/overload.t....................... ................................................. FAILED--non-zero wait status: 139
    ../t/cpan/IO-Compress/t/111const-deflate.t ........................... FAILED--non-zero wait status: 139
    ../t/cpan/IO-Zlib/t/uncomp1.t........... ....................................... FAILED--non-zero wait status: 139
    ../t/cpan/Module-Build/t/PL_files.t..... ................................. FAILED--non-zero wait status: 139
    ../t/cpan/Compress-Raw-Zlib/t/09limitoutput.t ........................ FAILED--non-zero wait status: 139
    ../t/cpan/IO-Compress/t/110encode-zip.t. .............................. FAILED--non-zero wait status: 139
    ../t/cpan/Module-Build/t/compat/exit.t.. .............................. FAILED at test 1
    ../t/cpan/IO-Compress/t/001zlib-generic-deflate.t .................... FAILED--non-zero wait status: 139
    ../t/cpan/IO-Compress/t/108anyunc-rawdeflate.t ....................... FAILED--non-zero wait status: 139
    ../t/cpan/IO-Compress/t/105oneshot-gzip-only.t ....................... FAILED--non-zero wait status: 139
    ../t/cpan/IO-Compress/t/cz-08encoding.t. .............................. FAILED--non-zero wait status: 139
    ../t/cpan/CPANPLUS/t/25_CPANPLUS.t...... .................................. FAILED--non-zero wait status: 139
    ../t/cpan/Module-Build/t/add_property.t. .............................. FAILED--non-zero wait status: 139
    ../t/cpan/IO-Compress/t/cz-06gzsetp.t... ............................... FAILED--non-zero wait status: 139
    ../t/cpan/IO-Compress/t/103newtied-deflate.t ......................... FAILED--non-zero wait status: 139
    ../t/cpan/Module-Build/t/resume.t....... ................................... FAILED--non-zero wait status: 139
    ../t/cpan/IO-Compress/t/110encode-deflate.t .......................... FAILED--non-zero wait status: 139
    ../lib/charnames.t...................... ................................................ FAILED--non-zero wait status: 139
    ../t/cpan/IO-Compress/t/020isize.t...... .................................. FAILED--non-zero wait status: 139
    ../lib/DBM_Filter/t/null.t.............. ........................................ FAILED--non-zero wait status: 139
    ../t/cpan/IO-Compress/t/102tied-zip.t... ............................... FAILED--non-zero wait status: 139
    ../t/cpan/Module-Build/t/00-compile.t... ............................... FAILED at test 1
    ../t/cpan/IO-Compress/t/105oneshot-bzip2.t ........................... FAILED--non-zero wait status: 139
    ../t/cpan/Module-Build/t/properties/share_dir.t ...................... FAILED--non-zero wait status: 139
    ../t/cpan/CPANPLUS/t/10_CPANPLUS-Error.t ............................. FAILED--non-zero wait status: 139
    ../t/cpan/IO-Compress/t/101truncate-zip.t ............................ FAILED--non-zero wait status: 139
    ../t/cpan/Test-Harness/t/000-load.t..... ................................. FAILED--non-zero wait status: 139
    ../t/cpan/Test-Harness/t/state_results.t ............................. FAILED--non-zero wait status: 139
    ../t/cpan/IO-Compress/t/102tied-gzip.t.. .............................. FAILED--non-zero wait status: 139
    ../t/cpan/CPANPLUS/t/00_CPANPLUS-Internals-Utils.t ................... FAILED--non-zero wait status: 139
    ../t/cpan/IO-Compress/t/106prime-zip.t.. .............................. FAILED--non-zero wait status: 139
    ../t/cpan/CPANPLUS/t/21_CPANPLUS-Dist-No-Build.t ..................... FAILED--non-zero wait status: 139
    ../t/cpan/IO-Compress/t/105oneshot-rawdeflate.t ...................... FAILED--non-zero wait status: 139
    ../lib/DBM_Filter/t/utf8.t.............. ........................................ FAILED--non-zero wait status: 139
    ../t/cpan/Compress-Raw-Zlib/t/02zlib.t.. .............................. FAILED--non-zero wait status: 139
    ../ext/GDBM_File/t/gdbm.t............... ......................................... FAILED--non-zero wait status: 139
    ../t/cpan/CPANPLUS/t/30_CPANPLUS-Internals-Selfupdate.t .............. FAILED--non-zero wait status: 139
    ../t/cpan/Archive-Tar/t/01_use.t........ .................................... FAILED--non-zero wait status: 139
    ../lib/DBM_Filter/t/int32.t............. ....................................... FAILED--non-zero wait status: 139
    ../t/cpan/Module-Build/t/files.t........ .................................... FAILED--non-zero wait status: 139
    ../t/cpan/IO-Compress/t/cz-01version.t.. .............................. FAILED--non-zero wait status: 139
    ../t/cpan/IO-Compress/t/004gziphdr.t.... ................................ FAILED--non-zero wait status: 139
    ../t/cpan/CPANPLUS-Dist-Build/t/01_CPANPLUS-Dist-Build-Constants.t ... FAILED--non-zero wait status: 139
    ../t/cpan/Module-Build/t/manifypods.t... ............................... FAILED--non-zero wait status: 139

[perlio] -DDEBUGGING -Duseithreads -Dusemorebits -Accflags=-DPERL_GLOBAL_STRUCT
Inconsistent test results (between TEST and harness):
    ../t/cpan/Module-Build/t/test_type.t.... ................................ FAILED--non-zero wait status: 139
    ../t/cpan/ExtUtils-MakeMaker/t/basic.t.. .............................. FAILED at test 23
    ../t/cpan/IO-Compress/t/001zlib-generic-rawdeflate.t ................. FAILED--non-zero wait status: 139
    ../t/cpan/Module-Build/t/write_default_maniskip.t .................... FAILED--non-zero wait status: 139
    ../t/cpan/IO-Compress/t/109merge-gzip.t. .............................. FAILED--non-zero wait status: 139
    ../t/cpan/Module-Build/t/basic.t........ .................................... FAILED--non-zero wait status: 139
    ../t/cpan/IO-Compress/t/002any-rawdeflate.t .......................... FAILED--non-zero wait status: 139
    ../t/cpan/IO-Compress/t/002any-transparent.t ......................... FAILED--non-zero wait status: 139
    ../t/cpan/IO-Compress/t/107multi-bzip2.t ............................. FAILED--non-zero wait status: 139
    ../t/cpan/Module-Build/t/mymeta.t....... ................................... FAILED--non-zero wait status: 139
    ../t/cpan/DB_File/t/db-hash.t........... ....................................... FAILED--non-zero wait status: 139
    ../t/cpan/IO-Compress/t/100generic-gzip.t ............................ FAILED--non-zero wait status: 139
    ../t/cpan/IO-Compress/t/108anyunc-gzip.t ............................. FAILED--non-zero wait status: 139
    ../t/cpan/IO-Compress/t/100generic-bzip2.t ........................... FAILED--non-zero wait status: 139
    ../t/cpan/IO-Compress/t/104destroy-gzip.t ............................ FAILED--non-zero wait status: 139
    ../t/cpan/Module-Build/t/test_types.t... ............................... FAILED--non-zero wait status: 139
    ../t/cpan/IO-Compress/t/005defhdr.t..... ................................. FAILED--non-zero wait status: 139
    ../ext/File-Glob/t/rt114984.t........... ..................................... FAILED--non-zero wait status: 139
    ../t/cpan/IO-Zlib/t/basic.t............. ......................................... FAILED--non-zero wait status: 139
    ../t/cpan/Test-Harness/t/testargs.t..... ................................. FAILED--non-zero wait status: 139
    ../ext/File-Glob/t/global.t............. ....................................... FAILED--non-zero wait status: 139
    ../t/cpan/Test-Harness/t/proverun.t..... ................................. FAILED--non-zero wait status: 139
    ../t/cpan/Test-Harness/t/prove.t........ .................................... FAILED--non-zero wait status: 139
    ../t/cpan/IO-Compress/t/108anyunc-transparent.t ...................... FAILED--non-zero wait status: 139
    ../t/cpan/CPANPLUS/t/02_CPANPLUS-Internals.t ......................... FAILED--non-zero wait status: 139
    ../t/cpan/IO-Compress/t/001zlib-generic-zip.t ........................ FAILED--non-zero wait status: 139
    ../t/cpan/CPANPLUS/t/07_CPANPLUS-Internals-Extract.t ................. FAILED--non-zero wait status: 139
    ../t/cpan/CPANPLUS/t/04_CPANPLUS-Module.t ............................ FAILED--non-zero wait status: 139
    ../t/cpan/Module-Build/t/metadata.t..... ................................. FAILED--non-zero wait status: 139
    ../t/cpan/IO-Compress/t/108anyunc-bzip2.t ............................ FAILED--non-zero wait status: 139
    ../t/cpan/CPANPLUS/t/09_CPANPLUS-Internals-Search.t .................. FAILED--non-zero wait status: 139
    ../t/cpan/CPANPLUS/t/06_CPANPLUS-Internals-Constants.t ............... FAILED--non-zero wait status: 139
    ../ext/Pod-Html/t/cache.t............... ......................................... FAILED--non-zero wait status: 139
    ../t/cpan/IO-Compress/t/002any-deflate.t ............................. FAILED--non-zero wait status: 139
    ../t/cpan/Module-Build/t/properties/license.t ........................ FAILED--non-zero wait status: 139
    ../t/cpan/CPANPLUS/t/19_CPANPLUS-Dist.t. .............................. FAILED--non-zero wait status: 139
    ../t/dist/B-Deparse/t/core.t............ ........................................ FAILED--non-zero wait status: 139
    ../t/cpan/IO-Compress/t/102tied-bzip2.t. .............................. FAILED--non-zero wait status: 139
    ../t/cpan/IO-Compress/t/105oneshot-zip.t ............................. FAILED--non-zero wait status: 139
    ../t/cpan/Archive-Tar/t/03_file.t....... ................................... FAILED--non-zero wait status: 139
    ../t/cpan/IO-Compress/t/102tied-deflate.t ............................ FAILED--non-zero wait status: 139
    ../t/cpan/CPANPLUS/t/03_CPANPLUS-Internals-Source.t .................. FAILED--non-zero wait status: 139
    ../t/cpan/IO-Zlib/t/uncomp2.t........... ....................................... FAILED--non-zero wait status: 139
    ../t/cpan/CPANPLUS/t/15_CPANPLUS-Shell.t ............................. FAILED--non-zero wait status: 139
    ../t/cpan/IO-Compress/t/103newtied-rawdeflate.t ...................... FAILED--non-zero wait status: 139
    ../t/cpan/Module-Build/t/properties/requires.t ....................... FAILED--non-zero wait status: 139
    ../t/cpan/IO-Compress/t/107multi-deflate.t ........................... FAILED--non-zero wait status: 139
    ../t/cpan/Compress-Raw-Bzip2/t/09limitoutput.t ....................... FAILED--non-zero wait status: 139
    ../lib/DBM_Filter/t/01error.t........... ..................................... FAILED--non-zero wait status: 139
    ../t/cpan/CPANPLUS/t/08_CPANPLUS-Backend.t ........................... FAILED--non-zero wait status: 139
    ../t/cpan/Module-Build/t/properties/needs_compiler.t ................. FAILED--non-zero wait status: 139
    ../t/cpan/IO-Compress/t/100generic-deflate.t ......................... FAILED--non-zero wait status: 139
    ../t/cpan/IO-Compress/t/102tied-rawdeflate.t ......................... FAILED--non-zero wait status: 139
    ../t/cpan/IO-Compress/t/104destroy-bzip2.t ........................... FAILED--non-zero wait status: 139
    ../t/cpan/IO-Compress/t/103newtied-gzip.t ............................ FAILED--non-zero wait status: 139
    ../t/cpan/CPANPLUS/t/05_CPANPLUS-Internals-Fetch.t ................... FAILED--non-zero wait status: 139
    ../t/cpan/Archive-Tar/t/05_iter.t....... ................................... FAILED--non-zero wait status: 139
    ../t/cpan/IO-Compress/t/006zip.t........ .................................... FAILED--non-zero wait status: 139
    ../t/cpan/IO-Compress/t/106prime-deflate.t ........................... FAILED--non-zero wait status: 139
    ../t/cpan/IO-Compress/t/101truncate-rawdeflate.t ..................... FAILED--non-zero wait status: 139
    ../t/cpan/IO-Compress/t/105oneshot-gzip.t ............................ FAILED--non-zero wait status: 139
    ../t/cpan/Module-Build/t/properties/dist_suffix.t .................... FAILED--non-zero wait status: 139
    ../t/cpan/Module-Build/t/metadata2.t.... ................................ FAILED--non-zero wait status: 139
    ../t/cpan/Module-Build/t/actions/installdeps.t ....................... FAILED--non-zero wait status: 139
    ../t/cpan/Test-Harness/t/perl5lib.t..... ................................. FAILED--non-zero wait status: 139
    ../t/cpan/IO-Compress/t/110encode-gzip.t ............................. FAILED--non-zero wait status: 139
    ../t/cpan/Module-Build/t/runthrough.t... ............................... FAILED at test 13
    ../ext/File-Glob/t/case.t............... ......................................... FAILED--non-zero wait status: 139
    ../t/cpan/ExtUtils-MakeMaker/t/revision.t ............................ FAILED--non-zero wait status: 139
    ../t/cpan/IO-Compress/t/108anyunc-deflate.t .......................... FAILED--non-zero wait status: 139
    ../t/cpan/IO-Compress/t/105oneshot-zip-only.t ........................ FAILED--non-zero wait status: 139
    ../t/cpan/Module-Build/t/compat.t....... ................................... FAILED at test 4
    ../t/cpan/Module-Build/t/sample.t....... ................................... FAILED--non-zero wait status: 139
    ../t/cpan/Module-Build/t/new_from_context.t .......................... FAILED--non-zero wait status: 139
    ../t/cpan/IO-Compress/t/108anyunc-zip.t. .............................. FAILED--non-zero wait status: 139
    ../t/cpan/Module-Build/t/properties/module_name.t .................... FAILED--non-zero wait status: 139
    ../t/cpan/ExtUtils-MakeMaker/t/maketext_filter.t ..................... FAILED--non-zero wait status: 139
    ../t/cpan/IO-Compress/t/104destroy-zip.t ............................. FAILED--non-zero wait status: 139
    ../t/cpan/Test-Harness/t/state.t........ .................................... FAILED--non-zero wait status: 139
    ../t/cpan/IO-Compress/t/109merge-rawdeflate.t ........................ FAILED--non-zero wait status: 139
    ../t/cpan/IO-Compress/t/010examples-bzip2.t .......................... FAILED at test 2
    ../t/cpan/IO-Compress/t/cz-03zlib-v1.t.. .............................. FAILED--non-zero wait status: 139
    ../t/cpan/Test-Harness/t/proveenv.t..... ................................. FAILED--non-zero wait status: 139
    ../t/cpan/ExtUtils-MakeMaker/t/cd.t..... ................................. FAILED--non-zero wait status: 139
    ../t/cpan/IO-Compress/t/000prereq.t..... ................................. FAILED--non-zero wait status: 139
    ../t/cpan/Module-Build/t/extend.t....... ................................... FAILED--non-zero wait status: 139
    ../t/cpan/IO-Compress/t/002any-gzip.t... ............................... FAILED--non-zero wait status: 139
    ../t/cpan/IO-Compress/t/110encode-rawdeflate.t ....................... FAILED--non-zero wait status: 139
    ../t/cpan/CPANPLUS-Dist-Build/t/02_CPANPLUS-Dist-Build.t ............. FAILED at test 5
    ../t/cpan/IO-Compress/t/105oneshot-zip-store-only.t .................. FAILED--non-zero wait status: 139
    ../t/cpan/Module-Build/t/actions/manifest_skip.t ..................... FAILED--non-zero wait status: 139
    ../t/cpan/IO-Compress/t/103newtied-bzip2.t ........................... FAILED--non-zero wait status: 139
    ../t/cpan/CPANPLUS/t/40_CPANPLUS-Internals-Report.t .................. FAILED--non-zero wait status: 139
    ../t/cpan/Module-Build/t/parents.t...... .................................. FAILED--non-zero wait status: 139
    ../t/cpan/Module-Build/t/notes.t........ .................................... FAILED--non-zero wait status: 139
    ../t/dist/IO/t/io_dir.t................. ............................................. FAILED--non-zero wait status: 139
    ../t/cpan/Module-Build/t/bundle_inc.t... ............................... FAILED--non-zero wait status: 139
    ../ext/File-Glob/t/basic.t.............. ........................................ FAILED--non-zero wait status: 139
    ../t/cpan/Module-Build/t/versions.t..... ................................. FAILED--non-zero wait status: 139
    ../t/cpan/Module-Build/t/install.t...... .................................. FAILED--non-zero wait status: 139
    ../t/cpan/ExtUtils-MakeMaker/t/00compile.t ........................... FAILED--non-zero wait status: 139
    ../t/cpan/IO-Zlib/t/getline.t........... ....................................... FAILED--non-zero wait status: 139
    ../t/cpan/IO-Compress/t/globmapper.t.... ................................ FAILED--non-zero wait status: 139
    ../t/cpan/IO-Zlib/t/tied.t.............. .......................................... FAILED--non-zero wait status: 139
    ../t/cpan/Module-Build/t/debug.t........ .................................... FAILED--non-zero wait status: 139
    ../t/op/svleak.t........................ .................................................. FAILED--non-zero wait status: 139
    ../t/cpan/IO-Compress/t/109merge-deflate.t ........................... FAILED--non-zero wait status: 139
    ../t/cpan/Module-Build/t/install_extra_target.t ...................... FAILED--non-zero wait status: 139
    ../lib/DBM_Filter/t/compress.t.......... .................................... FAILED--non-zero wait status: 139
    ../t/cpan/IO-Compress/t/105oneshot-zip-bzip2-only.t .................. FAILED--non-zero wait status: 139
    ../lib/DBM_Filter/t/02core.t............ ...................................... FAILED--non-zero wait status: 139
    ../t/cpan/IO-Compress/t/110encode-bzip2.t ............................ FAILED--non-zero wait status: 139
    ../t/cpan/IO-Compress/t/101truncate-bzip2.t .......................... FAILED--non-zero wait status: 139
    ../t/cpan/Module-Build/t/xs.t........... ....................................... FAILED--non-zero wait status: 139
    ../t/cpan/IO-Compress/t/cz-14gzopen.t... ............................... FAILED--non-zero wait status: 139
    ../t/cpan/Compress-Raw-Zlib/t/07bufsize.t ............................ FAILED--non-zero wait status: 139
    ../ext/DynaLoader/t/DynaLoader.t........ .................................. FAILED--non-zero wait status: 139
    ../t/cpan/IO-Compress/t/106prime-rawdeflate.t ........................ FAILED--non-zero wait status: 139
    ../t/cpan/IO-Zlib/t/getc.t.............. .......................................... FAILED--non-zero wait status: 139
    ../t/cpan/IO-Compress/t/050interop-gzip.t ............................ FAILED--non-zero wait status: 139
    ../t/cpan/Module-Build/t/properties/release_status.t ................. FAILED--non-zero wait status: 139
    ../t/cpan/Module-Build/t/destinations.t. .............................. FAILED--non-zero wait status: 139
    ../t/op/coresubs.t...................... ................................................ FAILED--non-zero wait status: 139
    ../t/cpan/IO-Compress/t/cz-05examples.t. .............................. FAILED at test 2
    ../ext/File-Glob/t/taint.t.............. ........................................ FAILED--non-zero wait status: 139
    ../ext/NDBM_File/t/ndbm.t............... ......................................... FAILED--non-zero wait status: 139
    ../t/cpan/Module-Build/t/script_dist.t.. .............................. FAILED--non-zero wait status: 139
    ../lib/h2xs.t........................... ..................................................... FAILED at test 3
    ../t/cpan/IO-Compress/t/105oneshot-deflate.t ......................... FAILED--non-zero wait status: 139
    ../t/cpan/IO-Compress/t/104destroy-rawdeflate.t ...................... FAILED--non-zero wait status: 139
    ../t/cpan/IO-Zlib/t/large.t............. ......................................... FAILED--non-zero wait status: 139
    ../t/cpan/Module-Build/t/perl_mb_opt.t.. .............................. FAILED--non-zero wait status: 139
    ../t/cpan/IO-Compress/t/107multi-rawdeflate.t ........................ FAILED--non-zero wait status: 139
    ../t/cpan/IO-Compress/t/101truncate-gzip.t ........................... FAILED--non-zero wait status: 139
    ../t/cpan/Archive-Tar/t/02_methods.t.... ................................ FAILED--non-zero wait status: 139
    ../t/cpan/IO-Compress/t/103newtied-zip.t ............................. FAILED--non-zero wait status: 139
    ../t/op/taint.t......................... ................................................... FAILED--non-zero wait status: 139
    ../t/cpan/IO-Compress/t/106prime-bzip2.t ............................. FAILED--non-zero wait status: 139
    ../t/cpan/Archive-Tar/t/06_error.t...... .................................. FAILED--non-zero wait status: 139
    ../t/cpan/IO-Zlib/t/external.t.......... ...................................... FAILED--non-zero wait status: 139
    ../t/porting/maintainers.t.............. ........................................ FAILED--non-zero wait status: 139
    ../t/cpan/CPANPLUS/t/01_CPANPLUS-Configure.t ......................... FAILED--non-zero wait status: 139
    ../lib/ExtUtils/t/Embed.t............... ......................................... FAILED--non-zero wait status: 139
    ../t/cpan/IO-Compress/t/010examples-zlib.t ........................... FAILED at test 2
    ../t/cpan/IO-Compress/t/106prime-gzip.t. .............................. FAILED--non-zero wait status: 139
    ../t/cpan/IO-Zlib/t/import.t............ ........................................ FAILED--non-zero wait status: 139
    ../t/op/coreamp.t....................... ................................................. FAILED--non-zero wait status: 139
    ../lib/DBM_Filter/t/encode.t............ ...................................... FAILED--non-zero wait status: 139
    ../ext/SDBM_File/t/sdbm.t............... ......................................... FAILED--non-zero wait status: 139
    ../t/cpan/Module-Build/t/tilde.t........ .................................... FAILED--non-zero wait status: 139
    ../t/cpan/Module-Build/t/help.t......... ..................................... FAILED--non-zero wait status: 139
    ../t/cpan/IO-Compress/t/001bzip2.t...... .................................. FAILED--non-zero wait status: 139
    ../t/cpan/IO-Compress/t/104destroy-deflate.t ......................... FAILED--non-zero wait status: 139
    ../t/cpan/Module-Build/t/ppm.t.......... ...................................... FAILED--non-zero wait status: 139
    ../t/cpan/IO-Compress/t/002any-zip.t.... ................................ FAILED--non-zero wait status: 139
    ../t/cpan/IO-Compress/t/101truncate-deflate.t ........................ FAILED--non-zero wait status: 139
    ../t/cpan/IO-Compress/t/107multi-gzip.t. .............................. FAILED--non-zero wait status: 139
    ../t/dist/XSLoader/t/XSLoader.t......... ..................................... FAILED--non-zero wait status: 139
    ../t/cpan/Module-Build/t/use_tap_harness.t ........................... FAILED--non-zero wait status: 139
    ../t/cpan/IO-Compress/t/107multi-zip.t.. .............................. FAILED--non-zero wait status: 139
    ../t/cpan/IO-Compress/t/100generic-zip.t ............................. FAILED--non-zero wait status: 139
    ../t/cpan/Perl-OSType/t/00-compile.t.... ................................ FAILED--non-zero wait status: 139
    ../t/dist/B-Deparse/t/deparse.t......... ..................................... FAILED--non-zero wait status: 139
    ../t/cpan/Module-Build/t/test_file_exts.t ............................ FAILED--non-zero wait status: 139
    ../t/cpan/Test-Harness/t/proverc.t...... .................................. FAILED--non-zero wait status: 139
    ../t/cpan/Archive-Tar/t/04_resolved_issues.t ......................... FAILED--non-zero wait status: 139
    ../t/cpan/Compress-Raw-Zlib/t/18lvalue.t ............................. FAILED--non-zero wait status: 139
    ../t/cpan/CPANPLUS/t/20_CPANPLUS-Dist-MM.t ........................... FAILED--non-zero wait status: 139
    ../t/cpan/IO-Compress/t/01misc.t........ .................................... FAILED--non-zero wait status: 139
    ../lib/DirHandle.t...................... ................................................ FAILED--non-zero wait status: 139
    ../t/cpan/DB_File/t/db-btree.t.......... ...................................... FAILED--non-zero wait status: 139
    ../t/cpan/Module-Build/t/ext.t.......... ...................................... FAILED--non-zero wait status: 139
    ../t/cpan/Archive-Extract/t/01_Archive-Extract.t ..................... FAILED--non-zero wait status: 139
    ../t/cpan/IO-Compress/t/001zlib-generic-gzip.t ....................... FAILED--non-zero wait status: 139
    ../t/cpan/IO-Compress/t/100generic-rawdeflate.t ...................... FAILED--non-zero wait status: 139
    ../lib/overload.t....................... ................................................. FAILED--non-zero wait status: 139
    ../t/op/tie_fetch_count.t............... ......................................... FAILED--non-zero wait status: 139
    ../t/cpan/IO-Compress/t/111const-deflate.t ........................... FAILED--non-zero wait status: 139
    ../t/cpan/IO-Zlib/t/uncomp1.t........... ....................................... FAILED--non-zero wait status: 139
    ../t/cpan/Module-Build/t/PL_files.t..... ................................. FAILED--non-zero wait status: 139
    ../t/cpan/Compress-Raw-Zlib/t/09limitoutput.t ........................ FAILED--non-zero wait status: 139
    ../t/cpan/IO-Compress/t/110encode-zip.t. .............................. FAILED--non-zero wait status: 139
    ../t/cpan/Module-Build/t/compat/exit.t.. .............................. FAILED at test 1
    ../t/cpan/IO-Compress/t/001zlib-generic-deflate.t .................... FAILED--non-zero wait status: 139
    ../t/cpan/IO-Compress/t/108anyunc-rawdeflate.t ....................... FAILED--non-zero wait status: 139
    ../t/cpan/IO-Compress/t/105oneshot-gzip-only.t ....................... FAILED--non-zero wait status: 139
    ../t/cpan/IO-Compress/t/cz-08encoding.t. .............................. FAILED--non-zero wait status: 139
    ../t/cpan/CPANPLUS/t/25_CPANPLUS.t...... .................................. FAILED--non-zero wait status: 139
    ../t/cpan/Module-Build/t/add_property.t. .............................. FAILED--non-zero wait status: 139
    ../t/cpan/IO-Compress/t/cz-06gzsetp.t... ............................... FAILED--non-zero wait status: 139
    ../t/cpan/IO-Compress/t/103newtied-deflate.t ......................... FAILED--non-zero wait status: 139
    ../t/cpan/Module-Build/t/resume.t....... ................................... FAILED--non-zero wait status: 139
    ../t/cpan/IO-Compress/t/110encode-deflate.t .......................... FAILED--non-zero wait status: 139
    ../lib/charnames.t...................... ................................................ FAILED--non-zero wait status: 139
    ../t/cpan/IO-Compress/t/020isize.t...... .................................. FAILED--non-zero wait status: 139
    ../lib/DBM_Filter/t/null.t.............. ........................................ FAILED--non-zero wait status: 139
    ../t/cpan/IO-Compress/t/102tied-zip.t... ............................... FAILED--non-zero wait status: 139
    ../t/cpan/Module-Build/t/00-compile.t... ............................... FAILED at test 1
    ../t/cpan/IO-Compress/t/105oneshot-bzip2.t ........................... FAILED--non-zero wait status: 139
    ../t/cpan/Module-Build/t/properties/share_dir.t ...................... FAILED--non-zero wait status: 139
    ../t/cpan/CPANPLUS/t/10_CPANPLUS-Error.t ............................. FAILED--non-zero wait status: 139
    ../t/cpan/IO-Compress/t/101truncate-zip.t ............................ FAILED--non-zero wait status: 139
    ../t/cpan/Test-Harness/t/000-load.t..... ................................. FAILED--non-zero wait status: 139
    ../t/cpan/Test-Harness/t/state_results.t ............................. FAILED--non-zero wait status: 139
    ../t/cpan/IO-Compress/t/102tied-gzip.t.. .............................. FAILED--non-zero wait status: 139
    ../t/cpan/CPANPLUS/t/00_CPANPLUS-Internals-Utils.t ................... FAILED--non-zero wait status: 139
    ../t/cpan/IO-Compress/t/106prime-zip.t.. .............................. FAILED--non-zero wait status: 139
    ../t/cpan/CPANPLUS/t/21_CPANPLUS-Dist-No-Build.t ..................... FAILED--non-zero wait status: 139
    ../t/cpan/IO-Compress/t/105oneshot-rawdeflate.t ...................... FAILED--non-zero wait status: 139
    ../lib/DBM_Filter/t/utf8.t.............. ........................................ FAILED--non-zero wait status: 139
    ../t/cpan/Compress-Raw-Zlib/t/02zlib.t.. .............................. FAILED--non-zero wait status: 139
    ../ext/GDBM_File/t/gdbm.t............... ......................................... FAILED--non-zero wait status: 139
    ../t/cpan/CPANPLUS/t/30_CPANPLUS-Internals-Selfupdate.t .............. FAILED--non-zero wait status: 139
    ../t/cpan/Archive-Tar/t/01_use.t........ .................................... FAILED--non-zero wait status: 139
    ../lib/DBM_Filter/t/int32.t............. ....................................... FAILED--non-zero wait status: 139
    ../t/cpan/Module-Build/t/files.t........ .................................... FAILED--non-zero wait status: 139
    ../t/cpan/IO-Compress/t/cz-01version.t.. .............................. FAILED--non-zero wait status: 139
    ../t/cpan/IO-Compress/t/004gziphdr.t.... ................................ FAILED--non-zero wait status: 139
    ../t/cpan/CPANPLUS-Dist-Build/t/01_CPANPLUS-Dist-Build-Constants.t ... FAILED--non-zero wait status: 139
    ../t/cpan/Module-Build/t/manifypods.t... ............................... FAILED--non-zero wait status: 139

[en_US.utf8] -DDEBUGGING -Duseithreads -Dusemorebits -Accflags=-DPERL_GLOBAL_STRUCT
Inconsistent test results (between TEST and harness):
    ../t/cpan/Module-Build/t/test_type.t.... ................................ FAILED--non-zero wait status: 139
    ../t/cpan/ExtUtils-MakeMaker/t/basic.t.. .............................. FAILED at test 23
    ../t/cpan/IO-Compress/t/001zlib-generic-rawdeflate.t ................. FAILED--non-zero wait status: 139
    ../t/cpan/Module-Build/t/write_default_maniskip.t .................... FAILED--non-zero wait status: 139
    ../t/cpan/IO-Compress/t/109merge-gzip.t. .............................. FAILED--non-zero wait status: 139
    ../t/cpan/Module-Build/t/basic.t........ .................................... FAILED--non-zero wait status: 139
    ../t/cpan/IO-Compress/t/002any-rawdeflate.t .......................... FAILED--non-zero wait status: 139
    ../t/cpan/IO-Compress/t/002any-transparent.t ......................... FAILED--non-zero wait status: 139
    ../t/cpan/IO-Compress/t/107multi-bzip2.t ............................. FAILED--non-zero wait status: 139
    ../t/cpan/Module-Build/t/mymeta.t....... ................................... FAILED--non-zero wait status: 139
    ../t/cpan/DB_File/t/db-hash.t........... ....................................... FAILED--non-zero wait status: 139
    ../t/cpan/IO-Compress/t/100generic-gzip.t ............................ FAILED--non-zero wait status: 139
    ../t/cpan/IO-Compress/t/108anyunc-gzip.t ............................. FAILED--non-zero wait status: 139
    ../t/cpan/IO-Compress/t/100generic-bzip2.t ........................... FAILED--non-zero wait status: 139
    ../t/cpan/IO-Compress/t/104destroy-gzip.t ............................ FAILED--non-zero wait status: 139
    ../t/cpan/Module-Build/t/test_types.t... ............................... FAILED--non-zero wait status: 139
    ../t/cpan/IO-Compress/t/005defhdr.t..... ................................. FAILED--non-zero wait status: 139
    ../ext/File-Glob/t/rt114984.t........... ..................................... FAILED--non-zero wait status: 139
    ../t/cpan/IO-Zlib/t/basic.t............. ......................................... FAILED--non-zero wait status: 139
    ../t/cpan/Test-Harness/t/testargs.t..... ................................. FAILED--non-zero wait status: 139
    ../ext/File-Glob/t/global.t............. ....................................... FAILED--non-zero wait status: 139
    ../t/cpan/Test-Harness/t/proverun.t..... ................................. FAILED--non-zero wait status: 139
    ../t/cpan/Test-Harness/t/prove.t........ .................................... FAILED--non-zero wait status: 139
    ../t/cpan/IO-Compress/t/108anyunc-transparent.t ...................... FAILED--non-zero wait status: 139
    ../t/cpan/CPANPLUS/t/02_CPANPLUS-Internals.t ......................... FAILED--non-zero wait status: 139
    ../t/cpan/IO-Compress/t/001zlib-generic-zip.t ........................ FAILED--non-zero wait status: 139
    ../t/cpan/CPANPLUS/t/07_CPANPLUS-Internals-Extract.t ................. FAILED--non-zero wait status: 139
    ../t/cpan/CPANPLUS/t/04_CPANPLUS-Module.t ............................ FAILED--non-zero wait status: 139
    ../t/cpan/Module-Build/t/metadata.t..... ................................. FAILED--non-zero wait status: 139
    ../t/cpan/IO-Compress/t/108anyunc-bzip2.t ............................ FAILED--non-zero wait status: 139
    ../t/cpan/CPANPLUS/t/09_CPANPLUS-Internals-Search.t .................. FAILED--non-zero wait status: 139
    ../t/cpan/CPANPLUS/t/06_CPANPLUS-Internals-Constants.t ............... FAILED--non-zero wait status: 139
    ../ext/Pod-Html/t/cache.t............... ......................................... FAILED--non-zero wait status: 139
    ../t/cpan/IO-Compress/t/002any-deflate.t ............................. FAILED--non-zero wait status: 139
    ../t/cpan/Module-Build/t/properties/license.t ........................ FAILED--non-zero wait status: 139
    ../t/cpan/CPANPLUS/t/19_CPANPLUS-Dist.t. .............................. FAILED--non-zero wait status: 139
    ../t/dist/B-Deparse/t/core.t............ ........................................ FAILED--non-zero wait status: 139
    ../t/cpan/IO-Compress/t/102tied-bzip2.t. .............................. FAILED--non-zero wait status: 139
    ../t/cpan/IO-Compress/t/105oneshot-zip.t ............................. FAILED--non-zero wait status: 139
    ../t/lib/croak.t........................ .................................................. FAILED at test 32
    ../t/cpan/Archive-Tar/t/03_file.t....... ................................... FAILED--non-zero wait status: 139
    ../t/cpan/IO-Compress/t/102tied-deflate.t ............................ FAILED--non-zero wait status: 139
    ../t/cpan/CPANPLUS/t/03_CPANPLUS-Internals-Source.t .................. FAILED--non-zero wait status: 139
    ../t/cpan/IO-Zlib/t/uncomp2.t........... ....................................... FAILED--non-zero wait status: 139
    ../t/cpan/CPANPLUS/t/15_CPANPLUS-Shell.t ............................. FAILED--non-zero wait status: 139
    ../t/cpan/IO-Compress/t/103newtied-rawdeflate.t ...................... FAILED--non-zero wait status: 139
    ../t/cpan/Module-Build/t/properties/requires.t ....................... FAILED--non-zero wait status: 139
    ../t/cpan/IO-Compress/t/107multi-deflate.t ........................... FAILED--non-zero wait status: 139
    ../t/cpan/Compress-Raw-Bzip2/t/09limitoutput.t ....................... FAILED--non-zero wait status: 139
    ../lib/DBM_Filter/t/01error.t........... ..................................... FAILED--non-zero wait status: 139
    ../t/cpan/CPANPLUS/t/08_CPANPLUS-Backend.t ........................... FAILED--non-zero wait status: 139
    ../t/cpan/Module-Build/t/properties/needs_compiler.t ................. FAILED--non-zero wait status: 139
    ../t/cpan/IO-Compress/t/100generic-deflate.t ......................... FAILED--non-zero wait status: 139
    ../t/cpan/IO-Compress/t/102tied-rawdeflate.t ......................... FAILED--non-zero wait status: 139
    ../t/cpan/IO-Compress/t/104destroy-bzip2.t ........................... FAILED--non-zero wait status: 139
    ../t/cpan/IO-Compress/t/103newtied-gzip.t ............................ FAILED--non-zero wait status: 139
    ../t/cpan/CPANPLUS/t/05_CPANPLUS-Internals-Fetch.t ................... FAILED--non-zero wait status: 139
    ../t/cpan/Archive-Tar/t/05_iter.t....... ................................... FAILED--non-zero wait status: 139
    ../t/cpan/IO-Compress/t/006zip.t........ .................................... FAILED--non-zero wait status: 139
    ../t/cpan/IO-Compress/t/106prime-deflate.t ........................... FAILED--non-zero wait status: 139
    ../t/cpan/IO-Compress/t/101truncate-rawdeflate.t ..................... FAILED--non-zero wait status: 139
    ../t/cpan/IO-Compress/t/105oneshot-gzip.t ............................ FAILED--non-zero wait status: 139
    ../t/cpan/Module-Build/t/properties/dist_suffix.t .................... FAILED--non-zero wait status: 139
    ../t/cpan/Module-Build/t/metadata2.t.... ................................ FAILED--non-zero wait status: 139
    ../t/cpan/Module-Build/t/actions/installdeps.t ....................... FAILED--non-zero wait status: 139
    ../t/cpan/Test-Harness/t/perl5lib.t..... ................................. FAILED--non-zero wait status: 139
    ../t/cpan/IO-Compress/t/110encode-gzip.t ............................. FAILED--non-zero wait status: 139
    ../t/cpan/Module-Build/t/runthrough.t... ............................... FAILED at test 13
    ../ext/File-Glob/t/case.t............... ......................................... FAILED--non-zero wait status: 139
    ../t/cpan/ExtUtils-MakeMaker/t/revision.t ............................ FAILED--non-zero wait status: 139
    ../t/cpan/IO-Compress/t/108anyunc-deflate.t .......................... FAILED--non-zero wait status: 139
    ../t/cpan/IO-Compress/t/105oneshot-zip-only.t ........................ FAILED--non-zero wait status: 139
    ../t/cpan/Module-Build/t/compat.t....... ................................... FAILED at test 4
    ../t/cpan/Module-Build/t/sample.t....... ................................... FAILED--non-zero wait status: 139
    ../t/cpan/Module-Build/t/new_from_context.t .......................... FAILED--non-zero wait status: 139
    ../t/cpan/IO-Compress/t/108anyunc-zip.t. .............................. FAILED--non-zero wait status: 139
    ../t/op/lex.t........................... ..................................................... FAILED at test 5
    ../t/cpan/Module-Build/t/properties/module_name.t .................... FAILED--non-zero wait status: 139
    ../t/cpan/ExtUtils-MakeMaker/t/maketext_filter.t ..................... FAILED--non-zero wait status: 139
    ../t/cpan/IO-Compress/t/104destroy-zip.t ............................. FAILED--non-zero wait status: 139
    ../t/cpan/Test-Harness/t/state.t........ .................................... FAILED--non-zero wait status: 139
    ../t/cpan/IO-Compress/t/109merge-rawdeflate.t ........................ FAILED--non-zero wait status: 139
    ../t/cpan/IO-Compress/t/010examples-bzip2.t .......................... FAILED at test 2
    ../t/cpan/IO-Compress/t/cz-03zlib-v1.t.. .............................. FAILED--non-zero wait status: 139
    ../t/cpan/Test-Harness/t/proveenv.t..... ................................. FAILED--non-zero wait status: 139
    ../t/cpan/ExtUtils-MakeMaker/t/cd.t..... ................................. FAILED--non-zero wait status: 139
    ../t/cpan/IO-Compress/t/000prereq.t..... ................................. FAILED--non-zero wait status: 139
    ../t/cpan/Module-Build/t/extend.t....... ................................... FAILED--non-zero wait status: 139
    ../t/cpan/IO-Compress/t/002any-gzip.t... ............................... FAILED--non-zero wait status: 139
    ../t/cpan/IO-Compress/t/110encode-rawdeflate.t ....................... FAILED--non-zero wait status: 139
    ../t/cpan/CPANPLUS-Dist-Build/t/02_CPANPLUS-Dist-Build.t ............. FAILED at test 5
    ../t/cpan/IO-Compress/t/105oneshot-zip-store-only.t .................. FAILED--non-zero wait status: 139
    ../t/cpan/Module-Build/t/actions/manifest_skip.t ..................... FAILED--non-zero wait status: 139
    ../t/cpan/IO-Compress/t/103newtied-bzip2.t ........................... FAILED--non-zero wait status: 139
    ../t/cpan/CPANPLUS/t/40_CPANPLUS-Internals-Report.t .................. FAILED--non-zero wait status: 139
    ../t/cpan/Module-Build/t/parents.t...... .................................. FAILED--non-zero wait status: 139
    ../t/cpan/Module-Build/t/notes.t........ .................................... FAILED--non-zero wait status: 139
    ../t/dist/IO/t/io_dir.t................. ............................................. FAILED--non-zero wait status: 139
    ../t/cpan/Module-Build/t/bundle_inc.t... ............................... FAILED--non-zero wait status: 139
    ../ext/File-Glob/t/basic.t.............. ........................................ FAILED--non-zero wait status: 139
    ../t/cpan/Module-Build/t/versions.t..... ................................. FAILED--non-zero wait status: 139
    ../t/cpan/Module-Build/t/install.t...... .................................. FAILED--non-zero wait status: 139
    ../t/cpan/ExtUtils-MakeMaker/t/00compile.t ........................... FAILED--non-zero wait status: 139
    ../t/cpan/IO-Zlib/t/getline.t........... ....................................... FAILED--non-zero wait status: 139
    ../t/cpan/IO-Compress/t/globmapper.t.... ................................ FAILED--non-zero wait status: 139
    ../t/cpan/IO-Zlib/t/tied.t.............. .......................................... FAILED--non-zero wait status: 139
    ../t/cpan/Module-Build/t/debug.t........ .................................... FAILED--non-zero wait status: 139
    ../t/op/svleak.t........................ .................................................. FAILED--non-zero wait status: 139
    ../t/cpan/IO-Compress/t/109merge-deflate.t ........................... FAILED--non-zero wait status: 139
    ../t/cpan/Module-Build/t/install_extra_target.t ...................... FAILED--non-zero wait status: 139
    ../lib/DBM_Filter/t/compress.t.......... .................................... FAILED--non-zero wait status: 139
    ../t/cpan/IO-Compress/t/105oneshot-zip-bzip2-only.t .................. FAILED--non-zero wait status: 139
    ../lib/DBM_Filter/t/02core.t............ ...................................... FAILED--non-zero wait status: 139
    ../t/cpan/IO-Compress/t/110encode-bzip2.t ............................ FAILED--non-zero wait status: 139
    ../t/cpan/IO-Compress/t/101truncate-bzip2.t .......................... FAILED--non-zero wait status: 139
    ../t/cpan/Module-Build/t/xs.t........... ....................................... FAILED--non-zero wait status: 139
    ../t/cpan/IO-Compress/t/cz-14gzopen.t... ............................... FAILED--non-zero wait status: 139
    ../t/cpan/Compress-Raw-Zlib/t/07bufsize.t ............................ FAILED--non-zero wait status: 139
    ../ext/DynaLoader/t/DynaLoader.t........ .................................. FAILED--non-zero wait status: 139
    ../t/cpan/IO-Compress/t/106prime-rawdeflate.t ........................ FAILED--non-zero wait status: 139
    ../t/cpan/IO-Zlib/t/getc.t.............. .......................................... FAILED--non-zero wait status: 139
    ../t/cpan/IO-Compress/t/050interop-gzip.t ............................ FAILED--non-zero wait status: 139
    ../t/cpan/Module-Build/t/properties/release_status.t ................. FAILED--non-zero wait status: 139
    ../t/cpan/Module-Build/t/destinations.t. .............................. FAILED--non-zero wait status: 139
    ../t/op/coresubs.t...................... ................................................ FAILED--non-zero wait status: 139
    ../t/cpan/IO-Compress/t/cz-05examples.t. .............................. FAILED at test 2
    ../ext/File-Glob/t/taint.t.............. ........................................ FAILED--non-zero wait status: 139
    ../ext/NDBM_File/t/ndbm.t............... ......................................... FAILED--non-zero wait status: 139
    ../t/cpan/Module-Build/t/script_dist.t.. .............................. FAILED--non-zero wait status: 139
    ../lib/h2xs.t........................... ..................................................... FAILED at test 3
    ../t/cpan/IO-Compress/t/105oneshot-deflate.t ......................... FAILED--non-zero wait status: 139
    ../t/cpan/IO-Compress/t/104destroy-rawdeflate.t ...................... FAILED--non-zero wait status: 139
    ../t/cpan/IO-Zlib/t/large.t............. ......................................... FAILED--non-zero wait status: 139
    ../t/cpan/Module-Build/t/perl_mb_opt.t.. .............................. FAILED--non-zero wait status: 139
    ../t/cpan/IO-Compress/t/107multi-rawdeflate.t ........................ FAILED--non-zero wait status: 139
    ../t/cpan/IO-Compress/t/101truncate-gzip.t ........................... FAILED--non-zero wait status: 139
    ../t/cpan/Archive-Tar/t/02_methods.t.... ................................ FAILED--non-zero wait status: 139
    ../t/cpan/IO-Compress/t/103newtied-zip.t ............................. FAILED--non-zero wait status: 139
    ../t/op/taint.t......................... ................................................... FAILED--non-zero wait status: 139
    ../t/cpan/IO-Compress/t/106prime-bzip2.t ............................. FAILED--non-zero wait status: 139
    ../t/cpan/Archive-Tar/t/06_error.t...... .................................. FAILED--non-zero wait status: 139
    ../t/cpan/IO-Zlib/t/external.t.......... ...................................... FAILED--non-zero wait status: 139
    ../t/porting/maintainers.t.............. ........................................ FAILED--non-zero wait status: 139
    ../t/cpan/CPANPLUS/t/01_CPANPLUS-Configure.t ......................... FAILED--non-zero wait status: 139
    ../lib/ExtUtils/t/Embed.t............... ......................................... FAILED--non-zero wait status: 139
    ../t/cpan/IO-Compress/t/010examples-zlib.t ........................... FAILED at test 2
    ../t/cpan/IO-Compress/t/106prime-gzip.t. .............................. FAILED--non-zero wait status: 139
    ../t/cpan/IO-Zlib/t/import.t............ ........................................ FAILED--non-zero wait status: 139
    ../t/op/coreamp.t....................... ................................................. FAILED--non-zero wait status: 139
    ../lib/DBM_Filter/t/encode.t............ ...................................... FAILED--non-zero wait status: 139
    ../ext/SDBM_File/t/sdbm.t............... ......................................... FAILED--non-zero wait status: 139
    ../t/cpan/Module-Build/t/tilde.t........ .................................... FAILED--non-zero wait status: 139
    ../t/cpan/Module-Build/t/help.t......... ..................................... FAILED--non-zero wait status: 139
    ../t/cpan/IO-Compress/t/001bzip2.t...... .................................. FAILED--non-zero wait status: 139
    ../t/cpan/IO-Compress/t/104destroy-deflate.t ......................... FAILED--non-zero wait status: 139
    ../t/cpan/Module-Build/t/ppm.t.......... ...................................... FAILED--non-zero wait status: 139
    ../t/cpan/IO-Compress/t/002any-zip.t.... ................................ FAILED--non-zero wait status: 139
    ../t/cpan/IO-Compress/t/101truncate-deflate.t ........................ FAILED--non-zero wait status: 139
    ../t/cpan/IO-Compress/t/107multi-gzip.t. .............................. FAILED--non-zero wait status: 139
    ../t/dist/XSLoader/t/XSLoader.t......... ..................................... FAILED--non-zero wait status: 139
    ../t/cpan/Module-Build/t/use_tap_harness.t ........................... FAILED--non-zero wait status: 139
    ../t/cpan/IO-Compress/t/107multi-zip.t.. .............................. FAILED--non-zero wait status: 139
    ../t/cpan/IO-Compress/t/100generic-zip.t ............................. FAILED--non-zero wait status: 139
    ../t/cpan/Perl-OSType/t/00-compile.t.... ................................ FAILED--non-zero wait status: 139
    ../t/dist/B-Deparse/t/deparse.t......... ..................................... FAILED--non-zero wait status: 139
    ../t/cpan/Module-Build/t/test_file_exts.t ............................ FAILED--non-zero wait status: 139
    ../t/cpan/Test-Harness/t/proverc.t...... .................................. FAILED--non-zero wait status: 139
    ../t/cpan/Archive-Tar/t/04_resolved_issues.t ......................... FAILED--non-zero wait status: 139
    ../t/cpan/Compress-Raw-Zlib/t/18lvalue.t ............................. FAILED--non-zero wait status: 139
    ../t/cpan/CPANPLUS/t/20_CPANPLUS-Dist-MM.t ........................... FAILED--non-zero wait status: 139
    ../t/cpan/IO-Compress/t/01misc.t........ .................................... FAILED--non-zero wait status: 139
    ../lib/DirHandle.t...................... ................................................ FAILED--non-zero wait status: 139
    ../t/cpan/DB_File/t/db-btree.t.......... ...................................... FAILED--non-zero wait status: 139
    ../t/cpan/Module-Build/t/ext.t.......... ...................................... FAILED--non-zero wait status: 139
    ../t/cpan/Archive-Extract/t/01_Archive-Extract.t ..................... FAILED--non-zero wait status: 139
    ../t/cpan/IO-Compress/t/001zlib-generic-gzip.t ....................... FAILED--non-zero wait status: 139
    ../t/cpan/IO-Compress/t/100generic-rawdeflate.t ...................... FAILED--non-zero wait status: 139
    ../lib/overload.t....................... ................................................. FAILED--non-zero wait status: 139
    ../t/cpan/IO-Compress/t/111const-deflate.t ........................... FAILED--non-zero wait status: 139
    ../t/cpan/IO-Zlib/t/uncomp1.t........... ....................................... FAILED--non-zero wait status: 139
    ../t/cpan/Module-Build/t/PL_files.t..... ................................. FAILED--non-zero wait status: 139
    ../t/cpan/Compress-Raw-Zlib/t/09limitoutput.t ........................ FAILED--non-zero wait status: 139
    ../t/cpan/IO-Compress/t/110encode-zip.t. .............................. FAILED--non-zero wait status: 139
    ../t/cpan/Module-Build/t/compat/exit.t.. .............................. FAILED at test 1
    ../t/cpan/IO-Compress/t/001zlib-generic-deflate.t .................... FAILED--non-zero wait status: 139
    ../t/cpan/IO-Compress/t/108anyunc-rawdeflate.t ....................... FAILED--non-zero wait status: 139
    ../t/cpan/IO-Compress/t/105oneshot-gzip-only.t ....................... FAILED--non-zero wait status: 139
    ../t/cpan/IO-Compress/t/cz-08encoding.t. .............................. FAILED--non-zero wait status: 139
    ../t/cpan/CPANPLUS/t/25_CPANPLUS.t...... .................................. FAILED--non-zero wait status: 139
    ../t/cpan/Module-Build/t/add_property.t. .............................. FAILED--non-zero wait status: 139
    ../t/cpan/IO-Compress/t/cz-06gzsetp.t... ............................... FAILED--non-zero wait status: 139
    ../t/cpan/IO-Compress/t/103newtied-deflate.t ......................... FAILED--non-zero wait status: 139
    ../t/cpan/Module-Build/t/resume.t....... ................................... FAILED--non-zero wait status: 139
    ../t/cpan/IO-Compress/t/110encode-deflate.t .......................... FAILED--non-zero wait status: 139
    ../lib/charnames.t...................... ................................................ FAILED--non-zero wait status: 139
    ../t/cpan/IO-Compress/t/020isize.t...... .................................. FAILED--non-zero wait status: 139
    ../lib/DBM_Filter/t/null.t.............. ........................................ FAILED--non-zero wait status: 139
    ../t/cpan/Pod-Parser/t/pod/selfcheck.t.. .............................. FAILED--non-zero wait status: 139
    ../t/cpan/IO-Compress/t/102tied-zip.t... ............................... FAILED--non-zero wait status: 139
    ../t/cpan/Module-Build/t/00-compile.t... ............................... FAILED at test 1
    ../t/cpan/IO-Compress/t/105oneshot-bzip2.t ........................... FAILED--non-zero wait status: 139
    ../t/cpan/Module-Build/t/properties/share_dir.t ...................... FAILED--non-zero wait status: 139
    ../t/cpan/CPANPLUS/t/10_CPANPLUS-Error.t ............................. FAILED--non-zero wait status: 139
    ../t/cpan/IO-Compress/t/101truncate-zip.t ............................ FAILED--non-zero wait status: 139
    ../t/cpan/Test-Harness/t/000-load.t..... ................................. FAILED--non-zero wait status: 139
    ../t/cpan/Test-Harness/t/state_results.t ............................. FAILED--non-zero wait status: 139
    ../t/cpan/IO-Compress/t/102tied-gzip.t.. .............................. FAILED--non-zero wait status: 139
    ../t/cpan/CPANPLUS/t/00_CPANPLUS-Internals-Utils.t ................... FAILED--non-zero wait status: 139
    ../t/cpan/IO-Compress/t/106prime-zip.t.. .............................. FAILED--non-zero wait status: 139
    ../t/cpan/CPANPLUS/t/21_CPANPLUS-Dist-No-Build.t ..................... FAILED--non-zero wait status: 139
    ../t/cpan/IO-Compress/t/105oneshot-rawdeflate.t ...................... FAILED--non-zero wait status: 139
    ../lib/DBM_Filter/t/utf8.t.............. ........................................ FAILED--non-zero wait status: 139
    ../t/cpan/Compress-Raw-Zlib/t/02zlib.t.. .............................. FAILED--non-zero wait status: 139
    ../ext/GDBM_File/t/gdbm.t............... ......................................... FAILED--non-zero wait status: 139
    ../t/cpan/CPANPLUS/t/30_CPANPLUS-Internals-Selfupdate.t .............. FAILED--non-zero wait status: 139
    ../t/cpan/Archive-Tar/t/01_use.t........ .................................... FAILED--non-zero wait status: 139
    ../lib/DBM_Filter/t/int32.t............. ....................................... FAILED--non-zero wait status: 139
    ../t/cpan/Module-Build/t/files.t........ .................................... FAILED--non-zero wait status: 139
    ../t/cpan/IO-Compress/t/cz-01version.t.. .............................. FAILED--non-zero wait status: 139
    ../t/cpan/IO-Compress/t/004gziphdr.t.... ................................ FAILED--non-zero wait status: 139
    ../t/cpan/CPANPLUS-Dist-Build/t/01_CPANPLUS-Dist-Build-Constants.t ... FAILED--non-zero wait status: 139
    ../t/cpan/Module-Build/t/manifypods.t... ............................... FAILED--non-zero wait status: 139

[stdio] -Duseithreads -Accflags=-DPERL_OLD_COPY_ON_WRITE
Inconsistent test results (between TEST and harness):
    ../ext/Devel-Peek/t/Peek.t.............. ........................................ FAILED at test 39

[perlio] -Duseithreads -Accflags=-DPERL_OLD_COPY_ON_WRITE
Inconsistent test results (between TEST and harness):
    ../t/comp/require.t..................... ............................................... FAILED at test 47
    ../lib/File/Find/t/taint.t.............. ........................................ FAILED at test 3
    ../lib/File/Find/t/find.t............... ......................................... FAILED at test 3
    ../ext/Devel-Peek/t/Peek.t.............. ........................................ FAILED at test 39

[en_US.utf8] -Duseithreads -Accflags=-DPERL_OLD_COPY_ON_WRITE
Inconsistent test results (between TEST and harness):
    ../t/comp/require.t..................... ............................................... FAILED at test 47
    ../lib/File/Find/t/taint.t.............. ........................................ FAILED at test 3
    ../t/lib/croak.t........................ .................................................. FAILED at test 32
    ../t/op/lex.t........................... ..................................................... FAILED at test 5
    ../lib/File/Find/t/find.t............... ......................................... FAILED at test 3
    ../ext/Devel-Peek/t/Peek.t.............. ........................................ FAILED at test 39

[stdio] -DDEBUGGING -Duseithreads -Accflags=-DPERL_OLD_COPY_ON_WRITE
Inconsistent test results (between TEST and harness):
    ../ext/PerlIO-encoding/t/encoding.t..... ............................... FAILED--expected 24 tests, saw 19
    ../lib/File/Find/t/taint.t.............. ........................................ FAILED at test 3
    ../lib/File/Find/t/find.t............... ......................................... FAILED at test 3
    ../ext/Devel-Peek/t/Peek.t.............. ........................................ FAILED at test 39

[perlio] -DDEBUGGING -Duseithreads -Accflags=-DPERL_OLD_COPY_ON_WRITE
Inconsistent test results (between TEST and harness):
    ../ext/PerlIO-encoding/t/encoding.t..... ............................... FAILED--expected 24 tests, saw 19
    ../t/comp/require.t..................... ............................................... FAILED at test 47
    ../lib/File/Find/t/taint.t.............. ........................................ FAILED at test 3
    ../lib/File/Find/t/find.t............... ......................................... FAILED at test 3
    ../ext/Devel-Peek/t/Peek.t.............. ........................................ FAILED at test 39

[en_US.utf8] -DDEBUGGING -Duseithreads -Accflags=-DPERL_OLD_COPY_ON_WRITE
Inconsistent test results (between TEST and harness):
    ../t/cpan/ExtUtils-MakeMaker/t/basic.t.. .............................. FAILED at test 22
    ../ext/PerlIO-encoding/t/encoding.t..... ............................... FAILED--expected 24 tests, saw 19
    ../t/cpan/ExtUtils-MakeMaker/t/recurs.t. .............................. FAILED at test 6
    ../t/comp/require.t..................... ............................................... FAILED at test 47
    ../t/cpan/ExtUtils-MakeMaker/t/miniperl.t ............................ FAILED at test 5
    ../lib/File/Find/t/taint.t.............. ........................................ FAILED at test 3
    ../t/cpan/CPANPLUS/t/04_CPANPLUS-Module.t ............................ FAILED at test 109
    ../t/lib/croak.t........................ .................................................. FAILED at test 32
    ../t/op/lex.t........................... ..................................................... FAILED at test 5
    ../t/dist/ExtUtils-Install/t/InstallWithMM.t ......................... FAILED at test 4
    ../t/cpan/ExtUtils-MakeMaker/t/pm_to_blib.t .......................... FAILED at test 4
    ../lib/File/Find/t/find.t............... ......................................... FAILED at test 3
    ../ext/Devel-Peek/t/Peek.t.............. ........................................ FAILED at test 39
    ../t/cpan/ExtUtils-MakeMaker/t/PL_FILES.t ............................ FAILED at test 3
    ../t/cpan/CPANPLUS/t/20_CPANPLUS-Dist-MM.t ........................... FAILED at test 11
    ../t/cpan/ExtUtils-MakeMaker/t/xs.t..... ................................. FAILED at test 4
    ../t/cpan/ExtUtils-MakeMaker/t/INSTALL_BASE.t ........................ FAILED at test 5

Compiler messages(gcc):
try.c: In function ‘int main()’:
try.c:36:10: warning: ignoring return value of ‘int pipe(int*)’, declared with attribute warn_unused_result [-Wunused-result]
try.c:37:10: warning: ignoring return value of ‘int pipe(int*)’, declared with attribute warn_unused_result [-Wunused-result]
try.c:53:35: warning: ignoring return value of ‘ssize_t write(int, const void*, size_t)’, declared with attribute warn_unused_result [-Wunused-result]
try.c:66:23: warning: ignoring return value of ‘ssize_t write(int, const void*, size_t)’, declared with attribute warn_unused_result [-Wunused-result]
try.c:72:35: warning: ignoring return value of ‘ssize_t write(int, const void*, size_t)’, declared with attribute warn_unused_result [-Wunused-result]
try.c:78:21: warning: ignoring return value of ‘ssize_t read(int, void*, size_t)’, declared with attribute warn_unused_result [-Wunused-result]
doio.c: In function ‘void S_exec_failed(const char*, int, int)’:
doio.c:1379:43: warning: ignoring return value of ‘ssize_t write(int, const void*, size_t)’, declared with attribute warn_unused_result [-Wunused-result]
doio.c: In function ‘PerlIOl** Perl_nextargv(GV*)’:
doio.c:876:46: warning: ignoring return value of ‘int fchown(int, __uid_t, __gid_t)’, declared with attribute warn_unused_result [-Wunused-result]
util.c: In function ‘void Perl_croak_no_mem()’:
util.c:1633:36: warning: ignoring return value of ‘ssize_t write(int, const void*, size_t)’, declared with attribute warn_unused_result [-Wunused-result]
perlio.c: In function ‘void PerlIO_debug(const char*, ...)’:
perlio.c:484:43: warning: ignoring return value of ‘ssize_t write(int, const void*, size_t)’, declared with attribute warn_unused_result [-Wunused-result]
pp_ctl.c: In function ‘OP* Perl_pp_goto()’:
pp_ctl.c:2870:8: warning: variable ‘newsp’ set but not used [-Wunused-but-set-variable]
pp_ctl.c:2871:7: warning: variable ‘gimme’ set but not used [-Wunused-but-set-variable]
mg_vtable.h:94:54: warning: ‘PL_magic_vtable_names’ initialized and declared ‘extern’ [enabled by default]
sv.c: In function ‘void Perl_sv_vcatpvfn_flags(SV*, const char*, STRLEN, __va_list_tag (*)[1], SV**, I32, bool*, U32)’:
sv.c:10327:41: warning: ignoring return value of ‘char* gcvt(double, int, char*)’, declared with attribute warn_unused_result [-Wunused-result]
sv.c:11177:53: warning: ignoring return value of ‘char* gcvt(double, int, char*)’, declared with attribute warn_unused_result [-Wunused-result]
sv.c: In function ‘char* Perl_sv_2pv_flags(SV*, STRLEN*, I32)’:
sv.c:2910:39: warning: ignoring return value of ‘char* gcvt(double, int, char*)’, declared with attribute warn_unused_result [-Wunused-result]
sdbm.c: In function ‘int makroom(DBM*, long int, int)’:
sdbm.c:378:70: warning: ignoring return value of ‘ssize_t write(int, const void*, size_t)’, declared with attribute warn_unused_result [-Wunused-result]
Call.xs: In function ‘I32 filter_call(int, SV*, int)’:
Call.xs:63:58: warning: format ‘%d’ expects argument of type ‘int’, but argument 3 has type ‘STRLEN {aka long unsigned int}’ [-Wformat]
Call.xs:63:58: warning: format ‘%d’ expects argument of type ‘int’, but argument 5 has type ‘STRLEN {aka long unsigned int}’ [-Wformat]
Call.xs:100:41: warning: format ‘%d’ expects argument of type ‘int’, but argument 4 has type ‘STRLEN {aka long unsigned int}’ [-Wformat]
Call.xs:156:38: warning: format ‘%d’ expects argument of type ‘int’, but argument 3 has type ‘STRLEN {aka long unsigned int}’ [-Wformat]
Call.xs:175:51: warning: format ‘%d’ expects argument of type ‘int’, but argument 4 has type ‘long unsigned int’ [-Wformat]
regcomp.c: In function ‘void S_dump_trie(const _reg_trie_data*, HV*, AV*, U32)’:
regcomp.c:1064:5: warning: variable ‘re_debug_flags’ set but not used [-Wunused-but-set-variable]
regcomp.c: In function ‘void S_dump_trie_interim_list(const _reg_trie_data*, HV*, AV*, U32, U32)’:
regcomp.c:1155:5: warning: variable ‘re_debug_flags’ set but not used [-Wunused-but-set-variable]
regcomp.c: In function ‘void S_dump_trie_interim_table(const _reg_trie_data*, HV*, AV*, U32, U32)’:
regcomp.c:1213:5: warning: variable ‘re_debug_flags’ set but not used [-Wunused-but-set-variable]
regcomp.c: In function ‘REGEXP* Perl_re_op_compile(SV**, int, OP*, const regexp_engine*, REGEXP*, bool*, U32, U32)’:
regcomp.c:6468:5: warning: variable ‘re_debug_flags’ set but not used [-Wunused-but-set-variable]
regcomp.c: In function ‘SV* Perl_reg_named_buff_nextkey(REGEXP*, U32)’:
regcomp.c:6616:5: warning: variable ‘re_debug_flags’ set but not used [-Wunused-but-set-variable]
regcomp.c: In function ‘void Perl_pregfree2(REGEXP*)’:
regcomp.c:14190:5: warning: variable ‘re_debug_flags’ set but not used [-Wunused-but-set-variable]
doio.c: In function ‘void S_exec_failed(PerlInterpreter*, const char*, int, int)’:
doio.c: In function ‘PerlIOl** Perl_nextargv(PerlInterpreter*, GV*)’:
util.c: In function ‘MGVTBL* Perl_get_vtbl(PerlInterpreter*, int)’:
util.c:3665:30: error: invalid conversion from ‘const MGVTBL* {aka const mgvtbl*}’ to ‘MGVTBL* {aka mgvtbl*}’ [-fpermissive]
pp_ctl.c: In function ‘OP* Perl_pp_goto(PerlInterpreter*)’:
sv.c: In function ‘void Perl_sv_vcatpvfn_flags(PerlInterpreter*, SV*, const char*, STRLEN, __va_list_tag (*)[1], SV**, I32, bool*, U32)’:
sv.c: In function ‘char* Perl_sv_2pv_flags(PerlInterpreter*, SV*, STRLEN*, I32)’:
regcomp.c: In function ‘void S_dump_trie(PerlInterpreter*, const _reg_trie_data*, HV*, AV*, U32)’:
regcomp.c: In function ‘void S_dump_trie_interim_list(PerlInterpreter*, const _reg_trie_data*, HV*, AV*, U32, U32)’:
regcomp.c: In function ‘void S_dump_trie_interim_table(PerlInterpreter*, const _reg_trie_data*, HV*, AV*, U32, U32)’:
regcomp.c: In function ‘REGEXP* Perl_re_op_compile(PerlInterpreter*, SV**, int, OP*, const regexp_engine*, REGEXP*, bool*, U32, U32)’:
regcomp.c: In function ‘SV* Perl_reg_named_buff_nextkey(PerlInterpreter*, REGEXP*, U32)’:
regcomp.c: In function ‘void Perl_pregfree2(PerlInterpreter*, REGEXP*)’:
sv.c:11177:53: warning: ignoring return value of ‘char* qgcvt(long double, int, char*)’, declared with attribute warn_unused_result [-Wunused-result]
sv.c:2910:39: warning: ignoring return value of ‘char* qgcvt(long double, int, char*)’, declared with attribute warn_unused_result [-Wunused-result]
Call.xs: In function ‘I32 filter_call(PerlInterpreter*, int, SV*, int)’:
toke.c: In function ‘int Perl_yylex()’:
toke.c:8441:11: warning: variable ‘tboffset’ set but not used [-Wunused-but-set-variable]
toke.c:8443:19: warning: variable ‘have_proto’ set but not used [-Wunused-but-set-variable]
util.c:1633:36: warning: ignoring return value of ‘ssize_t write(int, const void*, size_t)’, declared with attribute warn_unused_result [-Wunused-result]regcomp.c: In function ‘REGEXP* Perl_re_op_compile(SV**, int, OP*, const regexp_engine*, REGEXP*, bool*, U32, U32)’:
perlio.c:475:56: warning: ignoring return value of ‘ssize_t write(int, const void*, size_t)’, declared with attribute warn_unused_result [-Wunused-result]
perl.c: In function ‘void S_init_tls_and_interp(PerlInterpreter*)’:
perl.c:103:2: warning: ignoring return value of ‘ssize_t write(int, const void*, size_t)’, declared with attribute warn_unused_result [-Wunused-result]
sv.c: In function ‘DIR* Perl_dirp_dup(PerlInterpreter*, DIR*, CLONE_PARAMS*)’:
sv.c:11623:26: warning: ignoring return value of ‘int fchdir(int)’, declared with attribute warn_unused_result [-Wunused-result]
shared.xs: In function ‘user_lock* S_get_userlock(PerlInterpreter*, SV*, bool)’:
shared.xs:362:5: warning: deprecated conversion from string constant to ‘char*’ [-Wwrite-strings]
shared.xs: In function ‘void S_sharedsv_dec(PerlInterpreter*, SV*)’:
shared.xs:535:5: warning: deprecated conversion from string constant to ‘char*’ [-Wwrite-strings]
shared.xs: In function ‘void Perl_sharedsv_share(PerlInterpreter*, SV*)’:
shared.xs:564:9: warning: deprecated conversion from string constant to ‘char*’ [-Wwrite-strings]
shared.xs: In function ‘int sharedsv_scalar_mg_get(PerlInterpreter*, SV*, MAGIC*)’:
shared.xs:739:5: warning: deprecated conversion from string constant to ‘char*’ [-Wwrite-strings]
shared.xs: In function ‘int sharedsv_scalar_mg_set(PerlInterpreter*, SV*, MAGIC*)’:
shared.xs:817:5: warning: deprecated conversion from string constant to ‘char*’ [-Wwrite-strings]
shared.xs: In function ‘int sharedsv_scalar_mg_free(PerlInterpreter*, SV*, MAGIC*)’:
shared.xs:835:5: warning: deprecated conversion from string constant to ‘char*’ [-Wwrite-strings]
shared.xs: In function ‘int sharedsv_scalar_mg_local(PerlInterpreter*, SV*, MAGIC*)’:
shared.xs:868:9: warning: deprecated conversion from string constant to ‘char*’ [-Wwrite-strings]
shared.xs: In function ‘int sharedsv_elem_mg_FETCH(PerlInterpreter*, SV*, MAGIC*)’:
shared.xs:905:5: warning: deprecated conversion from string constant to ‘char*’ [-Wwrite-strings]
shared.xs: In function ‘int sharedsv_elem_mg_STORE(PerlInterpreter*, SV*, MAGIC*)’:
shared.xs:960:5: warning: deprecated conversion from string constant to ‘char*’ [-Wwrite-strings]
shared.xs: In function ‘int sharedsv_elem_mg_DELETE(PerlInterpreter*, SV*, MAGIC*)’:
shared.xs:1003:5: warning: deprecated conversion from string constant to ‘char*’ [-Wwrite-strings]
shared.xs: In function ‘U32 sharedsv_array_mg_FETCHSIZE(PerlInterpreter*, SV*, MAGIC*)’:
shared.xs:1066:5: warning: deprecated conversion from string constant to ‘char*’ [-Wwrite-strings]
shared.xs: In function ‘int sharedsv_array_mg_CLEAR(PerlInterpreter*, SV*, MAGIC*)’:
shared.xs:1086:5: warning: deprecated conversion from string constant to ‘char*’ [-Wwrite-strings]
shared.xs: In function ‘void Perl_sharedsv_lock(PerlInterpreter*, SV*)’:
shared.xs:1190:63: warning: deprecated conversion from string constant to ‘char*’ [-Wwrite-strings]
shared.xs: In function ‘void XS_threads__shared__tie_PUSH(PerlInterpreter*, CV*)’:
shared.xs:1287:13: warning: deprecated conversion from string constant to ‘char*’ [-Wwrite-strings]
shared.xs: In function ‘void XS_threads__shared__tie_UNSHIFT(PerlInterpreter*, CV*)’:
shared.xs:1305:9: warning: deprecated conversion from string constant to ‘char*’ [-Wwrite-strings]
shared.xs: In function ‘void XS_threads__shared__tie_POP(PerlInterpreter*, CV*)’:
shared.xs:1330:9: warning: deprecated conversion from string constant to ‘char*’ [-Wwrite-strings]
shared.xs: In function ‘void XS_threads__shared__tie_SHIFT(PerlInterpreter*, CV*)’:
shared.xs:1347:9: warning: deprecated conversion from string constant to ‘char*’ [-Wwrite-strings]
shared.xs: In function ‘void XS_threads__shared__tie_EXTEND(PerlInterpreter*, CV*)’:
shared.xs:1363:9: warning: deprecated conversion from string constant to ‘char*’ [-Wwrite-strings]
shared.xs: In function ‘void XS_threads__shared__tie_STORESIZE(PerlInterpreter*, CV*)’:
shared.xs:1373:9: warning: deprecated conversion from string constant to ‘char*’ [-Wwrite-strings]
shared.xs: In function ‘void XS_threads__shared__tie_EXISTS(PerlInterpreter*, CV*)’:
shared.xs:1385:13: warning: deprecated conversion from string constant to ‘char*’ [-Wwrite-strings]
shared.xs:1395:13: warning: deprecated conversion from string constant to ‘char*’ [-Wwrite-strings]
shared.xs: In function ‘void XS_threads__shared__tie_FIRSTKEY(PerlInterpreter*, CV*)’:
shared.xs:1411:9: warning: deprecated conversion from string constant to ‘char*’ [-Wwrite-strings]
shared.xs: In function ‘void XS_threads__shared__tie_NEXTKEY(PerlInterpreter*, CV*)’:
shared.xs:1439:9: warning: deprecated conversion from string constant to ‘char*’ [-Wwrite-strings]
shared.xs: In function ‘void XS_threads__shared_bless(PerlInterpreter*, CV*)’:
shared.xs:1699:13: warning: deprecated conversion from string constant to ‘char*’ [-Wwrite-strings]
threads.xs: In function ‘ithread* S_ithread_create(PerlInterpreter*, SV*, IV, int, int, int, int)’:
threads.xs:714:83: warning: ignoring return value of ‘ssize_t write(int, const void*, size_t)’, declared with attribute warn_unused_result [-Wunused-result]
toke.c: In function ‘int Perl_yylex(PerlInterpreter*)’:
-- 
Report by Test::Smoke v1.44 build 1285 running on perl 5.14.2
(Reporter v0.035 / Smoker v0.045)




nntp.perl.org: Perl Programming lists via nntp and http.
Comments to Ask Bjørn Hansen at ask@perl.org | Group listing | About