develooper Front page | perl.perl5.porters | Postings from November 2012

Smoke [blead] v5.17.6-80-g06099f7 FAIL(F) linux 3.2.0-31-generic [debian] (x86_64/8 cpu)

From:
George Greer
Date:
November 27, 2012 13:38
Subject:
Smoke [blead] v5.17.6-80-g06099f7 FAIL(F) linux 3.2.0-31-generic [debian] (x86_64/8 cpu)
Message ID:
201211272137.qARLbi4P021702@m-l.org
Smoke logs available at http://m-l.org/~perl/smoke/perl/

Automated smoke report for 5.17.7 patch 06099f79acc9684bcbd2efbb1efe56ce80c65f08 v5.17.6-80-g06099f7
zwei: Intel(R) Core(TM) i7 CPU 920 @ 2.67GHz (GenuineIntel 1600MHz) (x86_64/8 cpu)
    on        linux - 3.2.0-31-generic [debian]
    using     clang version 4.2.1 Compatible Clang 3.3 (trunk 168545)
    smoketime 1 day 1 hour 54 minutes (average 6 hours 28 minutes)

Summary: FAIL(F)

O = OK  F = Failure(s), extended report at the bottom
X = Failure(s) under TEST but not under harness
? = still running or test results not (yet) available
Build failures during:       - = unknown or N/A
c = Configure, m = make, M = make (after miniperl), t = make test-prep

v5.17.6-80-g06099f7  Configuration (common) -Accflags="-DPERL_POISON -fsanitize=address" -Aldflags="-fsanitize=address" -Dcc=clang
----------- ---------------------------------------------------------
F F F F     
F F F F     -Duseithreads
| +--------- -DDEBUGGING
+----------- no debugging


Locally applied patches:
    uncommitted-changes
    SMOKE06099f79acc9684bcbd2efbb1efe56ce80c65f08

Testsuite was run only with 'harness'

Failures: (common-args) -Accflags="-DPERL_POISON -fsanitize=address" -Aldflags="-fsanitize=address" -Dcc=clang
[default] 
../t/comp/hints.t...........................................FAILED
    Non-zero exit status: 1
    No plan found in TAP output
../t/comp/proto.t...........................................FAILED
    Non-zero exit status: 1
    No plan found in TAP output
../t/re/pat_advanced.t......................................FAILED
    Non-zero exit status: 1
    No plan found in TAP output
../t/re/pat_rt_report.t.....................................FAILED
    Non-zero exit status: 1
    No plan found in TAP output
../t/re/pat_re_eval.t.......................................FAILED
    Non-zero exit status: 1
    No plan found in TAP output
../t/re/pat.t...............................................FAILED
    Non-zero exit status: 1
    No plan found in TAP output
../t/re/charset.t...........................................FAILED
    Non-zero exit status: 1
    No plan found in TAP output
../t/re/regexp.t............................................FAILED
    Non-zero exit status: 1
    Bad plan.  You planned 1719 tests but ran 165.
../t/re/regexp_noamp.t......................................FAILED
    Non-zero exit status: 1
    Bad plan.  You planned 1719 tests but ran 165.
../t/re/regexp_notrie.t.....................................FAILED
    Non-zero exit status: 1
    Bad plan.  You planned 1719 tests but ran 165.
../t/re/regexp_qr.t.........................................FAILED
    Non-zero exit status: 1
    Bad plan.  You planned 1719 tests but ran 165.
../t/re/recompile.t.........................................FAILED
    14, 16, 18, 20
../t/re/regexp_qr_embed.t...................................FAILED
    Non-zero exit status: 1
    Bad plan.  You planned 1719 tests but ran 165.
../t/re/subst.t.............................................FAILED
    Non-zero exit status: 1
    No plan found in TAP output
../t/re/substT.t............................................FAILED
    Non-zero exit status: 1
    No plan found in TAP output
../t/re/subst_wamp.t........................................FAILED
    Non-zero exit status: 1
    No plan found in TAP output
../t/re/reg_fold.t..........................................FAILED
    Non-zero exit status: 1
    Bad plan.  You planned 5295 tests but ran 193.
../t/re/regexp_trielist.t...................................FAILED
    Non-zero exit status: 1
    Bad plan.  You planned 1719 tests but ran 165.
../t/re/fold_grind.t........................................FAILED
    Non-zero exit status: 1
    No plan found in TAP output
../t/op/die.t...............................................FAILED
    Non-zero exit status: 1
    No plan found in TAP output
../t/op/split.t.............................................FAILED
    Non-zero exit status: 1
    No plan found in TAP output
../t/op/utftaint.t..........................................FAILED
    87-88
../t/uni/opcroak.t..........................................FAILED
    Non-zero exit status: 1
    No plan found in TAP output
../t/uni/latin2.t...........................................FAILED
    Non-zero exit status: 1
    Bad plan.  You planned 94 tests but ran 75.
../t/uni/parser.t...........................................FAILED
    Non-zero exit status: 1
    No plan found in TAP output
../ext/re/t/re_funcs_u.t....................................FAILED
    Non-zero exit status: 1
    No plan found in TAP output
../ext/re/t/reflags.t.......................................FAILED
    Non-zero exit status: 1
    Bad plan.  You planned 62 tests but ran 0.
../ext/XS-APItest/t/callregexec.t...........................FAILED
    Non-zero exit status: 1
    Bad plan.  You planned 50 tests but ran 0.
../ext/XS-APItest/t/newCONSTSUB.t...........................FAILED
    Non-zero exit status: 1
    Bad plan.  You planned 22 tests but ran 0.

[minitest] 
[minitest] -DDEBUGGING
[minitest] -DDEBUGGING -Duseithreads
    t/comp/hints ................... FAILED--no leader found
    t/comp/proto ................... FAILED--no leader found
    t/re/charset ................... FAILED--no leader found
    t/re/pat ....................... FAILED--no leader found
    t/re/regexp .................... FAILED--expected 1719 tests, saw 165
    t/re/regexp_noamp .............. FAILED--expected 1719 tests, saw 165
    t/re/regexp_notrie ............. FAILED--expected 1719 tests, saw 165
    t/re/regexp_qr ................. FAILED--expected 1719 tests, saw 165
    t/re/regexp_qr_embed ........... FAILED--expected 1719 tests, saw 165
    t/re/regexp_trielist ........... FAILED--expected 1719 tests, saw 165
    t/re/subst ..................... FAILED--no leader found
    t/re/substT .................... FAILED--no leader found
    t/re/subst_wamp ................ FAILED--no leader found
    t/op/die ....................... FAILED--no leader found
    t/op/split ..................... FAILED--no leader found
    t/op/utftaint .................. FAILED at test 87
    t/uni/opcroak .................. FAILED--no leader found
    t/uni/parser ................... FAILED--no leader found

[default] -DDEBUGGING
../t/comp/hints.t...........................................FAILED
    Non-zero exit status: 1
    No plan found in TAP output
../t/comp/proto.t...........................................FAILED
    Non-zero exit status: 1
    No plan found in TAP output
../t/re/pat_advanced.t......................................FAILED
    Non-zero exit status: 1
    No plan found in TAP output
../t/re/pat_re_eval.t.......................................FAILED
    Non-zero exit status: 1
    No plan found in TAP output
../t/re/pat.t...............................................FAILED
    Non-zero exit status: 1
    No plan found in TAP output
../t/re/pat_rt_report.t.....................................FAILED
    Non-zero exit status: 1
    No plan found in TAP output
../t/re/charset.t...........................................FAILED
    Non-zero exit status: 1
    No plan found in TAP output
../t/re/regexp.t............................................FAILED
    Non-zero exit status: 1
    Bad plan.  You planned 1719 tests but ran 165.
../t/re/regexp_noamp.t......................................FAILED
    Non-zero exit status: 1
    Bad plan.  You planned 1719 tests but ran 165.
../t/re/regexp_notrie.t.....................................FAILED
    Non-zero exit status: 1
    Bad plan.  You planned 1719 tests but ran 165.
../t/re/regexp_qr.t.........................................FAILED
    Non-zero exit status: 1
    Bad plan.  You planned 1719 tests but ran 165.
../t/re/regexp_qr_embed.t...................................FAILED
    Non-zero exit status: 1
    Bad plan.  You planned 1719 tests but ran 165.
../t/re/subst.t.............................................FAILED
    Non-zero exit status: 1
    No plan found in TAP output
../t/re/subst_wamp.t........................................FAILED
    Non-zero exit status: 1
    No plan found in TAP output
../t/re/substT.t............................................FAILED
    Non-zero exit status: 1
    No plan found in TAP output
../t/re/regexp_trielist.t...................................FAILED
    Non-zero exit status: 1
    Bad plan.  You planned 1719 tests but ran 165.
../t/re/reg_fold.t..........................................FAILED
    Non-zero exit status: 1
    Bad plan.  You planned 5295 tests but ran 193.
../t/re/recompile.t.........................................FAILED
    13, 15, 17, 19
../t/op/die.t...............................................FAILED
    Non-zero exit status: 1
    No plan found in TAP output
../t/re/fold_grind.t........................................FAILED
    Non-zero exit status: 1
    No plan found in TAP output
../t/op/split.t.............................................FAILED
    Non-zero exit status: 1
    No plan found in TAP output
../t/op/utftaint.t..........................................FAILED
    87-88
../t/uni/opcroak.t..........................................FAILED
    Non-zero exit status: 1
    No plan found in TAP output
../t/uni/latin2.t...........................................FAILED
    Non-zero exit status: 1
    Bad plan.  You planned 94 tests but ran 75.
../t/uni/parser.t...........................................FAILED
    Non-zero exit status: 1
    No plan found in TAP output
../ext/re/t/re_funcs_u.t....................................FAILED
    Non-zero exit status: 1
    No plan found in TAP output
../ext/re/t/reflags.t.......................................FAILED
    Non-zero exit status: 1
    Bad plan.  You planned 62 tests but ran 0.
../ext/XS-APItest/t/callregexec.t...........................FAILED
    Non-zero exit status: 1
    Bad plan.  You planned 50 tests but ran 0.
../ext/XS-APItest/t/newCONSTSUB.t...........................FAILED
    Non-zero exit status: 1
    Bad plan.  You planned 22 tests but ran 0.

[default] -Duseithreads
../t/comp/hints.t...........................................FAILED
    Non-zero exit status: 1
    No plan found in TAP output
../t/comp/proto.t...........................................FAILED
    Non-zero exit status: 1
    No plan found in TAP output
../t/run/fresh_perl.t.......................................FAILED
    23
../t/re/pat_advanced_thr.t..................................FAILED
    Non-zero exit status: 1
    No plan found in TAP output
../t/re/pat_advanced.t......................................FAILED
    Non-zero exit status: 1
    No plan found in TAP output
../t/re/pat.t...............................................FAILED
    Non-zero exit status: 1
    No plan found in TAP output
../t/re/pat_re_eval.t.......................................FAILED
    Non-zero exit status: 1
    No plan found in TAP output
../t/re/pat_rt_report.t.....................................FAILED
    Non-zero exit status: 1
    No plan found in TAP output
../t/re/pat_re_eval_thr.t...................................FAILED
    Non-zero exit status: 1
    No plan found in TAP output
../t/re/pat_rt_report_thr.t.................................FAILED
    Non-zero exit status: 1
    No plan found in TAP output
../t/re/pat_thr.t...........................................FAILED
    Non-zero exit status: 1
    No plan found in TAP output
../t/re/charset.t...........................................FAILED
    Non-zero exit status: 1
    No plan found in TAP output
../t/re/regexp.t............................................FAILED
    Non-zero exit status: 1
    Bad plan.  You planned 1719 tests but ran 165.
../t/re/regexp_noamp.t......................................FAILED
    Non-zero exit status: 1
    Bad plan.  You planned 1719 tests but ran 165.
../t/re/regexp_notrie.t.....................................FAILED
    Non-zero exit status: 1
    Bad plan.  You planned 1719 tests but ran 165.
../t/re/recompile.t.........................................FAILED
    14, 16, 18, 20
../t/re/reg_fold.t..........................................FAILED
    Non-zero exit status: 1
    Bad plan.  You planned 5295 tests but ran 193.
../t/re/regexp_qr.t.........................................FAILED
    Non-zero exit status: 1
    Bad plan.  You planned 1719 tests but ran 165.
../t/re/regexp_qr_embed.t...................................FAILED
    Non-zero exit status: 1
    Bad plan.  You planned 1719 tests but ran 165.
../t/re/regexp_trielist.t...................................FAILED
    Non-zero exit status: 1
    Bad plan.  You planned 1719 tests but ran 165.
../t/re/subst.t.............................................FAILED
    Non-zero exit status: 1
    No plan found in TAP output
../t/re/substT.t............................................FAILED
    Non-zero exit status: 1
    No plan found in TAP output
../t/re/subst_wamp.t........................................FAILED
    Non-zero exit status: 1
    No plan found in TAP output
../t/re/fold_grind.t........................................FAILED
    Non-zero exit status: 1
    No plan found in TAP output
../t/op/die.t...............................................FAILED
    Non-zero exit status: 1
    No plan found in TAP output
../t/op/coreamp.t...........................................FAILED
    Non-zero exit status: 1
    No plan found in TAP output
../t/re/regexp_qr_embed_thr.t...............................FAILED
    Non-zero exit status: 1
    Bad plan.  You planned 1719 tests but ran 165.
../t/op/readline.t..........................................FAILED
    Non-zero exit status: 1
../t/op/ref.t...............................................FAILED
    Non-zero exit status: 1
    Bad plan.  You planned 230 tests but ran 229.
../t/op/split.t.............................................FAILED
    Non-zero exit status: 1
    No plan found in TAP output
../t/op/tr.t................................................FAILED
    Non-zero exit status: 1
    Bad plan.  You planned 132 tests but ran 130.
../t/op/utftaint.t..........................................FAILED
    87-88
../t/uni/opcroak.t..........................................FAILED
    Non-zero exit status: 1
    No plan found in TAP output
../t/uni/latin2.t...........................................FAILED
    Non-zero exit status: 1
    Bad plan.  You planned 94 tests but ran 75.
../t/uni/parser.t...........................................FAILED
    Non-zero exit status: 1
    No plan found in TAP output
../lib/overload_nomethod.t..................................FAILED
    Non-zero exit status: 1
../t/porting/podcheck.t.....................................FAILED
    Non-zero exit status: 1
../cpan/AutoLoader/t/01AutoLoader.t.........................FAILED
    Non-zero exit status: 1
../cpan/CPAN-Meta-Requirements/t/bad_version_hook.t.........FAILED
    Non-zero exit status: 1
../cpan/Digest-MD5/t/badfile.t..............................FAILED
    Non-zero exit status: 1
../cpan/CPAN-Meta-Requirements/t/basic.t....................FAILED
    Non-zero exit status: 1
../cpan/CPAN-Meta-Requirements/t/finalize.t.................FAILED
    Non-zero exit status: 1
../cpan/CPAN-Meta-Requirements/t/from-hash.t................FAILED
    Non-zero exit status: 1
../cpan/CPAN-Meta-Requirements/t/merge.t....................FAILED
    Non-zero exit status: 1
../cpan/CPANPLUS/t/00_CPANPLUS-Internals-Utils.t............FAILED
    Non-zero exit status: 1
../cpan/CGI/t/carp.t........................................FAILED
    Non-zero exit status: 1
../cpan/Digest/t/base.t.....................................FAILED
    Non-zero exit status: 1
../cpan/Digest/t/digest.t...................................FAILED
    Non-zero exit status: 1
../cpan/Digest/t/file.t.....................................FAILED
    Non-zero exit status: 1
../cpan/CPAN-Meta/t/converter-bad.t.........................FAILED
    Non-zero exit status: 1
../cpan/Digest/t/security.t.................................FAILED
    Non-zero exit status: 1
../cpan/Compress-Raw-Bzip2/t/01bzip2.t......................FAILED
    Non-zero exit status: 1
../cpan/CPAN-Meta/t/converter-fail.t........................FAILED
    Non-zero exit status: 1
../cpan/CGI/t/cookie.t......................................FAILED
    Non-zero exit status: 1
../cpan/Compress-Raw-Bzip2/t/99pod.t........................FAILED
    Non-zero exit status: 1
../cpan/Compress-Raw-Zlib/t/02zlib.t........................FAILED
    Non-zero exit status: 1
../cpan/AutoLoader/t/02AutoSplit.t..........................FAILED
    Non-zero exit status: 1
../cpan/CPANPLUS/t/01_CPANPLUS-Configure.t..................FAILED
    Non-zero exit status: 1
../cpan/File-Path/t/Path.t..................................FAILED
    Non-zero exit status: 1
    Bad plan.  You planned 129 tests but ran 128.
../cpan/CPAN-Meta/t/converter.t.............................FAILED
    Non-zero exit status: 1
../cpan/CGI/t/headers.t.....................................FAILED
    Non-zero exit status: 1
../cpan/CPANPLUS-Dist-Build/t/02_CPANPLUS-Dist-Build.t......FAILED
    Non-zero exit status: 1
../cpan/CGI/t/http.t........................................FAILED
    Non-zero exit status: 1
../cpan/HTTP-Tiny/t/00-compile.t............................FAILED
    Non-zero exit status: 1
../cpan/Archive-Tar/t/02_methods.t..........................FAILED
    Non-zero exit status: 1
    No plan found in TAP output
../cpan/CPAN-Meta/t/load-bad.t..............................FAILED
    Non-zero exit status: 1
../cpan/CPANPLUS/t/02_CPANPLUS-Internals.t..................FAILED
    Non-zero exit status: 1
../cpan/CPAN-Meta/t/meta-obj.t..............................FAILED
    Non-zero exit status: 1
../cpan/HTTP-Tiny/t/002_croakage.t..........................FAILED
    Non-zero exit status: 1
../cpan/CGI/t/param_fetch.t.................................FAILED
    Non-zero exit status: 1
../cpan/HTTP-Tiny/t/010_url.t...............................FAILED
    Non-zero exit status: 1
../cpan/CPAN-Meta/t/prereqs-finalize.t......................FAILED
    Non-zero exit status: 1
../cpan/HTTP-Tiny/t/020_headers.t...........................FAILED
    Non-zero exit status: 1
../cpan/CPAN-Meta-YAML/t/02_basic.t.........................FAILED
    Non-zero exit status: 1
../cpan/CPAN-Meta/t/prereqs-merge.t.........................FAILED
    Non-zero exit status: 1
../cpan/HTTP-Tiny/t/030_response.t..........................FAILED
    Non-zero exit status: 1
../cpan/CPAN-Meta/t/prereqs.t...............................FAILED
    Non-zero exit status: 1
../cpan/CPAN-Meta/t/repository.t............................FAILED
    Non-zero exit status: 1
../cpan/CGI/t/request.t.....................................FAILED
    Non-zero exit status: 1
../cpan/HTTP-Tiny/t/050_chunked_body.t......................FAILED
    Non-zero exit status: 1
../cpan/Archive-Tar/t/04_resolved_issues.t..................FAILED
    Non-zero exit status: 1
../cpan/CGI/t/save_read_roundtrip.t.........................FAILED
    Non-zero exit status: 1
../cpan/CPANPLUS/t/03_CPANPLUS-Internals-Source.t...........FAILED
    Non-zero exit status: 1
../cpan/CPAN-Meta/t/strings.t...............................FAILED
    Non-zero exit status: 1
../cpan/Archive-Tar/t/05_iter.t.............................FAILED
    Non-zero exit status: 1
../cpan/IPC-SysV/t/ipcsysv.t................................FAILED
    Non-zero exit status: 1
../cpan/HTTP-Tiny/t/100_get.t...............................FAILED
    Non-zero exit status: 1
../cpan/Archive-Tar/t/06_error.t............................FAILED
    Non-zero exit status: 1
../cpan/JSON-PP/t/001_utf8.t................................FAILED
    Non-zero exit status: 1
../cpan/IPC-SysV/t/pod.t....................................FAILED
    Non-zero exit status: 1
../cpan/Archive-Tar/t/99_pod.t..............................FAILED
    Non-zero exit status: 1
../cpan/IPC-SysV/t/podcov.t.................................FAILED
    Non-zero exit status: 1
../cpan/JSON-PP/t/002_error.t...............................FAILED
    Non-zero exit status: 1
../cpan/List-Util/t/first.t.................................FAILED
    Non-zero exit status: 1
../cpan/Locale-Maketext-Simple/t/2-load_po_without_i_default.tFAILED
    Non-zero exit status: 1
../cpan/Locale-Maketext-Simple/t/3-load_po_with_i_default.t.FAILED
    Non-zero exit status: 1
../cpan/Log-Message/t/01_Log-Message-Config.t...............FAILED
    Non-zero exit status: 1
../cpan/Log-Message/t/02_Log-Message.t......................FAILED
    Non-zero exit status: 1
../cpan/Log-Message-Simple/t/03_functions.t.................FAILED
    Non-zero exit status: 1
../cpan/JSON-PP/t/008_pc_base.t.............................FAILED
    Non-zero exit status: 1
../cpan/HTTP-Tiny/t/140_proxy.t.............................FAILED
    Non-zero exit status: 1
../cpan/Archive-Extract/t/01_Archive-Extract.t..............FAILED
    Non-zero exit status: 1
../cpan/CPANPLUS/t/04_CPANPLUS-Module.t.....................FAILED
    Non-zero exit status: 1
../cpan/List-Util/t/proto.t.................................FAILED
    Non-zero exit status: 1
../cpan/JSON-PP/t/012_blessed.t.............................FAILED
    Non-zero exit status: 1
../cpan/List-Util/t/reduce.t................................FAILED
    Non-zero exit status: 1
../cpan/JSON-PP/t/013_limit.t...............................FAILED
    Non-zero exit status: 1
../cpan/IPC-Cmd/t/01_IPC-Cmd.t..............................FAILED
    Non-zero exit status: 1
../cpan/IO-Compress/t/001bzip2.t............................FAILED
    Non-zero exit status: 1
../cpan/CPANPLUS/t/05_CPANPLUS-Internals-Fetch.t............FAILED
    Non-zero exit status: 1
../cpan/JSON-PP/t/017_relaxed.t.............................FAILED
    Non-zero exit status: 1
../cpan/JSON-PP/t/018_json_checker.t........................FAILED
    Non-zero exit status: 1
../cpan/Module-Load/t/01_Module-Load.t......................FAILED
    Non-zero exit status: 1
../cpan/Module-Loaded/t/01_Module-Loaded.t..................FAILED
    Non-zero exit status: 1
../cpan/Module-Pluggable/t/02alsoworks.t....................FAILED
    Non-zero exit status: 1
../cpan/CPAN-Meta-YAML/t/03_regression.t....................FAILED
    Non-zero exit status: 1
../cpan/CPANPLUS/t/07_CPANPLUS-Internals-Extract.t..........FAILED
    Non-zero exit status: 1
../cpan/Module-Pluggable/t/02works.t........................FAILED
    Non-zero exit status: 1
../cpan/Module-Pluggable/t/03diffname.t.....................FAILED
    Non-zero exit status: 1
../cpan/Module-Pluggable/t/04acmedir.t......................FAILED
    Non-zero exit status: 1
../cpan/Module-Metadata/t/metadata.t........................FAILED
    Non-zero exit status: 1
../cpan/Module-Pluggable/t/04acmedir_single.t...............FAILED
    Non-zero exit status: 1
../cpan/Module-Pluggable/t/04acmepath.t.....................FAILED
    Non-zero exit status: 1
../cpan/NEXT/t/actual.t.....................................FAILED
    Non-zero exit status: 1
../cpan/Module-Pluggable/t/04acmepath_single.t..............FAILED
    Non-zero exit status: 1
../cpan/NEXT/t/actuns.t.....................................FAILED
    Non-zero exit status: 1
../cpan/Module-Pluggable/t/05postpath.t.....................FAILED
    Non-zero exit status: 1
../cpan/Module-Pluggable/t/06multipath.t....................FAILED
    Non-zero exit status: 1
../cpan/CPAN-Meta-YAML/t/11_meta_yml.t......................FAILED
    Non-zero exit status: 1
../cpan/JSON-PP/t/019_incr.t................................FAILED
    Non-zero exit status: 1
../cpan/Module-Build/t/properties/license.t.................FAILED
    Non-zero exit status: 1
../cpan/JSON-PP/t/020_unknown.t.............................FAILED
    Non-zero exit status: 1
../cpan/Module-Pluggable/t/08nothing.t......................FAILED
    Non-zero exit status: 1
../cpan/JSON-PP/t/021_evans_bugrep.t........................FAILED
    Non-zero exit status: 1
../cpan/CPAN-Meta-YAML/t/12_plagger.t.......................FAILED
    Non-zero exit status: 1
../cpan/Package-Constants/t/01_list.t.......................FAILED
    Non-zero exit status: 1
../cpan/Object-Accessor/t/00_Object-Accessor.t..............FAILED
    Non-zero exit status: 1
../cpan/CPAN-Meta-YAML/t/13_perl_smith.t....................FAILED
    Non-zero exit status: 1
../cpan/Object-Accessor/t/01_Object-Accessor-Subclassed.t...FAILED
    Non-zero exit status: 1
../cpan/CPAN-Meta-YAML/t/14_yaml_org.t......................FAILED
    Non-zero exit status: 1
../cpan/Params-Check/t/01_Params-Check.t....................FAILED
    Non-zero exit status: 1
../cpan/Module-Pluggable/t/10innerpack_onefile.t............FAILED
    Non-zero exit status: 1
../cpan/Module-Build/t/add_property.t.......................FAILED
    Non-zero exit status: 1
../cpan/CPAN-Meta-YAML/t/15_multibyte.t.....................FAILED
    Non-zero exit status: 1
../cpan/Module-Pluggable/t/10innerpack_super.t..............FAILED
    Non-zero exit status: 1
../cpan/Perl-OSType/t/00-compile.t..........................FAILED
    Non-zero exit status: 1
../cpan/Parse-CPAN-Meta/t/02_api.t..........................FAILED
    Non-zero exit status: 1
../cpan/CPAN-Meta-YAML/t/16_nullrefs.t......................FAILED
    Non-zero exit status: 1
../cpan/Module-Pluggable/t/11usetwice.t.....................FAILED
    Non-zero exit status: 1
../cpan/Parse-CPAN-Meta/t/03_functions.t....................FAILED
    Non-zero exit status: 1
../cpan/Module-Pluggable/t/12only.t.........................FAILED
    Non-zero exit status: 1
../cpan/Parse-CPAN-Meta/t/05_errors.t.......................FAILED
    Non-zero exit status: 1
../cpan/CPAN-Meta-YAML/t/17_toolbar.t.......................FAILED
    Non-zero exit status: 1
../cpan/Module-Pluggable/t/12onlyarray.t....................FAILED
    Non-zero exit status: 1
../cpan/Object-Accessor/t/05_Object-Accessor-callback.t.....FAILED
    Non-zero exit status: 1
../cpan/Module-Pluggable/t/12onlyregex.t....................FAILED
    Non-zero exit status: 1
../cpan/CPANPLUS/t/08_CPANPLUS-Backend.t....................FAILED
    Non-zero exit status: 1
../cpan/Object-Accessor/t/06_Object-Accessor-alias.t........FAILED
    Non-zero exit status: 1
../cpan/ExtUtils-MakeMaker/t/basic.t........................FAILED
    Non-zero exit status: 1
    Bad plan.  You planned 171 tests but ran 169.
../cpan/Module-Pluggable/t/13except.t.......................FAILED
    Non-zero exit status: 1
../cpan/Pod-Perldoc/t/load.t................................FAILED
    Non-zero exit status: 1
../cpan/Module-Pluggable/t/13exceptarray.t..................FAILED
    Non-zero exit status: 1
../cpan/Module-Pluggable/t/13exceptregex.t..................FAILED
    Non-zero exit status: 1
../cpan/CPAN-Meta-YAML/t/18_tap.t...........................FAILED
    Non-zero exit status: 1
../cpan/Module-Pluggable/t/14package.t......................FAILED
    Non-zero exit status: 1
../cpan/ExtUtils-MakeMaker/t/build_man.t....................FAILED
    Non-zero exit status: 1
    Bad plan.  You planned 9 tests but ran 8.
../cpan/CPAN-Meta-YAML/t/19_errors.t........................FAILED
    Non-zero exit status: 1
../cpan/Module-Pluggable/t/16different_extension.t..........FAILED
    Non-zero exit status: 1
../cpan/Socket/t/getaddrinfo.t..............................FAILED
    Non-zero exit status: 1
../cpan/CPANPLUS/t/09_CPANPLUS-Internals-Search.t...........FAILED
    Non-zero exit status: 1
../cpan/Module-Pluggable/t/17devel_inner_package.t..........FAILED
    Non-zero exit status: 1
../cpan/CPAN-Meta-YAML/t/21_bom.t...........................FAILED
    Non-zero exit status: 1
../cpan/Module-Pluggable/t/18skipped_package.t..............FAILED
    Non-zero exit status: 1
../cpan/Module-Pluggable/t/19can_ok_clobber.t...............FAILED
    Non-zero exit status: 1
../cpan/Sys-Syslog/t/constants.t............................FAILED
    Non-zero exit status: 1
../cpan/Sys-Syslog/t/facilities-routing.t...................FAILED
    Non-zero exit status: 1
../cpan/CPAN-Meta-YAML/t/22_comments.t......................FAILED
    Non-zero exit status: 1
../cpan/Module-Pluggable/t/20dodgy_files.t..................FAILED
    Non-zero exit status: 1
../cpan/Socket/t/sockaddr.t.................................FAILED
    Non-zero exit status: 1
../cpan/Module-Pluggable/t/21editor_junk.t..................FAILED
    Non-zero exit status: 1
../cpan/Module-Build/t/basic.t..............................FAILED
    Non-zero exit status: 1
../cpan/CPANPLUS/t/10_CPANPLUS-Error.t......................FAILED
    Non-zero exit status: 1
../cpan/Term-ANSIColor/t/basic.t............................FAILED
    Non-zero exit status: 1
../cpan/Module-Pluggable/t/22trigger.t......................FAILED
    Non-zero exit status: 1
../cpan/Module-Pluggable/t/23depth.t........................FAILED
    Non-zero exit status: 1
../cpan/Term-UI/t/02_ui.t...................................FAILED
    Non-zero exit status: 1
../cpan/Sys-Syslog/t/syslog.t...............................FAILED
    Non-zero exit status: 1
../cpan/ExtUtils-MakeMaker/t/fix_libs.t.....................FAILED
    Non-zero exit status: 1
../cpan/Test-Simple/t/bad_plan.t............................FAILED
    Non-zero exit status: 1
../cpan/Test-Simple/t/Builder/carp.t........................FAILED
    Non-zero exit status: 1
../cpan/Test-Harness/t/compat/env_opts.t....................FAILED
    Non-zero exit status: 1
../cpan/Test-Simple/t/bail_out.t............................FAILED
    Non-zero exit status: 1
../cpan/Module-Build/t/properties/needs_compiler.t..........FAILED
    Non-zero exit status: 1
../cpan/ExtUtils-MakeMaker/t/hints.t........................FAILED
    Non-zero exit status: 1
../cpan/CPANPLUS/t/15_CPANPLUS-Shell.t......................FAILED
    Non-zero exit status: 1
../cpan/Test-Harness/t/compat/failure.t.....................FAILED
    Non-zero exit status: 1
../cpan/Test-Simple/t/Builder/details.t.....................FAILED
    Non-zero exit status: 1
../cpan/IO-Compress/t/004gziphdr.t..........................FAILED
    Non-zero exit status: 1
../cpan/Test-Harness/t/aggregator.t.........................FAILED
    Non-zero exit status: 1
../cpan/Test-Simple/t/circular_data.t.......................FAILED
    Non-zero exit status: 1
../cpan/ExtUtils-MakeMaker/t/INST.t.........................FAILED
    Non-zero exit status: 1
    Bad plan.  You planned 26 tests but ran 25.
../cpan/Test-Simple/t/cmp_ok.t..............................FAILED
    Non-zero exit status: 1
../cpan/Test-Harness/t/bailout.t............................FAILED
    Non-zero exit status: 1
../cpan/Test-Simple/t/subtest/args.t........................FAILED
    Non-zero exit status: 1
../cpan/Test-Simple/t/Tester/tbt_03die.t....................FAILED
    Non-zero exit status: 1
../cpan/Test-Simple/t/subtest/basic.t.......................FAILED
    Non-zero exit status: 1
../cpan/Test-Simple/t/dont_overwrite_die_handler.t..........FAILED
    Non-zero exit status: 1
../cpan/Test-Harness/t/compat/regression.t..................FAILED
    Non-zero exit status: 1
../cpan/Test-Simple/t/Builder/is_fh.t.......................FAILED
    Non-zero exit status: 1
../cpan/Test-Harness/t/base.t...............................FAILED
    Non-zero exit status: 1
../cpan/Test-Simple/t/subtest/die.t.........................FAILED
    Non-zero exit status: 1
../cpan/Test-Simple/t/eq_set.t..............................FAILED
    Non-zero exit status: 1
../cpan/Test-Harness/t/callbacks.t..........................FAILED
    Non-zero exit status: 1
../cpan/Test-Harness/t/compat/switches.t....................FAILED
    Non-zero exit status: 1
../cpan/Test-Harness/t/console.t............................FAILED
    Non-zero exit status: 1
../cpan/Test-Simple/t/subtest/exceptions.t..................FAILED
    Non-zero exit status: 1
../cpan/ExtUtils-MakeMaker/t/INST_PREFIX.t..................FAILED
    Non-zero exit status: 1
    Bad plan.  You planned 52 tests but ran 51.
../cpan/Test-Harness/t/errors.t.............................FAILED
    Non-zero exit status: 1
../cpan/Test-Simple/t/subtest/implicit_done.t...............FAILED
    Non-zero exit status: 1
../cpan/Test-Simple/t/Builder/output.t......................FAILED
    Non-zero exit status: 1
../cpan/Test-Simple/t/Builder/reset.t.......................FAILED
    Non-zero exit status: 1
../cpan/Test-Simple/t/Builder/try.t.........................FAILED
    Non-zero exit status: 1
../cpan/Test-Harness/t/file.t...............................FAILED
    Non-zero exit status: 1
../cpan/Test-Harness/t/compat/test-harness-compat.t.........FAILED
    6-7, 98-99
    Non-zero exit status: 1
../cpan/CPANPLUS/t/19_CPANPLUS-Dist.t.......................FAILED
    Non-zero exit status: 1
../cpan/Test-Harness/t/grammar.t............................FAILED
    Non-zero exit status: 1
../cpan/Test-Harness/t/harness-bailout.t....................FAILED
    Non-zero exit status: 1
../cpan/Time-Local/t/Local.t................................FAILED
    Non-zero exit status: 1
../cpan/Module-Build/t/properties/release_status.t..........FAILED
    Non-zero exit status: 1
../cpan/Test-Harness/t/harness-subclass.t...................FAILED
    Non-zero exit status: 1
../cpan/Time-HiRes/t/alarm.t................................FAILED
    Non-zero exit status: 1
../cpan/ExtUtils-MakeMaker/t/is_of_type.t...................FAILED
    Non-zero exit status: 1
../cpan/autodie/t/autodie.t.................................FAILED
    Non-zero exit status: 1
../cpan/autodie/t/backcompat.t..............................FAILED
    Non-zero exit status: 1
../cpan/autodie/t/basic_exceptions.t........................FAILED
    Non-zero exit status: 1
../cpan/Time-Piece/t/06subclass.t...........................FAILED
    Non-zero exit status: 1
../cpan/ExtUtils-MakeMaker/t/MakeMaker_Parameters.t.........FAILED
    Non-zero exit status: 1
../cpan/autodie/t/binmode.t.................................FAILED
    Non-zero exit status: 1
../cpan/Test-Harness/t/harness.t............................FAILED
    Non-zero exit status: 1
../cpan/autodie/t/blog_hints.t..............................FAILED
    Non-zero exit status: 1
../cpan/Encode/t/encoding.t.................................FAILED
    Non-zero exit status: 1
    No plan found in TAP output
../cpan/autodie/t/caller.t..................................FAILED
    Non-zero exit status: 1
../cpan/Test-Harness/t/iterator_factory.t...................FAILED
    Non-zero exit status: 1
../cpan/autodie/t/context.t.................................FAILED
    Non-zero exit status: 1
../cpan/Encode/t/fallback.t.................................FAILED
    Non-zero exit status: 1
../cpan/autodie/t/context_lexical.t.........................FAILED
    Non-zero exit status: 1
../cpan/autodie/t/crickey.t.................................FAILED
    Non-zero exit status: 1
../cpan/ExtUtils-MakeMaker/t/metafile_data.t................FAILED
    Non-zero exit status: 1
../cpan/autodie/t/dbmopen.t.................................FAILED
    Non-zero exit status: 1
../cpan/parent/t/parent-returns-false.t.....................FAILED
    Non-zero exit status: 1
../cpan/Time-HiRes/t/nanosleep.t............................FAILED
    Non-zero exit status: 1
../cpan/ExtUtils-MakeMaker/t/metafile_file.t................FAILED
    Non-zero exit status: 1
../cpan/Test-Harness/t/iterators.t..........................FAILED
    Non-zero exit status: 1
../cpan/autodie/t/eval_error.t..............................FAILED
    Non-zero exit status: 1
../cpan/parent/t/parent.t...................................FAILED
    Non-zero exit status: 1
../cpan/Time-HiRes/t/sleep.t................................FAILED
    Non-zero exit status: 1
../cpan/Pod-Simple/t/htmlbat.t..............................FAILED
    Non-zero exit status: 1
../cpan/autodie/t/exception_class.t.........................FAILED
    Non-zero exit status: 1
../cpan/autodie/t/exceptions.t..............................FAILED
    Non-zero exit status: 1
../cpan/Test-Simple/t/exit.t................................FAILED
    266
../cpan/autodie/t/exec.t....................................FAILED
    Non-zero exit status: 1
../cpan/Test-Simple/t/explain.t.............................FAILED
    Non-zero exit status: 1
../dist/Attribute-Handlers/t/multi.t........................FAILED
    Non-zero exit status: 1
    Bad plan.  You planned 57 tests but ran 0.
../cpan/autodie/t/Fatal.t...................................FAILED
    Non-zero exit status: 1
../cpan/IO-Compress/t/01misc.t..............................FAILED
    Non-zero exit status: 1
../cpan/autodie/t/fileno.t..................................FAILED
    Non-zero exit status: 1
../cpan/Test-Simple/t/fail-more.t...........................FAILED
    Non-zero exit status: 1
    Bad plan.  You planned 80 tests but ran 78.
../cpan/ExtUtils-MakeMaker/t/min_perl_version.t.............FAILED
    Non-zero exit status: 1
    Bad plan.  You planned 32 tests but ran 30.
../cpan/autodie/t/hints.t...................................FAILED
    Non-zero exit status: 1
../cpan/Test-Simple/t/is_deeply_dne_bug.t...................FAILED
    Non-zero exit status: 1
../cpan/Time-HiRes/t/ualarm.t...............................FAILED
    Non-zero exit status: 1
../cpan/podlators/t/parselink.t.............................FAILED
    Non-zero exit status: 1
../cpan/autodie/t/hints_insist.t............................FAILED
    Non-zero exit status: 1
../cpan/Test-Simple/t/is_deeply_fail.t......................FAILED
    Non-zero exit status: 1
../cpan/Test-Harness/t/object.t.............................FAILED
    Non-zero exit status: 1
../cpan/CPANPLUS/t/20_CPANPLUS-Dist-MM.t....................FAILED
    Non-zero exit status: 1
../cpan/podlators/t/pod.t...................................FAILED
    Non-zero exit status: 1
../cpan/autodie/t/hints_pod_examples.t......................FAILED
    Non-zero exit status: 1
../cpan/Test-Simple/t/More.t................................FAILED
    Non-zero exit status: 1
../cpan/Test-Simple/t/new_ok.t..............................FAILED
    Non-zero exit status: 1
../cpan/autodie/t/hints_provider_does.t.....................FAILED
    Non-zero exit status: 1
../cpan/Time-HiRes/t/usleep.t...............................FAILED
    Non-zero exit status: 1
../cpan/Test-Simple/t/no_plan.t.............................FAILED
    Non-zero exit status: 1
../cpan/JSON-PP/t/106_allow_barekey.t.......................FAILED
    Non-zero exit status: 1
../cpan/Module-Build/t/properties/share_dir.t...............FAILED
    Non-zero exit status: 1
../cpan/autodie/t/hints_provider_easy_does_it.t.............FAILED
    Non-zero exit status: 1
../cpan/JSON-PP/t/107_allow_singlequote.t...................FAILED
    Non-zero exit status: 1
../cpan/Test-Simple/t/overload.t............................FAILED
    Non-zero exit status: 1
../cpan/autodie/t/hints_provider_isa.t......................FAILED
    Non-zero exit status: 1
../dist/Carp/t/Carp.t.......................................FAILED
    Non-zero exit status: 1
../cpan/autodie/t/internal-backcompat.t.....................FAILED
    Non-zero exit status: 1
../cpan/Test-Simple/t/plan.t................................FAILED
    Non-zero exit status: 1
../cpan/CPANPLUS/t/21_CPANPLUS-Dist-No-Build.t..............FAILED
    Non-zero exit status: 1
../dist/Cwd/t/crossplatform.t...............................FAILED
    Non-zero exit status: 1
../cpan/autodie/t/internal.t................................FAILED
    Non-zero exit status: 1
../cpan/Test-Simple/t/plan_bad.t............................FAILED
    Non-zero exit status: 1
../cpan/ExtUtils-MakeMaker/t/Mkbootstrap.t..................FAILED
    Non-zero exit status: 1
../cpan/autodie/t/lethal.t..................................FAILED
    Non-zero exit status: 1
../dist/Carp/t/stash_deletion.t.............................FAILED
    Non-zero exit status: 1
../cpan/JSON-PP/t/112_upgrade.t.............................FAILED
    Non-zero exit status: 1
../cpan/JSON-PP/t/113_overloaded_eq.t.......................FAILED
    Non-zero exit status: 1
../cpan/autodie/t/mkdir.t...................................FAILED
    Non-zero exit status: 1
../cpan/JSON-PP/t/114_decode_prefix.t.......................FAILED
    Non-zero exit status: 1
../dist/Data-Dumper/t/bugs.t................................FAILED
    Non-zero exit status: 1
../cpan/JSON-PP/t/115_tie_ixhash.t..........................FAILED
    Non-zero exit status: 1
../cpan/autodie/t/open.t....................................FAILED
    Non-zero exit status: 1
../cpan/CPANPLUS/t/25_CPANPLUS.t............................FAILED
    Non-zero exit status: 1
../cpan/JSON-PP/t/116_incr_parse_fixed.t....................FAILED
    Non-zero exit status: 1
../dist/Env/t/array.t.......................................FAILED
    Non-zero exit status: 1
../cpan/Test-Harness/t/parse.t..............................FAILED
    Non-zero exit status: 1
../cpan/Test-Simple/t/skipall.t.............................FAILED
    Non-zero exit status: 1
    Bad plan.  You planned 2 tests but ran 0.
../cpan/autodie/t/recv.t....................................FAILED
    Non-zero exit status: 1
../cpan/autodie/t/repeat.t..................................FAILED
    Non-zero exit status: 1
../dist/ExtUtils-CBuilder/t/00-have-compiler.t..............FAILED
    Non-zero exit status: 1
../cpan/Encode/t/gsm0338.t..................................FAILED
    Non-zero exit status: 1
../cpan/autodie/t/scope_leak.t..............................FAILED
    Non-zero exit status: 1
../cpan/Test-Harness/t/parser-subclass.t....................FAILED
    Non-zero exit status: 1
../dist/ExtUtils-Install/t/can_write_dir.t..................FAILED
    Non-zero exit status: 1
../cpan/autodie/t/string-eval-basic.t.......................FAILED
    Non-zero exit status: 1
../cpan/Encode/t/guess.t....................................FAILED
    Non-zero exit status: 1
../dist/ExtUtils-Command/t/eu_command.t.....................FAILED
    Non-zero exit status: 1
../cpan/CPANPLUS/t/30_CPANPLUS-Internals-Selfupdate.t.......FAILED
    Non-zero exit status: 1
../cpan/autodie/t/string-eval-leak.t........................FAILED
    Non-zero exit status: 1
../cpan/Test-Simple/t/todo.t................................FAILED
    Non-zero exit status: 1
../cpan/autodie/t/sysopen.t.................................FAILED
    Non-zero exit status: 1
../dist/ExtUtils-Install/t/Install.t........................FAILED
    Non-zero exit status: 1
    Bad plan.  You planned 52 tests but ran 50.
../cpan/Test-Simple/t/undef.t...............................FAILED
    Non-zero exit status: 1
../dist/ExtUtils-Manifest/t/Manifest.t......................FAILED
    Non-zero exit status: 1
    Bad plan.  You planned 96 tests but ran 92.
../cpan/autodie/t/truncate.t................................FAILED
    Non-zero exit status: 1
../cpan/IO-Compress/t/100generic-bzip2.t....................FAILED
    Non-zero exit status: 1
../dist/ExtUtils-Install/t/Installapi2.t....................FAILED
    15, 17, 22-23
    Non-zero exit status: 1
    Bad plan.  You planned 70 tests but ran 68.
../cpan/autodie/t/unlink.t..................................FAILED
    Non-zero exit status: 1
../cpan/Test-Simple/t/utf8.t................................FAILED
    Non-zero exit status: 1
../cpan/autodie/t/user-context.t............................FAILED
    Non-zero exit status: 1
../dist/File-CheckTree/t/CheckTree.t........................FAILED
    Non-zero exit status: 1
../dist/Data-Dumper/t/freezer.t.............................FAILED
    Non-zero exit status: 1
../cpan/autodie/t/usersub.t.................................FAILED
    Non-zero exit status: 1
../cpan/autodie/t/version.t.................................FAILED
    Non-zero exit status: 1
../dist/ExtUtils-CBuilder/t/04-base.t.......................FAILED
    Non-zero exit status: 1
../cpan/Test-Harness/t/process.t............................FAILED
    Non-zero exit status: 1
../cpan/autodie/t/version_tag.t.............................FAILED
    Non-zero exit status: 1
../cpan/CPANPLUS/t/40_CPANPLUS-Internals-Report.t...........FAILED
    Non-zero exit status: 1
../dist/ExtUtils-Install/t/Installed.t......................FAILED
    Non-zero exit status: 1
../dist/ExtUtils-ParseXS/t/002-more.t.......................FAILED
    Non-zero exit status: 1
../dist/Cwd/t/Spec.t........................................FAILED
    Non-zero exit status: 1
../dist/ExtUtils-ParseXS/t/003-usage.t......................FAILED
    Non-zero exit status: 1
../cpan/Encode/t/Unicode.t..................................FAILED
    Non-zero exit status: 1
../dist/Locale-Maketext/t/20_get.t..........................FAILED
    Non-zero exit status: 1
../dist/Locale-Maketext/t/30_eval_dollar_at.t...............FAILED
    Non-zero exit status: 1
../cpan/Encode/t/utf8strict.t...............................FAILED
    Non-zero exit status: 1
../dist/Locale-Maketext/t/40_super.t........................FAILED
    Non-zero exit status: 1
../dist/Module-CoreList/t/corelist.t........................FAILED
    Non-zero exit status: 1
../cpan/ExtUtils-MakeMaker/t/pm.t...........................FAILED
    Non-zero exit status: 1
    Bad plan.  You planned 6 tests but ran 5.
../dist/Locale-Maketext/t/50_super.t........................FAILED
    Non-zero exit status: 1
../dist/Locale-Maketext/t/60_super.t........................FAILED
    Non-zero exit status: 1
../dist/I18N-LangTags/t/10_http.t...........................FAILED
    Non-zero exit status: 1
../dist/ExtUtils-ParseXS/t/106-process_typemaps.t...........FAILED
    Non-zero exit status: 1
../dist/I18N-LangTags/t/50_super.t..........................FAILED
    Non-zero exit status: 1
../dist/I18N-LangTags/t/55_supers_strict.t..................FAILED
    Non-zero exit status: 1
../dist/ExtUtils-Install/t/Packlist.t.......................FAILED
    Non-zero exit status: 1
../cpan/IO-Compress/t/100generic-deflate.t..................FAILED
    Non-zero exit status: 1
../dist/Safe/t/safe2.t......................................FAILED
    Non-zero exit status: 1
../dist/ExtUtils-ParseXS/t/115-avoid-noise.t................FAILED
    Non-zero exit status: 1
../dist/I18N-LangTags/t/80_all_env.t........................FAILED
    Non-zero exit status: 1
../dist/Module-CoreList/t/find_modules.t....................FAILED
    Non-zero exit status: 1
../dist/Module-CoreList/t/pod.t.............................FAILED
    Non-zero exit status: 1
../dist/Term-ReadLine/t/AE.t................................FAILED
    Non-zero exit status: 1
../dist/Term-ReadLine/t/AETk.t..............................FAILED
    Non-zero exit status: 1
../dist/ExtUtils-ParseXS/t/510-t-bare.t.....................FAILED
    Non-zero exit status: 1
../dist/Storable/t/attach_errors.t..........................FAILED
    Non-zero exit status: 1
../dist/Term-ReadLine/t/Tk.t................................FAILED
    Non-zero exit status: 1
../dist/Storable/t/attach_singleton.t.......................FAILED
    Non-zero exit status: 1
../dist/ExtUtils-ParseXS/t/512-t-file.t.....................FAILED
    Non-zero exit status: 1
../dist/Thread-Semaphore/t/02_errs.t........................FAILED
    Non-zero exit status: 1
../dist/ExtUtils-ParseXS/t/513-t-merge.t....................FAILED
    Non-zero exit status: 1
../dist/Storable/t/blessed.t................................FAILED
    Non-zero exit status: 1
../dist/Storable/t/canonical.t..............................FAILED
    Non-zero exit status: 1
../dist/Storable/t/circular_hook.t..........................FAILED
    Non-zero exit status: 1
../dist/XSLoader/t/XSLoader.t...............................FAILED
    Non-zero exit status: 1
../dist/ExtUtils-ParseXS/t/600-t-compat.t...................FAILED
    Non-zero exit status: 1
../dist/autouse/t/autouse.t.................................FAILED
    Non-zero exit status: 1
../dist/base/t/base.t.......................................FAILED
    Non-zero exit status: 1
../cpan/ExtUtils-MakeMaker/t/pod2man.t......................FAILED
    Non-zero exit status: 1
../dist/base/t/compile-time.t...............................FAILED
    Non-zero exit status: 1
../dist/Storable/t/code.t...................................FAILED
    Non-zero exit status: 1
../dist/Tie-File/t/04_splice.t..............................FAILED
    Non-zero exit status: 1
../cpan/ExtUtils-MakeMaker/t/postamble.t....................FAILED
    Non-zero exit status: 1
    Bad plan.  You planned 8 tests but ran 7.
../dist/Storable/t/croak.t..................................FAILED
    Non-zero exit status: 1
../dist/base/t/fields-base.t................................FAILED
    Non-zero exit status: 1
../dist/base/t/fields.t.....................................FAILED
    Non-zero exit status: 1
../dist/base/t/isa.t........................................FAILED
    Non-zero exit status: 1
../dist/base/t/sigdie.t.....................................FAILED
    Non-zero exit status: 1
../dist/Safe/t/safesort.t...................................FAILED
    Non-zero exit status: 1
../dist/Storable/t/downgrade.t..............................FAILED
    Non-zero exit status: 1
../cpan/ExtUtils-MakeMaker/t/prereq.t.......................FAILED
    Non-zero exit status: 1
    Bad plan.  You planned 16 tests but ran 15.
../dist/Tie-File/t/10_splice_rs.t...........................FAILED
    Non-zero exit status: 1
    No plan found in TAP output
../dist/Safe/t/safewrap.t...................................FAILED
    Non-zero exit status: 1
../dist/if/t/if.t...........................................FAILED
    Non-zero exit status: 1
../dist/constant/t/constant.t...............................FAILED
    Non-zero exit status: 1
../dist/Storable/t/file_magic.t.............................FAILED
    Non-zero exit status: 1
../dist/Storable/t/forgive.t................................FAILED
    Non-zero exit status: 1
../cpan/IO-Compress/t/100generic-gzip.t.....................FAILED
    Non-zero exit status: 1
../cpan/ExtUtils-MakeMaker/t/prereq_print.t.................FAILED
    Non-zero exit status: 1
    Bad plan.  You planned 11 tests but ran 10.
../dist/Storable/t/freeze.t.................................FAILED
    Non-zero exit status: 1
../cpan/ExtUtils-MakeMaker/t/problems.t.....................FAILED
    Non-zero exit status: 1
    Bad plan.  You planned 6 tests but ran 5.
../dist/bignum/t/bn_lite.t..................................FAILED
    Non-zero exit status: 1
../cpan/ExtUtils-MakeMaker/t/prompt.t.......................FAILED
    Non-zero exit status: 1
../dist/bignum/t/br_lite.t..................................FAILED
    Non-zero exit status: 1
../dist/Thread-Queue/t/02_refs.t............................FAILED
    Non-zero exit status: 1
../dist/Math-BigRat/t/bitwise.t.............................FAILED
    Non-zero exit status: 1
../dist/Thread-Queue/t/03_peek.t............................FAILED
    Non-zero exit status: 1
../dist/Thread-Queue/t/04_errs.t............................FAILED
    Non-zero exit status: 1
../dist/threads-shared/t/disabled.t.........................FAILED
    Non-zero exit status: 1
../ext/DynaLoader/t/DynaLoader.t............................FAILED
    Non-zero exit status: 1
../dist/bignum/t/option_l.t.................................FAILED
    Non-zero exit status: 1
../dist/Math-BigRat/t/trap.t................................FAILED
    Non-zero exit status: 1
../ext/Errno/t/Errno.t......................................FAILED
    Non-zero exit status: 1
../dist/Thread-Queue/t/06_insert.t..........................FAILED
    Non-zero exit status: 1
../ext/Fcntl/t/autoload.t...................................FAILED
    Non-zero exit status: 1
../dist/Thread-Queue/t/07_lock.t............................FAILED
    Non-zero exit status: 1
../ext/B/t/b.t..............................................FAILED
    Non-zero exit status: 1
../cpan/Test-Harness/t/prove.t..............................FAILED
    Non-zero exit status: 1
../dist/Thread-Queue/t/08_nothreads.t.......................FAILED
    Non-zero exit status: 1
../ext/File-Glob/t/basic.t..................................FAILED
    Non-zero exit status: 1
../ext/Fcntl/t/mode.t.......................................FAILED
    Non-zero exit status: 1
../cpan/Test-Harness/t/proverc.t............................FAILED
    Non-zero exit status: 1
../ext/File-Glob/t/taint.t..................................FAILED
    Non-zero exit status: 1
../cpan/Test-Harness/t/proverun.t...........................FAILED
    Non-zero exit status: 1
../cpan/Test-Harness/t/proveversion.t.......................FAILED
    Non-zero exit status: 1
../ext/GDBM_File/t/gdbm.t...................................FAILED
    Non-zero exit status: 1
../ext/Hash-Util-FieldHash/t/02_function.t..................FAILED
    Non-zero exit status: 1
../cpan/IO-Compress/t/100generic-rawdeflate.t...............FAILED
    Non-zero exit status: 1
../ext/IPC-Open3/t/IPC-Open2.t..............................FAILED
    Non-zero exit status: 1
../ext/Hash-Util/t/Util.t...................................FAILED
    Non-zero exit status: 1
../ext/NDBM_File/t/ndbm.t...................................FAILED
    Non-zero exit status: 1
../ext/IPC-Open3/t/IPC-Open3.t..............................FAILED
    Non-zero exit status: 1
../ext/POSIX/t/export.t.....................................FAILED
    Non-zero exit status: 1
../ext/ODBM_File/t/odbm.t...................................FAILED
    Non-zero exit status: 1
../ext/Hash-Util-FieldHash/t/11_hashassign.t................FAILED
    Non-zero exit status: 1
../cpan/ExtUtils-MakeMaker/t/several_authors.t..............FAILED
    Non-zero exit status: 1
    Bad plan.  You planned 20 tests but ran 18.
../ext/PerlIO-encoding/t/encoding.t.........................FAILED
    Non-zero exit status: 1
../cpan/ExtUtils-MakeMaker/t/split_command.t................FAILED
    Non-zero exit status: 1
../ext/PerlIO-scalar/t/scalar_ungetc.t......................FAILED
    Non-zero exit status: 1
../dist/Storable/t/malice.t.................................FAILED
    Non-zero exit status: 1
../ext/Pod-Html/t/cache.t...................................FAILED
    Non-zero exit status: 1
../cpan/ExtUtils-MakeMaker/t/VERSION_FROM.t.................FAILED
    Non-zero exit status: 1
../ext/Pod-Functions/t/Functions.t..........................FAILED
    Non-zero exit status: 1
../cpan/ExtUtils-MakeMaker/t/WriteEmptyMakefile.t...........FAILED
    Non-zero exit status: 1
    Bad plan.  You planned 5 tests but ran 4.
../ext/SDBM_File/t/sdbm.t...................................FAILED
    Non-zero exit status: 1
../ext/POSIX/t/sigaction.t..................................FAILED
    Non-zero exit status: 1
../ext/Tie-Hash-NamedCapture/t/tiehash.t....................FAILED
    Non-zero exit status: 1
../cpan/IO-Compress/t/100generic-zip.t......................FAILED
    Non-zero exit status: 1
../ext/Opcode/t/Opcode.t....................................FAILED
    Non-zero exit status: 1
../ext/Opcode/t/ops.t.......................................FAILED
    Non-zero exit status: 1
../dist/Storable/t/restrict.t...............................FAILED
    Non-zero exit status: 1
../ext/XS-APItest/t/arrayexpr.t.............................FAILED
    Non-zero exit status: 1
../dist/Storable/t/store.t..................................FAILED
    Non-zero exit status: 1
../ext/XS-APItest/t/blockhooks.t............................FAILED
    Non-zero exit status: 1
../ext/XS-Typemap/t/Typemap.t...............................FAILED
    Non-zero exit status: 1
../ext/arybase/t/aeach.t....................................FAILED
    Non-zero exit status: 1
../cpan/ExtUtils-MakeMaker/t/writemakefile_args.t...........FAILED
    Non-zero exit status: 1
    Bad plan.  You planned 39 tests but ran 38.
../ext/arybase/t/aelem.t....................................FAILED
    Non-zero exit status: 1
../ext/arybase/t/akeys.t....................................FAILED
    Non-zero exit status: 1
../ext/arybase/t/arybase.t..................................FAILED
    Non-zero exit status: 1
../dist/Storable/t/utf8.t...................................FAILED
    Non-zero exit status: 1
../ext/arybase/t/aslice.t...................................FAILED
    Non-zero exit status: 1
../ext/arybase/t/av2arylen.t................................FAILED
    Non-zero exit status: 1
../ext/arybase/t/lslice.t...................................FAILED
    Non-zero exit status: 1
../ext/arybase/t/pos.t......................................FAILED
    Non-zero exit status: 1
../ext/re/t/re_funcs_u.t....................................FAILED
    Non-zero exit status: 1
    No plan found in TAP output
../ext/re/t/reflags.t.......................................FAILED
    Non-zero exit status: 1
    Bad plan.  You planned 62 tests but ran 0.
../ext/arybase/t/splice.t...................................FAILED
    Non-zero exit status: 1
../lib/Class/Struct.t.......................................FAILED
    Non-zero exit status: 1
../dist/Storable/t/weak.t...................................FAILED
    Non-zero exit status: 1
../cpan/Module-Build/t/compat.t.............................FAILED
    Non-zero exit status: 1
../lib/DBM_Filter/t/01error.t...............................FAILED
    Non-zero exit status: 1
../ext/XS-APItest/t/call_checker.t..........................FAILED
    Non-zero exit status: 1
../lib/DB.t.................................................FAILED
    Non-zero exit status: 1
../lib/English.t............................................FAILED
    Non-zero exit status: 1
../ext/XS-APItest/t/caller.t................................FAILED
    Non-zero exit status: 1
../ext/XS-APItest/t/callregexec.t...........................FAILED
    Non-zero exit status: 1
    Bad plan.  You planned 50 tests but ran 0.
../lib/File/Basename.t......................................FAILED
    Non-zero exit status: 1
../ext/XS-APItest/t/cleanup.t...............................FAILED
    Non-zero exit status: 1
../ext/XS-APItest/t/cophh.t.................................FAILED
    Non-zero exit status: 1
../lib/Internals.t..........................................FAILED
    Non-zero exit status: 1
../lib/DBM_Filter/t/encode.t................................FAILED
    Non-zero exit status: 1
../lib/Pod/t/InputObjects.t.................................FAILED
    Non-zero exit status: 1
../ext/XS-APItest/t/exception.t.............................FAILED
    Non-zero exit status: 1
../ext/POSIX/t/taint.t......................................FAILED
    Non-zero exit status: 1
../lib/Tie/ExtraHash.t......................................FAILED
    Non-zero exit status: 1
../lib/Tie/Hash.t...........................................FAILED
    Non-zero exit status: 1
../lib/Tie/Scalar.t.........................................FAILED
    Non-zero exit status: 1
../lib/Pod/t/Usage.t........................................FAILED
    Non-zero exit status: 1
../cpan/Module-Build/t/destinations.t.......................FAILED
    Non-zero exit status: 1
../lib/blib.t...............................................FAILED
    Non-zero exit status: 1
../lib/File/Copy.t..........................................FAILED
    Non-zero exit status: 1
../lib/File/Find/t/taint.t..................................FAILED
    Non-zero exit status: 1
../lib/filetest.t...........................................FAILED
    Non-zero exit status: 1
../cpan/Module-Build/t/ext.t................................FAILED
    Non-zero exit status: 1
../ext/POSIX/t/termios.t....................................FAILED
    Non-zero exit status: 1
../lib/less.t...............................................FAILED
    Non-zero exit status: 1
../lib/Benchmark.t..........................................FAILED
    Non-zero exit status: 1
../cpan/Module-Build/t/extend.t.............................FAILED
    Non-zero exit status: 1
../ext/POSIX/t/unimplemented.t..............................FAILED
    Non-zero exit status: 1
../lib/open.t...............................................FAILED
    Non-zero exit status: 1
    Bad plan.  You planned 23 tests but ran 22.
../lib/h2xs.t...............................................FAILED
    Non-zero exit status: 1
../ext/POSIX/t/usage.t......................................FAILED
    Non-zero exit status: 1
../dist/Math-BigInt/t/bare_mif.t............................FAILED
    Non-zero exit status: 1
../cpan/Module-Build/t/help.t...............................FAILED
    Non-zero exit status: 1
../ext/POSIX/t/wrappers.t...................................FAILED
    Non-zero exit status: 1
../cpan/Module-Build/t/install.t............................FAILED
    Non-zero exit status: 1
../lib/version/t/01base.t...................................FAILED
    Non-zero exit status: 1
../lib/strict.t.............................................FAILED
    Non-zero exit status: 1
../ext/B/t/terse.t..........................................FAILED
    Non-zero exit status: 1
../ext/B/t/walkoptree.t.....................................FAILED
    Non-zero exit status: 1
../lib/version/t/02derived.t................................FAILED
    Non-zero exit status: 1
../cpan/Module-Build/t/manifypods.t.........................FAILED
    Non-zero exit status: 1
../lib/version/t/03require.t................................FAILED
    Non-zero exit status: 1
../lib/version/t/06noop.t...................................FAILED
    Non-zero exit status: 1
../cpan/Test-Harness/t/regression.t.........................FAILED
    2935-2950, 2955-2956, 6616-6617
    Non-zero exit status: 1
../cpan/Test-Harness/t/results.t............................FAILED
    Non-zero exit status: 1
../cpan/Test-Harness/t/scheduler.t..........................FAILED
    Non-zero exit status: 1
../cpan/Test-Harness/t/source.t.............................FAILED
    Non-zero exit status: 1
../cpan/Test-Harness/t/source_handler.t.....................FAILED
    Non-zero exit status: 1
../cpan/Test-Harness/t/spool.t..............................FAILED
    Non-zero exit status: 1
../cpan/Test-Harness/t/state.t..............................FAILED
    Non-zero exit status: 1
../cpan/Test-Harness/t/state_results.t......................FAILED
    Non-zero exit status: 1
../cpan/Test-Harness/t/testargs.t...........................FAILED
    Non-zero exit status: 1
../cpan/Test-Harness/t/utils.t..............................FAILED
    Non-zero exit status: 1
../cpan/Test-Harness/t/yamlish-output.t.....................FAILED
    Non-zero exit status: 1
../cpan/Test-Harness/t/yamlish-writer.t.....................FAILED
    Non-zero exit status: 1
../lib/File/stat.t..........................................FAILED
    Non-zero exit status: 1
../cpan/Test-Harness/t/yamlish.t............................FAILED
    Non-zero exit status: 1
../cpan/Module-Build/t/metadata.t...........................FAILED
    Non-zero exit status: 1
../cpan/Module-Build/t/metadata2.t..........................FAILED
    Non-zero exit status: 1
../cpan/Module-Build/t/mymeta.t.............................FAILED
    Non-zero exit status: 1
../cpan/Module-Build/t/notes.t..............................FAILED
    Non-zero exit status: 1
../dist/Math-BigInt/t/mbimbf.t..............................FAILED
    Non-zero exit status: 1
../dist/Math-BigInt/t/req_mbf0.t............................FAILED
    Non-zero exit status: 1
../dist/Math-BigInt/t/req_mbf1.t............................FAILED
    Non-zero exit status: 1
../dist/Math-BigInt/t/req_mbfa.t............................FAILED
    Non-zero exit status: 1
../dist/Math-BigInt/t/req_mbfi.t............................FAILED
    Non-zero exit status: 1
../cpan/Module-Build/t/PL_files.t...........................FAILED
    Non-zero exit status: 1
../dist/Math-BigInt/t/req_mbfn.t............................FAILED
    Non-zero exit status: 1
../cpan/Module-Build/t/pod_parser.t.........................FAILED
    Non-zero exit status: 1
../dist/Math-BigInt/t/req_mbfw.t............................FAILED
    Non-zero exit status: 1
../cpan/Module-Build/t/ppm.t................................FAILED
    Non-zero exit status: 1
../lib/Unicode/UCD.t........................................FAILED
    Non-zero exit status: 1
../cpan/Module-Build/t/runthrough.t.........................FAILED
    Non-zero exit status: 1
../cpan/Module-Build/t/script_dist.t........................FAILED
    Non-zero exit status: 1
../cpan/IO-Compress/t/102tied-bzip2.t.......................FAILED
    Non-zero exit status: 1
../dist/Math-BigInt/t/sub_mif.t.............................FAILED
    Non-zero exit status: 1
../cpan/IO-Compress/t/102tied-deflate.t.....................FAILED
    Non-zero exit status: 1
../dist/Math-BigInt/t/trap.t................................FAILED
    Non-zero exit status: 1
../cpan/IO-Compress/t/102tied-gzip.t........................FAILED
    Non-zero exit status: 1
../cpan/IO-Compress/t/102tied-rawdeflate.t..................FAILED
    Non-zero exit status: 1
../cpan/IO-Compress/t/102tied-zip.t.........................FAILED
    Non-zero exit status: 1
../cpan/IO-Compress/t/103newtied-bzip2.t....................FAILED
    Non-zero exit status: 1
../cpan/IO-Compress/t/103newtied-deflate.t..................FAILED
    Non-zero exit status: 1
../cpan/IO-Compress/t/103newtied-gzip.t.....................FAILED
    Non-zero exit status: 1
../cpan/IO-Compress/t/103newtied-rawdeflate.t...............FAILED
    Non-zero exit status: 1
../cpan/IO-Compress/t/103newtied-zip.t......................FAILED
    Non-zero exit status: 1
../lib/charnames.t..........................................FAILED
    Non-zero exit status: 1
    No plan found in TAP output
../cpan/IO-Compress/t/105oneshot-bzip2.t....................FAILED
    Non-zero exit status: 1
../cpan/IO-Compress/t/105oneshot-deflate.t..................FAILED
    Non-zero exit status: 1
../cpan/IO-Compress/t/105oneshot-gzip.t.....................FAILED
    Non-zero exit status: 1
../ext/XS-APItest/t/hash.t..................................FAILED
    Non-zero exit status: 1
../cpan/IO-Compress/t/105oneshot-rawdeflate.t...............FAILED
    Non-zero exit status: 1
../ext/XS-APItest/t/newCONSTSUB.t...........................FAILED
    Non-zero exit status: 1
    Bad plan.  You planned 22 tests but ran 0.
../ext/XS-APItest/t/overload.t..............................FAILED
    Non-zero exit status: 1
../ext/XS-APItest/t/peep.t..................................FAILED
    Non-zero exit status: 1
../ext/XS-APItest/t/pmflag.t................................FAILED
    Non-zero exit status: 1
../ext/XS-APItest/t/push.t..................................FAILED
    Non-zero exit status: 1
../ext/XS-APItest/t/svpv.t..................................FAILED
    Non-zero exit status: 1
../ext/XS-APItest/t/swaplabel.t.............................FAILED
    Non-zero exit status: 1
../ext/XS-APItest/t/swaptwostmts.t..........................FAILED
    Non-zero exit status: 1
../ext/XS-APItest/t/utf16_to_utf8.t.........................FAILED
    Non-zero exit status: 1
../cpan/Module-Build/t/xs.t.................................FAILED
    Non-zero exit status: 1
../ext/XS-APItest/t/xsub_h.t................................FAILED
    Non-zero exit status: 1
../cpan/IO-Compress/t/105oneshot-zip.t......................FAILED
    Non-zero exit status: 1
../cpan/IO-Compress/t/109merge-deflate.t....................FAILED
    Non-zero exit status: 1
../cpan/IO-Compress/t/109merge-gzip.t.......................FAILED
    Non-zero exit status: 1
../cpan/IO-Compress/t/109merge-rawdeflate.t.................FAILED
    Non-zero exit status: 1
../cpan/IO-Compress/t/110encode-bzip2.t.....................FAILED
    Non-zero exit status: 1
../cpan/IO-Compress/t/110encode-deflate.t...................FAILED
    Non-zero exit status: 1
../cpan/IO-Compress/t/110encode-gzip.t......................FAILED
    Non-zero exit status: 1
../cpan/IO-Compress/t/110encode-rawdeflate.t................FAILED
    Non-zero exit status: 1
../cpan/IO-Compress/t/110encode-zip.t.......................FAILED
    Non-zero exit status: 1
../cpan/IO-Compress/t/999pod.t..............................FAILED
    Non-zero exit status: 1
../cpan/IO-Compress/t/cz-03zlib-v1.t........................FAILED
    Non-zero exit status: 1
../cpan/IO-Compress/t/cz-06gzsetp.t.........................FAILED
    Non-zero exit status: 1
../cpan/IO-Compress/t/cz-08encoding.t.......................FAILED
    Non-zero exit status: 1
../cpan/IO-Compress/t/cz-14gzopen.t.........................FAILED
    Non-zero exit status: 1
../cpan/IO-Compress/t/globmapper.t..........................FAILED
    Non-zero exit status: 1
../lib/perl5db.t............................................FAILED
    49-52

[minitest] -Duseithreads
    t/comp/hints ................... FAILED--no leader found
    t/comp/proto ................... FAILED--no leader found
    t/run/fresh_perl ............... FAILED at test 23
    t/re/charset ................... FAILED--no leader found
    t/re/pat ....................... FAILED--no leader found
    t/re/regexp .................... FAILED--expected 1719 tests, saw 165
    t/re/regexp_noamp .............. FAILED--expected 1719 tests, saw 165
    t/re/regexp_notrie ............. FAILED--expected 1719 tests, saw 165
    t/re/regexp_qr ................. FAILED--expected 1719 tests, saw 165
    t/re/regexp_qr_embed ........... FAILED--expected 1719 tests, saw 165
    t/re/regexp_trielist ........... FAILED--expected 1719 tests, saw 165
    t/re/subst ..................... FAILED--no leader found
    t/re/substT .................... FAILED--no leader found
    t/re/subst_wamp ................ FAILED--no leader found
    t/op/die ....................... FAILED--no leader found
    t/op/readline .................. FAILED--non-zero wait status: 256
    t/op/ref ....................... FAILED--expected 230 tests, saw 229
    t/op/split ..................... FAILED--no leader found
    t/op/utftaint .................. FAILED at test 87
    t/uni/opcroak .................. FAILED--no leader found
    t/uni/parser ................... FAILED--no leader found

[default] -DDEBUGGING -Duseithreads
../t/comp/hints.t...........................................FAILED
    Non-zero exit status: 1
    No plan found in TAP output
../t/comp/proto.t...........................................FAILED
    Non-zero exit status: 1
    No plan found in TAP output
../t/re/pat_advanced.t......................................FAILED
    Non-zero exit status: 1
    No plan found in TAP output
../t/re/pat_advanced_thr.t..................................FAILED
    Non-zero exit status: 1
    No plan found in TAP output
../t/re/pat.t...............................................FAILED
    Non-zero exit status: 1
    No plan found in TAP output
../t/re/pat_re_eval.t.......................................FAILED
    Non-zero exit status: 1
    No plan found in TAP output
../t/re/pat_rt_report.t.....................................FAILED
    Non-zero exit status: 1
    No plan found in TAP output
../t/re/pat_re_eval_thr.t...................................FAILED
    Non-zero exit status: 1
    No plan found in TAP output
../t/re/pat_rt_report_thr.t.................................FAILED
    Non-zero exit status: 1
    No plan found in TAP output
../t/re/pat_thr.t...........................................FAILED
    Non-zero exit status: 1
    No plan found in TAP output
../t/re/charset.t...........................................FAILED
    Non-zero exit status: 1
    No plan found in TAP output
../t/re/regexp_noamp.t......................................FAILED
    Non-zero exit status: 1
    Bad plan.  You planned 1719 tests but ran 165.
../t/re/regexp.t............................................FAILED
    Non-zero exit status: 1
    Bad plan.  You planned 1719 tests but ran 165.
../t/re/regexp_notrie.t.....................................FAILED
    Non-zero exit status: 1
    Bad plan.  You planned 1719 tests but ran 165.
../t/re/regexp_qr.t.........................................FAILED
    Non-zero exit status: 1
    Bad plan.  You planned 1719 tests but ran 165.
../t/re/regexp_qr_embed.t...................................FAILED
    Non-zero exit status: 1
    Bad plan.  You planned 1719 tests but ran 165.
../t/re/recompile.t.........................................FAILED
    13-20
../t/re/subst.t.............................................FAILED
    Non-zero exit status: 1
    No plan found in TAP output
../t/re/regexp_trielist.t...................................FAILED
    Non-zero exit status: 1
    Bad plan.  You planned 1719 tests but ran 165.
../t/re/subst_wamp.t........................................FAILED
    Non-zero exit status: 1
    No plan found in TAP output
../t/re/substT.t............................................FAILED
    Non-zero exit status: 1
    No plan found in TAP output
../t/re/reg_fold.t..........................................FAILED
    Non-zero exit status: 1
    Bad plan.  You planned 5295 tests but ran 193.
../t/re/fold_grind.t........................................FAILED
    Non-zero exit status: 1
    No plan found in TAP output
../t/op/die.t...............................................FAILED
    Non-zero exit status: 1
    No plan found in TAP output
../t/re/regexp_qr_embed_thr.t...............................FAILED
    Non-zero exit status: 1
    Bad plan.  You planned 1719 tests but ran 165.
../t/op/split.t.............................................FAILED
    Non-zero exit status: 1
    No plan found in TAP output
../t/op/utftaint.t..........................................FAILED
    87-88
../t/uni/opcroak.t..........................................FAILED
    Non-zero exit status: 1
    No plan found in TAP output
../t/uni/latin2.t...........................................FAILED
    Non-zero exit status: 1
    Bad plan.  You planned 94 tests but ran 75.
../t/uni/parser.t...........................................FAILED
    Non-zero exit status: 1
    No plan found in TAP output
../cpan/Test-Simple/t/fail-more.t...........................??????
../dist/ExtUtils-Install/t/Install.t........................FAILED
    15
    Non-zero exit status: 1
../ext/re/t/re_funcs_u.t....................................FAILED
    Non-zero exit status: 1
    No plan found in TAP output
../ext/re/t/reflags.t.......................................FAILED
    Non-zero exit status: 1
    Bad plan.  You planned 62 tests but ran 0.
../ext/XS-APItest/t/callregexec.t...........................FAILED
    Non-zero exit status: 1
    Bad plan.  You planned 50 tests but ran 0.
../ext/XS-APItest/t/newCONSTSUB.t...........................FAILED
    Non-zero exit status: 1
    Bad plan.  You planned 22 tests but ran 0.
../lib/perl5db.t............................................FAILED
    49-52

Compiler messages(gcc):
./inline.h:121:1: warning: unused function 'S_croak_memory_wrap' [-Wunused-function]
dump.c:460:57: warning: comparison of constant 85 with expression of type 'svtype' is always false [-Wtautological-constant-out-of-range-compare]
scope.c:695:13: warning: format specifies type 'long' but the argument has type 'I32' (aka 'int') [-Wformat]
scope.c:695:19: warning: format specifies type 'long' but the argument has type 'I32' (aka 'int') [-Wformat]
./inline.h:121:1: warning: 'static' function 'S_croak_memory_wrap' declared in header file should be declared 'static inline' [-Wunneeded-internal-declaration]
perlio.c:5181:21: warning: comparison of integers of different signs: 'size_t' (aka 'unsigned long') and 'int' [-Wsign-compare]
regexec.c:4922:24: warning: comparison of integers of different signs: 'long' and 'PADOFFSET' (aka 'unsigned long') [-Wsign-compare]
Call.xs:63:11: warning: format specifies type 'int' but the argument has type 'STRLEN' (aka 'unsigned long') [-Wformat]
Call.xs:63:31: warning: format specifies type 'int' but the argument has type 'STRLEN' (aka 'unsigned long') [-Wformat]
Call.xs:100:13: warning: format specifies type 'int' but the argument has type 'STRLEN' (aka 'unsigned long') [-Wformat]
Call.xs:156:11: warning: format specifies type 'int' but the argument has type 'STRLEN' (aka 'unsigned long') [-Wformat]
Call.xs:175:14: warning: format specifies type 'int' but the argument has type 'STRLEN' (aka 'unsigned long') [-Wformat]
./const-c.inc:47:2: warning: expression result unused [-Wunused-value]
./const-c.inc:81:5: warning: expression result unused [-Wunused-value]
scalar.xs:48:5: warning: expression result unused [-Wunused-value]
Glob.xs:101:2: warning: expression result unused [-Wunused-value]
Glob.xs:109:6: warning: expression result unused [-Wunused-value]
Storable.xs:4068:2: warning: null passed to a callee which requires a non-null argument [-Wnonnull]
Storable.xs:4255:10: warning: null passed to a callee which requires a non-null argument [-Wnonnull]
Storable.xs:4505:2: warning: expression result unused [-Wunused-value]
Storable.xs:5550:2: warning: null passed to a callee which requires a non-null argument [-Wnonnull]
Storable.xs:5613:2: warning: null passed to a callee which requires a non-null argument [-Wnonnull]
./const-c.inc:38:2: warning: expression result unused [-Wunused-value]
./const-c.inc:72:5: warning: expression result unused [-Wunused-value]
Storable.xs:6124:5: warning: expression result unused [-Wunused-value]
Bzip2.xs:326:5: warning: expression result unused [-Wunused-value]
./const-c.inc:73:5: warning: expression result unused [-Wunused-value]
B.xs:1945:14: warning: comparison of unsigned expression >= 0 is always true [-Wtautological-compare]
Socket.xs:919:16: warning: more '%' conversions than data arguments [-Wformat]
Socket.xs:925:16: warning: more '%' conversions than data arguments [-Wformat]
Zlib.xs:620:5: warning: expression result unused [-Wunused-value]
Typemap.xs:179:74: warning: format specifies type 'unsigned int' but the argument has type 'UV' (aka 'unsigned long') [-Wformat]
Collate.xs:616:2: warning: expression result unused [-Wunused-value]
Collate.xs:606:2: warning: expression result unused [-Wunused-value]
ExtTest.xs:44:2: warning: expression result unused [-Wunused-value]
ExtTest.xs:78:5: warning: expression result unused [-Wunused-value]
-- 
Report by Test::Smoke v1.44 build 1285 running on perl 5.14.2
(Reporter v0.035 / Smoker v0.045)




nntp.perl.org: Perl Programming lists via nntp and http.
Comments to Ask Bjørn Hansen at ask@perl.org | Group listing | About