develooper Front page | perl.perl5.porters | Postings from October 2012

Smoke [maint-5.12] v5.12.4-50-gb8a9a95 FAIL(XF) linux 3.2.0-31-generic [debian] (x86_64/8 cpu)

From:
George Greer
Date:
October 28, 2012 20:01
Subject:
Smoke [maint-5.12] v5.12.4-50-gb8a9a95 FAIL(XF) linux 3.2.0-31-generic [debian] (x86_64/8 cpu)
Message ID:
201210290301.q9T31kOh028002@m-l.org
Smoke logs available at http://m-l.org/~perl/smoke/perl/

Automated smoke report for 5.12.5 patch b8a9a95d2109537dcf687ed03b351544c75c39da v5.12.4-50-gb8a9a95
zwei: Intel(R) Core(TM) i7 CPU 920 @ 2.67GHz (GenuineIntel 2668MHz) (x86_64/8 cpu)
    on        linux - 3.2.0-31-generic [debian]
    using     clang version 4.2.1 Compatible Ubuntu Clang 3.0 (tags/RELEASE_30/final)
    smoketime 9 hours 2 minutes (average 45 minutes 12 seconds)

Summary: FAIL(XF)

O = OK  F = Failure(s), extended report at the bottom
X = Failure(s) under TEST but not under harness
? = still running or test results not (yet) available
Build failures during:       - = unknown or N/A
c = Configure, m = make, M = make (after miniperl), t = make test-prep

v5.12.4-50-gb8a9a95  Configuration (common) -Dcc=clang
----------- ---------------------------------------------------------
X X F X X X F X 
X X F X X X F X -Duse64bitall
X X F X X X F X -Dusemorebits
X X F X X X F X -Duseithreads
X X F X X X F X -Duseithreads -Duse64bitall
X X F X X X F X -Duseithreads -Dusemorebits
| | | | | +- LC_ALL = en_US.utf8 -DDEBUGGING
| | | | +--- PERLIO = perlio -DDEBUGGING
| | | +----- PERLIO = stdio  -DDEBUGGING
| | +------- LC_ALL = en_US.utf8
| +--------- PERLIO = perlio
+----------- PERLIO = stdio 

Locally applied patches:
    uncommitted-changes
    SMOKEb8a9a95d2109537dcf687ed03b351544c75c39da

Failures: (common-args) -Dcc=clang
[stdio/perlio/en_US.utf8] 
[stdio/perlio/en_US.utf8] -DDEBUGGING
[stdio/perlio/en_US.utf8] -Duse64bitall
[stdio/perlio/en_US.utf8] -DDEBUGGING -Duse64bitall
[stdio/perlio/en_US.utf8] -Dusemorebits
[stdio/perlio/en_US.utf8] -DDEBUGGING -Dusemorebits
[stdio/perlio/en_US.utf8] -Duseithreads
[stdio/perlio/en_US.utf8] -DDEBUGGING -Duseithreads
[stdio/perlio/en_US.utf8] -Duseithreads -Duse64bitall
[stdio/perlio/en_US.utf8] -DDEBUGGING -Duseithreads -Duse64bitall
[stdio/perlio/en_US.utf8] -Duseithreads -Dusemorebits
[stdio/perlio/en_US.utf8] -DDEBUGGING -Duseithreads -Dusemorebits
Inconsistent test results (between TEST and harness):
    ../t/cpan/Memoize/t/errors.t............FAILED--expected 11 tests, saw 6
    ../lib/DBM_Filter/t/01error.t...........FAILED--expected 21 tests, saw 3
    ../ext/ODBM_File/t/odbm.t...............FAILED--no leader found

[minitest] 
[minitest] -DDEBUGGING
[minitest] -Duse64bitall
[minitest] -DDEBUGGING -Duse64bitall
[minitest] -Dusemorebits
[minitest] -DDEBUGGING -Dusemorebits
[minitest] -Duseithreads
[minitest] -DDEBUGGING -Duseithreads
[minitest] -Duseithreads -Duse64bitall
[minitest] -DDEBUGGING -Duseithreads -Duse64bitall
[minitest] -Duseithreads -Dusemorebits
[minitest] -DDEBUGGING -Duseithreads -Dusemorebits
    t/op/filehandle.................FAILED--no leader found
    t/op/groups.....................FAILED--no leader found

Compiler messages(gcc):
try.c:5785:17: warning: extra tokens at end of #ifdef directive [-Wextra-tokens]
try.c:5788:18: warning: extra tokens at end of #ifdef directive [-Wextra-tokens]
try.c:5791:19: warning: extra tokens at end of #ifdef directive [-Wextra-tokens]
try.c:5794:19: warning: extra tokens at end of #ifdef directive [-Wextra-tokens]
try.c:5821:17: warning: extra tokens at end of #ifdef directive [-Wextra-tokens]
try.c:5824:18: warning: extra tokens at end of #ifdef directive [-Wextra-tokens]
try.c:5827:19: warning: extra tokens at end of #ifdef directive [-Wextra-tokens]
try.c:5830:19: warning: extra tokens at end of #ifdef directive [-Wextra-tokens]
try.c:5857:17: warning: extra tokens at end of #ifdef directive [-Wextra-tokens]
try.c:5860:18: warning: extra tokens at end of #ifdef directive [-Wextra-tokens]
try.c:5863:19: warning: extra tokens at end of #ifdef directive [-Wextra-tokens]
try.c:5866:19: warning: extra tokens at end of #ifdef directive [-Wextra-tokens]
try.c:5893:16: warning: extra tokens at end of #ifdef directive [-Wextra-tokens]
try.c:5896:17: warning: extra tokens at end of #ifdef directive [-Wextra-tokens]
try.c:5899:18: warning: extra tokens at end of #ifdef directive [-Wextra-tokens]
try.c:5902:18: warning: extra tokens at end of #ifdef directive [-Wextra-tokens]
try.c:5929:18: warning: extra tokens at end of #ifdef directive [-Wextra-tokens]
try.c:5932:19: warning: extra tokens at end of #ifdef directive [-Wextra-tokens]
try.c:5935:20: warning: extra tokens at end of #ifdef directive [-Wextra-tokens]
try.c:5938:20: warning: extra tokens at end of #ifdef directive [-Wextra-tokens]
try.c:6817:18: warning: extra tokens at end of #ifdef directive [-Wextra-tokens]
try.c:6820:19: warning: extra tokens at end of #ifdef directive [-Wextra-tokens]
try.c:6823:20: warning: extra tokens at end of #ifdef directive [-Wextra-tokens]
try.c:6826:20: warning: extra tokens at end of #ifdef directive [-Wextra-tokens]
try.c:6853:18: warning: extra tokens at end of #ifdef directive [-Wextra-tokens]
try.c:6856:19: warning: extra tokens at end of #ifdef directive [-Wextra-tokens]
try.c:6859:20: warning: extra tokens at end of #ifdef directive [-Wextra-tokens]
try.c:6862:20: warning: extra tokens at end of #ifdef directive [-Wextra-tokens]
try.c:6889:18: warning: extra tokens at end of #ifdef directive [-Wextra-tokens]
try.c:6892:19: warning: extra tokens at end of #ifdef directive [-Wextra-tokens]
try.c:6895:20: warning: extra tokens at end of #ifdef directive [-Wextra-tokens]
try.c:6898:20: warning: extra tokens at end of #ifdef directive [-Wextra-tokens]
try.c:6925:17: warning: extra tokens at end of #ifdef directive [-Wextra-tokens]
try.c:6928:18: warning: extra tokens at end of #ifdef directive [-Wextra-tokens]
try.c:6931:19: warning: extra tokens at end of #ifdef directive [-Wextra-tokens]
try.c:6934:19: warning: extra tokens at end of #ifdef directive [-Wextra-tokens]
try.c:6961:19: warning: extra tokens at end of #ifdef directive [-Wextra-tokens]
try.c:6964:20: warning: extra tokens at end of #ifdef directive [-Wextra-tokens]
try.c:6967:21: warning: extra tokens at end of #ifdef directive [-Wextra-tokens]
try.c:6970:21: warning: extra tokens at end of #ifdef directive [-Wextra-tokens]
toke.c:2113:3: warning: expression result unused [-Wunused-value]
toke.c:3734:5: warning: expression result unused [-Wunused-value]
toke.c:7191:7: warning: expression result unused [-Wunused-value]
regcomp.c:9431:11: warning: expression result unused [-Wunused-value]
util.c:530:5: warning: expression result unused [-Wunused-value]
util.c:2346:5: warning: expression result unused [-Wunused-value]
util.c:2513:5: warning: expression result unused [-Wunused-value]
mro.c:532:2: warning: expression result unused [-Wunused-value]
pp_hot.c:141:3: warning: expression result unused [-Wunused-value]
pp_hot.c:1195:5: warning: expression result unused [-Wunused-value]
pp_hot.c:1625:2: warning: expression result unused [-Wunused-value]
pp_hot.c:2291:6: warning: expression result unused [-Wunused-value]
sv.c:2786:3: warning: expression result unused [-Wunused-value]
sv.c:3625:6: warning: expression result unused [-Wunused-value]
sv.c:3950:6: warning: expression result unused [-Wunused-value]
sv.c:3952:6: warning: expression result unused [-Wunused-value]
sv.c:4337:5: warning: expression result unused [-Wunused-value]
sv.c:4387:5: warning: expression result unused [-Wunused-value]
sv.c:4442:5: warning: expression result unused [-Wunused-value]
sv.c:4959:5: warning: expression result unused [-Wunused-value]
sv.c:7002:5: warning: expression result unused [-Wunused-value]
sv.c:8473:6: warning: expression result unused [-Wunused-value]
sv.c:8843:5: warning: expression result unused [-Wunused-value]
pp.c:3495:5: warning: expression result unused [-Wunused-value]
pp.c:3875:2: warning: expression result unused [-Wunused-value]
pp.c:4013:2: warning: expression result unused [-Wunused-value]
pp.c:4279:2: warning: expression result unused [-Wunused-value]
pp.c:4459:2: warning: expression result unused [-Wunused-value]
pp_ctl.c:270:14: warning: expression result unused [-Wunused-value]
pp_ctl.c:353:2: warning: expression result unused [-Wunused-value]
pp_ctl.c:365:8: warning: expression result unused [-Wunused-value]
pp_ctl.c:934:3: warning: expression result unused [-Wunused-value]
pp_ctl.c:2012:3: warning: expression result unused [-Wunused-value]
pp_ctl.c:2027:6: warning: expression result unused [-Wunused-value]
pp_ctl.c:4057:23: warning: expression result unused [-Wunused-value]
pp_ctl.c:4991:5: warning: expression result unused [-Wunused-value]
pp_sys.c:426:2: warning: expression result unused [-Wunused-value]
pp_sys.c:463:2: warning: expression result unused [-Wunused-value]
pp_sys.c:1697:2: warning: expression result unused [-Wunused-value]
doop.c:696:3: warning: expression result unused [-Wunused-value]
doop.c:691:5: warning: expression result unused [-Wunused-value]
doio.c:633:17: warning: expression result unused [-Wunused-value]
doio.c:637:17: warning: expression result unused [-Wunused-value]
regexec.c:3904:19: warning: expression result unused [-Wunused-value]
regexec.c:5134:3: warning: expression result unused [-Wunused-value]
perlio.c:5345:21: warning: comparison of integers of different signs: 'size_t' (aka 'unsigned long') and 'int' [-Wsign-compare]
op.c:7082:5: warning: expression result unused [-Wunused-value]
op.c:8610:4: warning: expression result unused [-Wunused-value]
perl.c:365:6: warning: expression result unused [-Wunused-value]
Bzip2.xs:326:5: warning: expression result unused [-Wunused-value]
Zlib.xs:593:5: warning: expression result unused [-Wunused-value]
Dumper.xs:646:4: warning: expression result unused [-Wunused-value]
Dumper.xs:813:37: warning: conversion specifies type 'long' but the argument has type 'U32' (aka 'unsigned int') [-Wformat]
Unicode.xs:166:6: warning: expression result unused [-Wunused-value]
Unicode.xs:320:6: warning: expression result unused [-Wunused-value]
./const-c.inc:33:2: warning: expression result unused [-Wunused-value]
./const-c.inc:67:5: warning: expression result unused [-Wunused-value]
Call.xs:62:58: warning: conversion specifies type 'int' but the argument has type 'STRLEN' (aka 'unsigned long') [-Wformat]
Call.xs:62:78: warning: conversion specifies type 'int' but the argument has type 'STRLEN' (aka 'unsigned long') [-Wformat]
Call.xs:99:53: warning: conversion specifies type 'int' but the argument has type 'STRLEN' (aka 'unsigned long') [-Wformat]
Call.xs:155:46: warning: conversion specifies type 'int' but the argument has type 'STRLEN' (aka 'unsigned long') [-Wformat]
Call.xs:174:57: warning: conversion specifies type 'int' but the argument has type 'STRLEN' (aka 'unsigned long') [-Wformat]
Util.xs:40:17: warning: expression result unused [-Wunused-value]
Util.xs:43:17: warning: expression result unused [-Wunused-value]
Util.xs:103:9: warning: expression result unused [-Wunused-value]
FieldHash.xs:128:20: warning: using the result of an assignment as a condition without parentheses [-Wparentheses]
FieldHash.xs:131:13: warning: expression result unused [-Wunused-value]
FieldHash.xs:136:9: warning: expression result unused [-Wunused-value]
FieldHash.xs:157:5: warning: expression result unused [-Wunused-value]
FieldHash.xs:165:13: warning: using the result of an assignment as a condition without parentheses [-Wparentheses]
FieldHash.xs:193:5: warning: expression result unused [-Wunused-value]
FieldHash.xs:216:26: warning: using the result of an assignment as a condition without parentheses [-Wparentheses]
FieldHash.xs:285:16: warning: using the result of an assignment as a condition without parentheses [-Wparentheses]
FieldHash.xs:293:17: warning: using the result of an assignment as a condition without parentheses [-Wparentheses]
FieldHash.xs:294:13: warning: expression result unused [-Wunused-value]
FieldHash.xs:291:9: warning: expression result unused [-Wunused-value]
FieldHash.xs:310:15: warning: using the result of an assignment as a condition without parentheses [-Wparentheses]
FieldHash.xs:331:9: warning: expression result unused [-Wunused-value]
FieldHash.xs:438:24: warning: using the result of an assignment as a condition without parentheses [-Wparentheses]
IO.xs:229:6: warning: expression result unused [-Wunused-value]
No such file or directoryOpcode.xs:55:2: warning: expression result unused [-Wunused-value]
Opcode.xs:273:9: warning: expression result unused [-Wunused-value]
Opcode.xs:274:9: warning: expression result unused [-Wunused-value]
POSIX.xs:1121:3: warning: expression result unused [-Wunused-value]
POSIX.xs:1124:3: warning: expression result unused [-Wunused-value]
POSIX.xs:1128:3: warning: expression result unused [-Wunused-value]
POSIX.xs:1132:3: warning: expression result unused [-Wunused-value]
POSIX.xs:1135:3: warning: expression result unused [-Wunused-value]
POSIX.xs:1138:3: warning: expression result unused [-Wunused-value]
POSIX.xs:1142:3: warning: expression result unused [-Wunused-value]
POSIX.xs:1147:3: warning: expression result unused [-Wunused-value]
POSIX.xs:1151:3: warning: expression result unused [-Wunused-value]
POSIX.xs:1154:3: warning: expression result unused [-Wunused-value]
POSIX.xs:1158:3: warning: expression result unused [-Wunused-value]
POSIX.xs:1161:3: warning: expression result unused [-Wunused-value]
POSIX.xs:1164:3: warning: expression result unused [-Wunused-value]
POSIX.xs:1167:3: warning: expression result unused [-Wunused-value]
POSIX.xs:1170:3: warning: expression result unused [-Wunused-value]
POSIX.xs:1173:3: warning: expression result unused [-Wunused-value]
POSIX.xs:1176:3: warning: expression result unused [-Wunused-value]
POSIX.xs:1179:3: warning: expression result unused [-Wunused-value]
scalar.xs:47:5: warning: expression result unused [-Wunused-value]
via.xs:96:7: warning: expression result unused [-Wunused-value]
Socket.xs:266:51: warning: conversion specifies type 'int' but the argument has type 'STRLEN' (aka 'unsigned long') [-Wformat]
Socket.xs:266:65: warning: conversion specifies type 'int' but the argument has type 'unsigned long' [-Wformat]
Socket.xs:291:47: warning: conversion specifies type 'int' but the argument has type 'STRLEN' (aka 'unsigned long') [-Wformat]
Socket.xs:291:70: warning: conversion specifies type 'int' but the argument has type 'unsigned long' [-Wformat]
Socket.xs:421:51: warning: conversion specifies type 'int' but the argument has type 'STRLEN' (aka 'unsigned long') [-Wformat]
Socket.xs:421:65: warning: conversion specifies type 'int' but the argument has type 'unsigned long' [-Wformat]
Socket.xs:442:47: warning: conversion specifies type 'int' but the argument has type 'STRLEN' (aka 'unsigned long') [-Wformat]
Socket.xs:442:61: warning: conversion specifies type 'int' but the argument has type 'unsigned long' [-Wformat]
Storable.xs:1840:3: warning: expression result unused [-Wunused-value]
Storable.xs:4140:2: warning: null passed to a callee which requires a non-null argument [-Wnonnull]
Storable.xs:4571:2: warning: expression result unused [-Wunused-value]
Storable.xs:5448:3: warning: expression result unused [-Wunused-value]
Storable.xs:5493:2: warning: expression result unused [-Wunused-value]
Storable.xs:5532:2: warning: null passed to a callee which requires a non-null argument [-Wnonnull]
Storable.xs:5594:2: warning: null passed to a callee which requires a non-null argument [-Wnonnull]
Storable.xs:5905:4: warning: expression result unused [-Wunused-value]
Storable.xs:5946:3: warning: expression result unused [-Wunused-value]
Storable.xs:6105:5: warning: expression result unused [-Wunused-value]
HiRes.xs:768:5: warning: expression result unused [-Wunused-value]
HiRes.xs:769:5: warning: expression result unused [-Wunused-value]
Normalize.xs:383:19: warning: '&&' within '||' [-Wlogical-op-parentheses]
Normalize.xs:384:15: warning: '&&' within '||' [-Wlogical-op-parentheses]
APItest.xs:81:5: warning: expression result unused [-Wunused-value]
APItest.xs:82:5: warning: expression result unused [-Wunused-value]
APItest.xs:95:5: warning: expression result unused [-Wunused-value]
APItest.xs:531:2: warning: expression result unused [-Wunused-value]
APItest.xs:823:2: warning: expression result unused [-Wunused-value]
APItest.xs:930:2: warning: 'Perl_pmflag' is deprecated [-Wdeprecated-declarations]
KeywordRPN.xs:207:3: warning: expression result unused [-Wunused-value]
Typemap.xs:87:3: warning: expression result unused [-Wunused-value]
mro.xs:117:7: warning: expression result unused [-Wunused-value]
re_exec.c:3904:19: warning: expression result unused [-Wunused-value]
re_exec.c:5134:3: warning: expression result unused [-Wunused-value]
ExtTest.xs:39:2: warning: expression result unused [-Wunused-value]
ExtTest.xs:73:5: warning: expression result unused [-Wunused-value]
pp_sys.c:4537:17: warning: conversion specifies type 'double' but the argument has type 'Time64_T' (aka 'long double') [-Wformat]
pp_sys.c:4542:17: warning: conversion specifies type 'double' but the argument has type 'Time64_T' (aka 'long double') [-Wformat]
regexec.c:2446:2: warning: expression result unused [-Wunused-value]
re_exec.c:2446:2: warning: expression result unused [-Wunused-value]
shared.xs:980:9: warning: expression result unused [-Wunused-value]
-- 
Report by Test::Smoke v1.44 build 1285 running on perl 5.14.2
(Reporter v0.035 / Smoker v0.045)




nntp.perl.org: Perl Programming lists via nntp and http.
Comments to Ask Bjørn Hansen at ask@perl.org | Group listing | About