develooper Front page | perl.perl5.porters | Postings from September 2012

Smoke [maint-5.12] v5.12.4-44-g5d0bf9b FAIL(m) linux 3.2.0-31-generic [debian] (x86_64/8 cpu)

From:
George Greer
Date:
September 27, 2012 20:05
Subject:
Smoke [maint-5.12] v5.12.4-44-g5d0bf9b FAIL(m) linux 3.2.0-31-generic [debian] (x86_64/8 cpu)
Message ID:
201209280304.q8S34na6029789@m-l.org
Smoke logs available at http://m-l.org/~perl/smoke/perl/

Automated smoke report for 5.12.4 patch 5d0bf9bf756267f88b6aa86cad17f702df3028e8 v5.12.4-44-g5d0bf9b
zwei: Intel(R) Core(TM) i7 CPU 920 @ 2.67GHz (GenuineIntel 1867MHz) (x86_64/8 cpu)
    on        linux - 3.2.0-31-generic [debian]
    using     g++ version 4.6.3
    smoketime 22 minutes 27 seconds (average 1 minute 52.250 seconds)

Summary: FAIL(m)

O = OK  F = Failure(s), extended report at the bottom
X = Failure(s) under TEST but not under harness
? = still running or test results not (yet) available
Build failures during:       - = unknown or N/A
c = Configure, m = make, M = make (after miniperl), t = make test-prep

v5.12.4-44-g5d0bf9b  Configuration (common) -Dcc=g++
----------- ---------------------------------------------------------
m - - m - - 
m - - m - - -Duse64bitall
m - - m - - -Dusemorebits
m - - m - - -Duseithreads
m - - m - - -Duseithreads -Duse64bitall
m - - m - - -Duseithreads -Dusemorebits
| | | +----- PERLIO = perlio -DDEBUGGING
| | +------- PERLIO = stdio  -DDEBUGGING
| +--------- PERLIO = perlio
+----------- PERLIO = stdio


Locally applied patches:
    uncommitted-changes
    SMOKE5d0bf9bf756267f88b6aa86cad17f702df3028e8

Compiler messages(gcc):
try.c: In function ‘int main()’:
try.c:36:10: warning: ignoring return value of ‘int pipe(int*)’, declared with attribute warn_unused_result [-Wunused-result]
try.c:37:10: warning: ignoring return value of ‘int pipe(int*)’, declared with attribute warn_unused_result [-Wunused-result]
try.c:53:35: warning: ignoring return value of ‘ssize_t write(int, const void*, size_t)’, declared with attribute warn_unused_result [-Wunused-result]
try.c:66:23: warning: ignoring return value of ‘ssize_t write(int, const void*, size_t)’, declared with attribute warn_unused_result [-Wunused-result]
try.c:72:35: warning: ignoring return value of ‘ssize_t write(int, const void*, size_t)’, declared with attribute warn_unused_result [-Wunused-result]
try.c:78:21: warning: ignoring return value of ‘ssize_t read(int, void*, size_t)’, declared with attribute warn_unused_result [-Wunused-result]
try.c:5785:17: warning: extra tokens at end of #ifdef directive [enabled by default]
try.c:5788:18: warning: extra tokens at end of #ifdef directive [enabled by default]
try.c:5791:19: warning: extra tokens at end of #ifdef directive [enabled by default]
try.c:5794:19: warning: extra tokens at end of #ifdef directive [enabled by default]
try.c:5821:17: warning: extra tokens at end of #ifdef directive [enabled by default]
try.c:5824:18: warning: extra tokens at end of #ifdef directive [enabled by default]
try.c:5827:19: warning: extra tokens at end of #ifdef directive [enabled by default]
try.c:5830:19: warning: extra tokens at end of #ifdef directive [enabled by default]
try.c:5857:17: warning: extra tokens at end of #ifdef directive [enabled by default]
try.c:5860:18: warning: extra tokens at end of #ifdef directive [enabled by default]
try.c:5863:19: warning: extra tokens at end of #ifdef directive [enabled by default]
try.c:5866:19: warning: extra tokens at end of #ifdef directive [enabled by default]
try.c:5893:16: warning: extra tokens at end of #ifdef directive [enabled by default]
try.c:5896:17: warning: extra tokens at end of #ifdef directive [enabled by default]
try.c:5899:18: warning: extra tokens at end of #ifdef directive [enabled by default]
try.c:5902:18: warning: extra tokens at end of #ifdef directive [enabled by default]
try.c:5929:18: warning: extra tokens at end of #ifdef directive [enabled by default]
try.c:5932:19: warning: extra tokens at end of #ifdef directive [enabled by default]
try.c:5935:20: warning: extra tokens at end of #ifdef directive [enabled by default]
try.c:5938:20: warning: extra tokens at end of #ifdef directive [enabled by default]
try.c:6817:18: warning: extra tokens at end of #ifdef directive [enabled by default]
try.c:6820:19: warning: extra tokens at end of #ifdef directive [enabled by default]
try.c:6823:20: warning: extra tokens at end of #ifdef directive [enabled by default]
try.c:6826:20: warning: extra tokens at end of #ifdef directive [enabled by default]
try.c:6853:18: warning: extra tokens at end of #ifdef directive [enabled by default]
try.c:6856:19: warning: extra tokens at end of #ifdef directive [enabled by default]
try.c:6859:20: warning: extra tokens at end of #ifdef directive [enabled by default]
try.c:6862:20: warning: extra tokens at end of #ifdef directive [enabled by default]
try.c:6889:18: warning: extra tokens at end of #ifdef directive [enabled by default]
try.c:6892:19: warning: extra tokens at end of #ifdef directive [enabled by default]
try.c:6895:20: warning: extra tokens at end of #ifdef directive [enabled by default]
try.c:6898:20: warning: extra tokens at end of #ifdef directive [enabled by default]
try.c:6925:17: warning: extra tokens at end of #ifdef directive [enabled by default]
try.c:6928:18: warning: extra tokens at end of #ifdef directive [enabled by default]
try.c:6931:19: warning: extra tokens at end of #ifdef directive [enabled by default]
try.c:6934:19: warning: extra tokens at end of #ifdef directive [enabled by default]
try.c:6961:19: warning: extra tokens at end of #ifdef directive [enabled by default]
try.c:6964:20: warning: extra tokens at end of #ifdef directive [enabled by default]
try.c:6967:21: warning: extra tokens at end of #ifdef directive [enabled by default]
try.c:6970:21: warning: extra tokens at end of #ifdef directive [enabled by default]
regcomp.c: In function ‘regnode* S_regpiece(RExC_state_t*, I32*, U32)’:
regcomp.c:6404:11: warning: variable ‘parse_start’ set but not used [-Wunused-but-set-variable]
util.c: In function ‘void* Perl_safesyscalloc(size_t, size_t)’:
util.c:273:14: warning: variable ‘total_size’ set but not used [-Wunused-but-set-variable]
util.c: In function ‘void Perl_fbm_compile(SV*, U32)’:
util.c:543:2: error: invalid conversion from ‘void*’ to ‘char*’ [-fpermissive]
proto.h:2049:21: error:   initializing argument 1 of ‘void* Perl_my_memset(char*, I32, I32)’ [-fpermissive]
util.c: In function ‘char* Perl_savepv(const char*)’:
util.c:939:16: error: void value not ignored as it ought to be
util.c: In function ‘char* Perl_savepvn(const char*, I32)’:
util.c:967:22: error: void value not ignored as it ought to be
util.c: In function ‘char* Perl_savesharedpv(const char*)’:
util.c:995:19: error: void value not ignored as it ought to be
util.c: In function ‘char* Perl_savesharedpvn(const char*, STRLEN)’:
util.c:1018:19: error: void value not ignored as it ought to be
util.c: In function ‘char* Perl_savesvpv(SV*)’:
util.c:1041:21: error: void value not ignored as it ought to be
util.c: In function ‘void Perl_init_tm(tm*)’:
util.c:3715:20: error: cannot convert ‘int*’ to ‘time_t* {aka long int*}’ for argument ‘1’ to ‘time_t time(time_t*)’
util.c:3716:27: error: cannot convert ‘int*’ to ‘const time_t* {aka const long int*}’ for argument ‘1’ to ‘tm* localtime(const time_t*)’
util.c: In function ‘U32 Perl_seed()’:
util.c:5508:21: error: cannot convert ‘int*’ to ‘time_t* {aka long int*}’ for argument ‘1’ to ‘time_t time(time_t*)’
util.c:1042:1: warning: control reaches end of non-void function [-Wreturn-type]
util.c:1019:1: warning: control reaches end of non-void function [-Wreturn-type]
util.c: In function ‘char* S_write_no_mem()’:
util.c:68:34: warning: ignoring return value of ‘ssize_t write(int, const void*, size_t)’, declared with attribute warn_unused_result [-Wunused-result]
util.c:996:1: warning: control reaches end of non-void function [-Wreturn-type]
util.c:972:1: warning: control reaches end of non-void function [-Wreturn-type]
util.c:941:1: warning: control reaches end of non-void function [-Wreturn-type]
regcomp.c: In function ‘void S_dump_trie(const _reg_trie_data*, HV*, AV*, U32)’:
regcomp.c:881:5: warning: variable ‘re_debug_flags’ set but not used [-Wunused-but-set-variable]
regcomp.c: In function ‘void S_dump_trie_interim_list(const _reg_trie_data*, HV*, AV*, U32, U32)’:
regcomp.c:965:5: warning: variable ‘re_debug_flags’ set but not used [-Wunused-but-set-variable]
regcomp.c: In function ‘void S_dump_trie_interim_table(const _reg_trie_data*, HV*, AV*, U32, U32)’:
regcomp.c:1023:5: warning: variable ‘re_debug_flags’ set but not used [-Wunused-but-set-variable]
regcomp.c: In function ‘REGEXP* Perl_re_compile(SV*, U32)’:
regcomp.c:4920:5: warning: variable ‘re_debug_flags’ set but not used [-Wunused-but-set-variable]
regcomp.c: In function ‘SV* Perl_reg_named_buff_nextkey(REGEXP*, U32)’:
regcomp.c:5069:5: warning: variable ‘re_debug_flags’ set but not used [-Wunused-but-set-variable]
regcomp.c: In function ‘void Perl_pregfree2(REGEXP*)’:
regcomp.c:9377:5: warning: variable ‘re_debug_flags’ set but not used [-Wunused-but-set-variable]
regcomp.c: In function ‘regnode* S_regpiece(PerlInterpreter*, RExC_state_t*, I32*, U32)’:
regcomp.c: In function ‘void* Perl_regdupe_internal(PerlInterpreter*, REGEXP*, CLONE_PARAMS*)’:
regcomp.c:9723:14: warning: variable ‘npar’ set but not used [-Wunused-but-set-variable]
util.c: In function ‘void Perl_fbm_compile(PerlInterpreter*, SV*, U32)’:
util.c: In function ‘char* Perl_savepv(PerlInterpreter*, const char*)’:
util.c: In function ‘char* Perl_savepvn(PerlInterpreter*, const char*, I32)’:
util.c: In function ‘char* Perl_savesharedpv(PerlInterpreter*, const char*)’:
util.c: In function ‘char* Perl_savesharedpvn(PerlInterpreter*, const char*, STRLEN)’:
util.c: In function ‘char* Perl_savesvpv(PerlInterpreter*, SV*)’:
util.c: In function ‘void Perl_init_tm(PerlInterpreter*, tm*)’:
util.c: In function ‘U32 Perl_seed(PerlInterpreter*)’:
util.c: In function ‘char* S_write_no_mem(PerlInterpreter*)’:
regcomp.c: In function ‘void S_dump_trie(PerlInterpreter*, const _reg_trie_data*, HV*, AV*, U32)’:
regcomp.c: In function ‘void S_dump_trie_interim_list(PerlInterpreter*, const _reg_trie_data*, HV*, AV*, U32, U32)’:
regcomp.c: In function ‘void S_dump_trie_interim_table(PerlInterpreter*, const _reg_trie_data*, HV*, AV*, U32, U32)’:
regcomp.c: In function ‘REGEXP* Perl_re_compile(PerlInterpreter*, SV*, U32)’:
regcomp.c: In function ‘SV* Perl_reg_named_buff_nextkey(PerlInterpreter*, REGEXP*, U32)’:
regcomp.c: In function ‘void Perl_pregfree2(PerlInterpreter*, REGEXP*)’:
util.c:318:6: error: invalid conversion from ‘void*’ to ‘char*’ [-fpermissive]
-- 
Report by Test::Smoke v1.44 build 1285 running on perl 5.14.2
(Reporter v0.035 / Smoker v0.045)




nntp.perl.org: Perl Programming lists via nntp and http.
Comments to Ask Bjørn Hansen at ask@perl.org | Group listing | About