develooper Front page | perl.perl5.porters | Postings from September 2012

Smoke [blead] v5.17.3-468-g45f11e9 FAIL(F) linux 3.2.0-30-generic [debian] (x86_64/8 cpu)

Thread Previous
From:
George Greer
Date:
September 17, 2012 17:50
Subject:
Smoke [blead] v5.17.3-468-g45f11e9 FAIL(F) linux 3.2.0-30-generic [debian] (x86_64/8 cpu)
Message ID:
201209180050.q8I0oQVA023086@m-l.org
Smoke logs available at http://m-l.org/~perl/smoke/perl/

Automated smoke report for 5.17.4 patch 45f11e9ca40e7c288751ad2b4f3922e3fd05c0f7 v5.17.3-468-g45f11e9
zwei: Intel(R) Core(TM) i7 CPU 920 @ 2.67GHz (GenuineIntel 2668MHz) (x86_64/8 cpu)
    on        linux - 3.2.0-30-generic [debian]
    using     g++ version 4.6.3
    smoketime 46 minutes 9 seconds (average 11 minutes 32 seconds)

Summary: FAIL(F)

O = OK  F = Failure(s), extended report at the bottom
X = Failure(s) under TEST but not under harness
? = still running or test results not (yet) available
Build failures during:       - = unknown or N/A
c = Configure, m = make, M = make (after miniperl), t = make test-prep

v5.17.3-468-g45f11e9  Configuration (common) -Accflags=-DPERL_POISON -Dcc=g++
----------- ---------------------------------------------------------
O O O O     
F O F O     -Duseithreads
| +--------- -DDEBUGGING
+----------- no debugging


Locally applied patches:
    uncommitted-changes
    SMOKE45f11e9ca40e7c288751ad2b4f3922e3fd05c0f7

Testsuite was run only with 'harness'

Failures: (common-args) -Accflags=-DPERL_POISON -Dcc=g++
[default] -Duseithreads
../t/re/pat_special_cc_thr.t................................??????
../t/re/pat_re_eval_thr.t...................................??????
../t/re/pat_thr.t...........................................??????
../t/re/pat_advanced_thr.t..................................??????
../t/re/reg_email_thr.t.....................................??????
../t/re/regexp_qr_embed_thr.t...............................FAILED
    Bad plan.  You planned 1711 tests but ran 9.
../t/re/pat_rt_report_thr.t.................................??????
../t/re/regexp_unicode_prop_thr.t...........................??????
../t/op/getpid.t............................................FAILED
    Bad plan.  You planned 3 tests but ran 1.
../t/op/index_thr.t.........................................??????
../t/re/pat_psycho_thr.t....................................??????
../t/op/reset.t.............................................FAILED
    21-24
../t/op/threads-dirh.t......................................FAILED
    1
    Bad plan.  You planned 6 tests but ran 1.
../t/op/substr_thr.t........................................??????
../t/op/threads.t...........................................FAILED
    1-3
    Bad plan.  You planned 26 tests but ran 3.
../cpan/Digest-MD5/t/threads.t..............................FAILED
    Bad plan.  You planned 2 tests but ran 0.
../cpan/Tie-RefHash/t/threaded.t............................FAILED
    Bad plan.  You planned 14 tests but ran 11.
../cpan/Test-Simple/t/threads.t.............................FAILED
    Bad plan.  You planned 6 tests but ran 1.
../dist/Thread-Semaphore/t/01_basic.t.......................FAILED
    Bad plan.  You planned 10 tests but ran 8.
../dist/Thread-Semaphore/t/04_nonblocking.t.................FAILED
    Bad plan.  You planned 12 tests but ran 11.
../dist/Thread-Semaphore/t/05_force.t.......................FAILED
    Bad plan.  You planned 8 tests but ran 6.
../dist/threads/t/basic.t...................................FAILED
    Bad plan.  You planned 34 tests but ran 3.
../dist/threads-shared/t/av_refs.t..........................FAILED
    Bad plan.  You planned 14 tests but ran 3.
../dist/threads/t/blocks.t..................................FAILED
    Bad plan.  You planned 5 tests but ran 0.
../dist/threads-shared/t/av_simple.t........................FAILED
    Bad plan.  You planned 44 tests but ran 9.
../dist/threads/t/context.t.................................FAILED
    Bad plan.  You planned 31 tests but ran 2.
../dist/threads-shared/t/blessed.t..........................FAILED
    Bad plan.  You planned 37 tests but ran 13.
../dist/threads/t/end.t.....................................FAILED
    Bad plan.  You planned 6 tests but ran 2.
../dist/threads-shared/t/clone.t............................FAILED
    Bad plan.  You planned 40 tests but ran 4.
../dist/threads-shared/t/cond.t.............................FAILED
    Bad plan.  You planned 32 tests but ran 4.
../dist/threads-shared/t/hv_refs.t..........................FAILED
    Bad plan.  You planned 20 tests but ran 3.
../dist/threads-shared/t/hv_simple.t........................FAILED
    Bad plan.  You planned 16 tests but ran 2.
../dist/threads/t/err.t.....................................FAILED
    Bad plan.  You planned 10 tests but ran 7.
../dist/threads-shared/t/no_share.t.........................FAILED
    Bad plan.  You planned 6 tests but ran 4.
../dist/threads/t/exit.t....................................FAILED
    Bad plan.  You planned 18 tests but ran 2.
../dist/threads-shared/t/object.t...........................FAILED
    Bad plan.  You planned 28 tests but ran 9.
../dist/threads-shared/t/object2.t..........................FAILED
    Bad plan.  You planned 122 tests but ran 121.
../dist/threads-shared/t/shared_attr.t......................FAILED
    Bad plan.  You planned 101 tests but ran 2.
../dist/threads-shared/t/stress.t...........................FAILED
    Bad plan.  You planned 1 tests but ran 0.
../dist/threads-shared/t/sv_refs.t..........................FAILED
    Bad plan.  You planned 21 tests but ran 6.
../dist/threads-shared/t/sv_simple.t........................FAILED
    Bad plan.  You planned 11 tests but ran 5.
../dist/Thread-Queue/t/01_basic.t...........................FAILED
    Bad plan.  You planned 81 tests but ran 31.
../dist/threads-shared/t/wait.t.............................FAILED
    Bad plan.  You planned 91 tests but ran 10.
../dist/threads/t/free.t....................................FAILED
    Bad plan.  You planned 29 tests but ran 1.
../dist/Thread-Queue/t/02_refs.t............................FAILED
    Bad plan.  You planned 46 tests but ran 37.
../dist/threads-shared/t/waithires.t........................FAILED
    Bad plan.  You planned 63 tests but ran 6.
../dist/Thread-Queue/t/03_peek.t............................FAILED
    Bad plan.  You planned 19 tests but ran 13.
../dist/threads/t/free2.t...................................FAILED
    Bad plan.  You planned 78 tests but ran 1.
../dist/threads/t/join.t....................................FAILED
    Bad plan.  You planned 20 tests but ran 1.
../dist/threads/t/kill.t....................................FAILED
    No plan found in TAP output
../dist/Thread-Queue/t/05_extract.t.........................FAILED
    Bad plan.  You planned 20 tests but ran 7.
../dist/threads/t/kill2.t...................................FAILED
    No plan found in TAP output
../dist/Thread-Queue/t/06_insert.t..........................FAILED
    Bad plan.  You planned 16 tests but ran 1.
../dist/Thread-Queue/t/07_lock.t............................FAILED
    Bad plan.  You planned 3 tests but ran 2.
../ext/Hash-Util-FieldHash/t/03_class.t.....................FAILED
    Bad plan.  You planned 7 tests but ran 2.
../ext/Hash-Util-FieldHash/t/04_thread.t....................FAILED
    Bad plan.  You planned 30 tests but ran 6.
../dist/Storable/t/threads.t................................FAILED
    Bad plan.  You planned 2 tests but ran 1.
../dist/threads/t/libc.t....................................FAILED
    Bad plan.  You planned 11 tests but ran 1.
../dist/threads/t/list.t....................................FAILED
    Bad plan.  You planned 15 tests but ran 2.
../dist/threads/t/problems.t................................FAILED
    Bad plan.  You planned 15 tests but ran 3.
../dist/threads/t/stack.t...................................FAILED
    Bad plan.  You planned 18 tests but ran 9.
../ext/PerlIO-scalar/t/scalar.t.............................FAILED
    Bad plan.  You planned 82 tests but ran 79.
../dist/threads/t/state.t...................................FAILED
    Bad plan.  You planned 59 tests but ran 13.
../dist/threads/t/stress_cv.t...............................FAILED
    Bad plan.  You planned 61 tests but ran 31.
../dist/threads/t/stress_re.t...............................FAILED
    Bad plan.  You planned 61 tests but ran 31.
../dist/threads/t/stress_string.t...........................FAILED
    Bad plan.  You planned 61 tests but ran 31.
../dist/threads/t/thread.t..................................FAILED
    Bad plan.  You planned 35 tests but ran 2.
../lib/Thread.t.............................................FAILED
    Bad plan.  You planned 13 tests but ran 5.
../ext/XS-APItest/t/my_cxt.t................................FAILED
    Bad plan.  You planned 16 tests but ran 13.

[default] -DDEBUGGING -Duseithreads
../t/re/pat_special_cc_thr.t................................??????
../t/re/pat_re_eval_thr.t...................................??????
../t/re/pat_thr.t...........................................??????
../t/re/pat_advanced_thr.t..................................??????
../t/re/reg_email_thr.t.....................................??????
../t/re/regexp_qr_embed_thr.t...............................FAILED
    Bad plan.  You planned 1711 tests but ran 9.
../t/re/pat_rt_report_thr.t.................................??????
../t/re/regexp_unicode_prop_thr.t...........................??????
../t/op/getpid.t............................................FAILED
    Bad plan.  You planned 3 tests but ran 1.
../t/re/pat_psycho_thr.t....................................??????
../t/op/index_thr.t.........................................??????
../t/op/reset.t.............................................FAILED
    21-24
../t/op/threads-dirh.t......................................FAILED
    1
    Bad plan.  You planned 6 tests but ran 1.
../t/op/substr_thr.t........................................??????
../t/op/threads.t...........................................FAILED
    1-3
    Bad plan.  You planned 26 tests but ran 3.
../cpan/Digest-MD5/t/threads.t..............................FAILED
    Bad plan.  You planned 2 tests but ran 0.
../cpan/Tie-RefHash/t/threaded.t............................FAILED
    Bad plan.  You planned 14 tests but ran 11.
../cpan/Test-Simple/t/threads.t.............................FAILED
    Bad plan.  You planned 6 tests but ran 1.
../dist/Thread-Semaphore/t/01_basic.t.......................FAILED
    Bad plan.  You planned 10 tests but ran 8.
../dist/Thread-Semaphore/t/04_nonblocking.t.................FAILED
    Bad plan.  You planned 12 tests but ran 11.
../dist/Thread-Semaphore/t/05_force.t.......................FAILED
    Bad plan.  You planned 8 tests but ran 6.
../dist/threads/t/basic.t...................................FAILED
    Bad plan.  You planned 34 tests but ran 3.
../dist/threads-shared/t/av_refs.t..........................FAILED
    Bad plan.  You planned 14 tests but ran 3.
../dist/threads/t/blocks.t..................................FAILED
    Bad plan.  You planned 5 tests but ran 0.
../dist/threads-shared/t/av_simple.t........................FAILED
    Bad plan.  You planned 44 tests but ran 9.
../dist/threads/t/context.t.................................FAILED
    Bad plan.  You planned 31 tests but ran 2.
../dist/threads-shared/t/blessed.t..........................FAILED
    Bad plan.  You planned 37 tests but ran 13.
../dist/threads/t/end.t.....................................FAILED
    Bad plan.  You planned 6 tests but ran 2.
../dist/threads-shared/t/clone.t............................FAILED
    Bad plan.  You planned 40 tests but ran 4.
../dist/threads-shared/t/cond.t.............................FAILED
    Bad plan.  You planned 32 tests but ran 4.
../dist/threads-shared/t/hv_refs.t..........................FAILED
    Bad plan.  You planned 20 tests but ran 3.
../dist/threads/t/err.t.....................................FAILED
    Bad plan.  You planned 10 tests but ran 7.
../dist/threads-shared/t/hv_simple.t........................FAILED
    Bad plan.  You planned 16 tests but ran 2.
../dist/threads-shared/t/no_share.t.........................FAILED
    Bad plan.  You planned 6 tests but ran 4.
../dist/threads/t/exit.t....................................FAILED
    Bad plan.  You planned 18 tests but ran 2.
../dist/threads-shared/t/object.t...........................FAILED
    Bad plan.  You planned 28 tests but ran 9.
../dist/threads-shared/t/object2.t..........................FAILED
    Bad plan.  You planned 122 tests but ran 121.
../dist/threads-shared/t/shared_attr.t......................FAILED
    Bad plan.  You planned 101 tests but ran 2.
../dist/Thread-Queue/t/01_basic.t...........................FAILED
    Bad plan.  You planned 81 tests but ran 30.
../dist/Thread-Queue/t/02_refs.t............................FAILED
    Bad plan.  You planned 46 tests but ran 37.
../dist/threads-shared/t/stress.t...........................FAILED
    Bad plan.  You planned 1 tests but ran 0.
../dist/Thread-Queue/t/03_peek.t............................FAILED
    Bad plan.  You planned 19 tests but ran 13.
../dist/threads-shared/t/sv_refs.t..........................FAILED
    Bad plan.  You planned 21 tests but ran 6.
../dist/threads/t/free.t....................................FAILED
    Bad plan.  You planned 29 tests but ran 1.
../dist/threads-shared/t/sv_simple.t........................FAILED
    Bad plan.  You planned 11 tests but ran 5.
../dist/Thread-Queue/t/05_extract.t.........................FAILED
    Bad plan.  You planned 20 tests but ran 7.
../dist/threads/t/free2.t...................................FAILED
    Bad plan.  You planned 78 tests but ran 1.
../dist/threads-shared/t/wait.t.............................FAILED
    Bad plan.  You planned 91 tests but ran 10.
../dist/threads/t/join.t....................................FAILED
    Bad plan.  You planned 20 tests but ran 1.
../dist/Thread-Queue/t/06_insert.t..........................FAILED
    Bad plan.  You planned 16 tests but ran 1.
../dist/threads-shared/t/waithires.t........................FAILED
    Bad plan.  You planned 63 tests but ran 6.
../dist/threads/t/kill.t....................................FAILED
    No plan found in TAP output
../dist/Thread-Queue/t/07_lock.t............................FAILED
    Bad plan.  You planned 3 tests but ran 2.
../dist/threads/t/kill2.t...................................FAILED
    No plan found in TAP output
../dist/threads/t/libc.t....................................FAILED
    Bad plan.  You planned 11 tests but ran 1.
../dist/threads/t/list.t....................................FAILED
    Bad plan.  You planned 15 tests but ran 2.
../dist/threads/t/problems.t................................FAILED
    Bad plan.  You planned 15 tests but ran 3.
../dist/threads/t/stack.t...................................FAILED
    Bad plan.  You planned 18 tests but ran 9.
../dist/threads/t/state.t...................................FAILED
    Bad plan.  You planned 59 tests but ran 13.
../ext/Hash-Util-FieldHash/t/03_class.t.....................FAILED
    Bad plan.  You planned 7 tests but ran 2.
../dist/threads/t/stress_cv.t...............................FAILED
    Bad plan.  You planned 61 tests but ran 31.
../ext/Hash-Util-FieldHash/t/04_thread.t....................FAILED
    Bad plan.  You planned 30 tests but ran 6.
../dist/threads/t/stress_re.t...............................FAILED
    Bad plan.  You planned 61 tests but ran 31.
../dist/threads/t/stress_string.t...........................FAILED
    Bad plan.  You planned 61 tests but ran 31.
../ext/PerlIO-scalar/t/scalar.t.............................FAILED
    Bad plan.  You planned 82 tests but ran 79.
../dist/threads/t/thread.t..................................FAILED
    Bad plan.  You planned 35 tests but ran 2.
../dist/Storable/t/threads.t................................FAILED
    Bad plan.  You planned 2 tests but ran 1.
../lib/Thread.t.............................................FAILED
    Bad plan.  You planned 13 tests but ran 5.
../ext/XS-APItest/t/my_cxt.t................................FAILED
    Bad plan.  You planned 16 tests but ran 13.

Passed Todo tests: (common-args) -Accflags=-DPERL_POISON -Dcc=g++
[default] 
[default] -DDEBUGGING
[default] -Duseithreads
[default] -DDEBUGGING -Duseithreads
../cpan/CGI/t/tmpdir.t......................................PASSED
    3-9

Compiler messages(gcc):
try.c: In function ‘int main()’:
try.c:36:10: warning: ignoring return value of ‘int pipe(int*)’, declared with attribute warn_unused_result [-Wunused-result]
try.c:37:10: warning: ignoring return value of ‘int pipe(int*)’, declared with attribute warn_unused_result [-Wunused-result]
try.c:53:35: warning: ignoring return value of ‘ssize_t write(int, const void*, size_t)’, declared with attribute warn_unused_result [-Wunused-result]
try.c:66:23: warning: ignoring return value of ‘ssize_t write(int, const void*, size_t)’, declared with attribute warn_unused_result [-Wunused-result]
try.c:72:35: warning: ignoring return value of ‘ssize_t write(int, const void*, size_t)’, declared with attribute warn_unused_result [-Wunused-result]
try.c:78:21: warning: ignoring return value of ‘ssize_t read(int, void*, size_t)’, declared with attribute warn_unused_result [-Wunused-result]
gv.c: In function ‘GV* Perl_gv_fetchmeth_pvn(HV*, const char*, STRLEN, I32, U32)’:
gv.c:642:12: warning: variable ‘packlen’ set but not used [-Wunused-but-set-variable]
util.c: In function ‘char* S_write_no_mem()’:
util.c:68:34: warning: ignoring return value of ‘ssize_t write(int, const void*, size_t)’, declared with attribute warn_unused_result [-Wunused-result]
sv.c: In function ‘void Perl_sv_vcatpvfn_flags(SV*, const char*, STRLEN, __va_list_tag (*)[1], SV**, I32, bool*, U32)’:
sv.c:10077:41: warning: ignoring return value of ‘char* gcvt(double, int, char*)’, declared with attribute warn_unused_result [-Wunused-result]
sv.c:10926:53: warning: ignoring return value of ‘char* gcvt(double, int, char*)’, declared with attribute warn_unused_result [-Wunused-result]
sv.c: In function ‘char* Perl_sv_2pv_flags(SV*, STRLEN*, I32)’:
sv.c:2899:39: warning: ignoring return value of ‘char* gcvt(double, int, char*)’, declared with attribute warn_unused_result [-Wunused-result]
doio.c: In function ‘void S_exec_failed(const char*, int, int)’:
doio.c:1379:43: warning: ignoring return value of ‘ssize_t write(int, const void*, size_t)’, declared with attribute warn_unused_result [-Wunused-result]
doio.c: In function ‘PerlIOl** Perl_nextargv(GV*)’:
doio.c:876:46: warning: ignoring return value of ‘int fchown(int, __uid_t, __gid_t)’, declared with attribute warn_unused_result [-Wunused-result]
pp_ctl.c: In function ‘OP* Perl_pp_goto()’:
pp_ctl.c:2862:8: warning: variable ‘newsp’ set but not used [-Wunused-but-set-variable]
pp_ctl.c:2863:7: warning: variable ‘gimme’ set but not used [-Wunused-but-set-variable]
perlio.c: In function ‘void S_more_refcounted_fds(int)’:
perlio.c:2342:38: warning: ignoring return value of ‘ssize_t write(int, const void*, size_t)’, declared with attribute warn_unused_result [-Wunused-result]
perlio.c: In function ‘void PerlIO_debug(const char*, ...)’:
perlio.c:485:43: warning: ignoring return value of ‘ssize_t write(int, const void*, size_t)’, declared with attribute warn_unused_result [-Wunused-result]
mg_vtable.h:94:54: warning: ‘PL_magic_vtable_names’ initialized and declared ‘extern’ [enabled by default]
sdbm.c: In function ‘int makroom(DBM*, long int, int)’:
sdbm.c:378:70: warning: ignoring return value of ‘ssize_t write(int, const void*, size_t)’, declared with attribute warn_unused_result [-Wunused-result]
Call.xs: In function ‘I32 filter_call(int, SV*, int)’:
Call.xs:63:58: warning: format ‘%d’ expects argument of type ‘int’, but argument 3 has type ‘STRLEN {aka long unsigned int}’ [-Wformat]
Call.xs:63:58: warning: format ‘%d’ expects argument of type ‘int’, but argument 5 has type ‘STRLEN {aka long unsigned int}’ [-Wformat]
Call.xs:100:41: warning: format ‘%d’ expects argument of type ‘int’, but argument 4 has type ‘STRLEN {aka long unsigned int}’ [-Wformat]
Call.xs:156:38: warning: format ‘%d’ expects argument of type ‘int’, but argument 3 has type ‘STRLEN {aka long unsigned int}’ [-Wformat]
Call.xs:175:51: warning: format ‘%d’ expects argument of type ‘int’, but argument 4 has type ‘long unsigned int’ [-Wformat]
regcomp.c: In function ‘void S_dump_trie(const _reg_trie_data*, HV*, AV*, U32)’:
regcomp.c:1060:5: warning: variable ‘re_debug_flags’ set but not used [-Wunused-but-set-variable]
regcomp.c: In function ‘void S_dump_trie_interim_list(const _reg_trie_data*, HV*, AV*, U32, U32)’:
regcomp.c:1151:5: warning: variable ‘re_debug_flags’ set but not used [-Wunused-but-set-variable]
regcomp.c: In function ‘void S_dump_trie_interim_table(const _reg_trie_data*, HV*, AV*, U32, U32)’:
regcomp.c:1209:5: warning: variable ‘re_debug_flags’ set but not used [-Wunused-but-set-variable]
regcomp.c: In function ‘REGEXP* Perl_re_op_compile(SV**, int, OP*, const regexp_engine*, REGEXP*, bool*, U32, U32)’:
regcomp.c:6450:5: warning: variable ‘re_debug_flags’ set but not used [-Wunused-but-set-variable]
regcomp.c: In function ‘SV* Perl_reg_named_buff_nextkey(REGEXP*, U32)’:
regcomp.c:6598:5: warning: variable ‘re_debug_flags’ set but not used [-Wunused-but-set-variable]
regcomp.c: In function ‘void Perl_pregfree2(REGEXP*)’:
regcomp.c:13972:5: warning: variable ‘re_debug_flags’ set but not used [-Wunused-but-set-variable]
gv.c: In function ‘GV* Perl_gv_fetchmeth_pvn(PerlInterpreter*, HV*, const char*, STRLEN, I32, U32)’:
util.c: In function ‘char* S_write_no_mem(PerlInterpreter*)’:
sv.c: In function ‘DIR* Perl_dirp_dup(PerlInterpreter*, DIR*, CLONE_PARAMS*)’:
sv.c:11372:26: warning: ignoring return value of ‘int fchdir(int)’, declared with attribute warn_unused_result [-Wunused-result]
perl.c: In function ‘void S_init_tls_and_interp(PerlInterpreter*)’:
perl.c:103:2: warning: ignoring return value of ‘ssize_t write(int, const void*, size_t)’, declared with attribute warn_unused_result [-Wunused-result]
sv.c: In function ‘void Perl_sv_vcatpvfn_flags(PerlInterpreter*, SV*, const char*, STRLEN, __va_list_tag (*)[1], SV**, I32, bool*, U32)’:
doio.c: In function ‘void S_exec_failed(PerlInterpreter*, const char*, int, int)’:
doio.c: In function ‘PerlIOl** Perl_nextargv(PerlInterpreter*, GV*)’:
pp_ctl.c: In function ‘OP* Perl_pp_goto(PerlInterpreter*)’:
perlio.c: In function ‘void S_more_refcounted_fds(PerlInterpreter*, int)’:
sv.c: In function ‘char* Perl_sv_2pv_flags(PerlInterpreter*, SV*, STRLEN*, I32)’:
perlio.c:476:56: warning: ignoring return value of ‘ssize_t write(int, const void*, size_t)’, declared with attribute warn_unused_result [-Wunused-result]
Call.xs: In function ‘I32 filter_call(PerlInterpreter*, int, SV*, int)’:
shared.xs: In function ‘user_lock* S_get_userlock(PerlInterpreter*, SV*, bool)’:
shared.xs:348:5: warning: deprecated conversion from string constant to ‘char*’ [-Wwrite-strings]
shared.xs: In function ‘void S_sharedsv_dec(PerlInterpreter*, SV*)’:
shared.xs:521:5: warning: deprecated conversion from string constant to ‘char*’ [-Wwrite-strings]
shared.xs: In function ‘void Perl_sharedsv_share(PerlInterpreter*, SV*)’:
shared.xs:550:9: warning: deprecated conversion from string constant to ‘char*’ [-Wwrite-strings]
shared.xs: In function ‘int sharedsv_scalar_mg_get(PerlInterpreter*, SV*, MAGIC*)’:
shared.xs:725:5: warning: deprecated conversion from string constant to ‘char*’ [-Wwrite-strings]
shared.xs: In function ‘int sharedsv_scalar_mg_set(PerlInterpreter*, SV*, MAGIC*)’:
shared.xs:803:5: warning: deprecated conversion from string constant to ‘char*’ [-Wwrite-strings]
shared.xs: In function ‘int sharedsv_scalar_mg_free(PerlInterpreter*, SV*, MAGIC*)’:
shared.xs:821:5: warning: deprecated conversion from string constant to ‘char*’ [-Wwrite-strings]
shared.xs: In function ‘int sharedsv_scalar_mg_local(PerlInterpreter*, SV*, MAGIC*)’:
shared.xs:854:9: warning: deprecated conversion from string constant to ‘char*’ [-Wwrite-strings]
shared.xs: In function ‘int sharedsv_elem_mg_FETCH(PerlInterpreter*, SV*, MAGIC*)’:
shared.xs:891:5: warning: deprecated conversion from string constant to ‘char*’ [-Wwrite-strings]
shared.xs: In function ‘int sharedsv_elem_mg_STORE(PerlInterpreter*, SV*, MAGIC*)’:
shared.xs:944:5: warning: deprecated conversion from string constant to ‘char*’ [-Wwrite-strings]
shared.xs: In function ‘int sharedsv_elem_mg_DELETE(PerlInterpreter*, SV*, MAGIC*)’:
shared.xs:986:5: warning: deprecated conversion from string constant to ‘char*’ [-Wwrite-strings]
shared.xs: In function ‘U32 sharedsv_array_mg_FETCHSIZE(PerlInterpreter*, SV*, MAGIC*)’:
shared.xs:1049:5: warning: deprecated conversion from string constant to ‘char*’ [-Wwrite-strings]
shared.xs: In function ‘int sharedsv_array_mg_CLEAR(PerlInterpreter*, SV*, MAGIC*)’:
shared.xs:1069:5: warning: deprecated conversion from string constant to ‘char*’ [-Wwrite-strings]
shared.xs: In function ‘void Perl_sharedsv_lock(PerlInterpreter*, SV*)’:
shared.xs:1173:63: warning: deprecated conversion from string constant to ‘char*’ [-Wwrite-strings]
shared.xs: In function ‘void XS_threads__shared__tie_PUSH(PerlInterpreter*, CV*)’:
shared.xs:1269:13: warning: deprecated conversion from string constant to ‘char*’ [-Wwrite-strings]
shared.xs: In function ‘void XS_threads__shared__tie_UNSHIFT(PerlInterpreter*, CV*)’:
shared.xs:1286:9: warning: deprecated conversion from string constant to ‘char*’ [-Wwrite-strings]
shared.xs: In function ‘void XS_threads__shared__tie_POP(PerlInterpreter*, CV*)’:
shared.xs:1309:9: warning: deprecated conversion from string constant to ‘char*’ [-Wwrite-strings]
shared.xs: In function ‘void XS_threads__shared__tie_SHIFT(PerlInterpreter*, CV*)’:
shared.xs:1326:9: warning: deprecated conversion from string constant to ‘char*’ [-Wwrite-strings]
shared.xs: In function ‘void XS_threads__shared__tie_EXTEND(PerlInterpreter*, CV*)’:
shared.xs:1342:9: warning: deprecated conversion from string constant to ‘char*’ [-Wwrite-strings]
shared.xs: In function ‘void XS_threads__shared__tie_STORESIZE(PerlInterpreter*, CV*)’:
shared.xs:1352:9: warning: deprecated conversion from string constant to ‘char*’ [-Wwrite-strings]
shared.xs: In function ‘void XS_threads__shared__tie_EXISTS(PerlInterpreter*, CV*)’:
shared.xs:1364:13: warning: deprecated conversion from string constant to ‘char*’ [-Wwrite-strings]
shared.xs:1374:13: warning: deprecated conversion from string constant to ‘char*’ [-Wwrite-strings]
shared.xs: In function ‘void XS_threads__shared__tie_FIRSTKEY(PerlInterpreter*, CV*)’:
shared.xs:1390:9: warning: deprecated conversion from string constant to ‘char*’ [-Wwrite-strings]
shared.xs: In function ‘void XS_threads__shared__tie_NEXTKEY(PerlInterpreter*, CV*)’:
shared.xs:1418:9: warning: deprecated conversion from string constant to ‘char*’ [-Wwrite-strings]
shared.xs: In function ‘void XS_threads__shared_bless(PerlInterpreter*, CV*)’:
shared.xs:1678:13: warning: deprecated conversion from string constant to ‘char*’ [-Wwrite-strings]
threads.xs: In function ‘ithread* S_ithread_create(PerlInterpreter*, SV*, IV, int, int, int, int)’:
threads.xs:714:83: warning: ignoring return value of ‘ssize_t write(int, const void*, size_t)’, declared with attribute warn_unused_result [-Wunused-result]
regcomp.c: In function ‘void S_dump_trie(PerlInterpreter*, const _reg_trie_data*, HV*, AV*, U32)’:
regcomp.c: In function ‘void S_dump_trie_interim_list(PerlInterpreter*, const _reg_trie_data*, HV*, AV*, U32, U32)’:
regcomp.c: In function ‘void S_dump_trie_interim_table(PerlInterpreter*, const _reg_trie_data*, HV*, AV*, U32, U32)’:
regcomp.c: In function ‘REGEXP* Perl_re_op_compile(PerlInterpreter*, SV**, int, OP*, const regexp_engine*, REGEXP*, bool*, U32, U32)’:
regcomp.c: In function ‘SV* Perl_reg_named_buff_nextkey(PerlInterpreter*, REGEXP*, U32)’:
regcomp.c: In function ‘void Perl_pregfree2(PerlInterpreter*, REGEXP*)’:
-- 
Report by Test::Smoke v1.44 build 1285 running on perl 5.14.2
(Reporter v0.035 / Smoker v0.045)


Thread Previous


nntp.perl.org: Perl Programming lists via nntp and http.
Comments to Ask Bjørn Hansen at ask@perl.org | Group listing | About