develooper Front page | perl.perl5.porters | Postings from September 2012

Smoke [blead] v5.17.3-299-gc5e8d5c FAIL(XF) linux 3.2.0-30-generic [debian] (x86_64/8 cpu)

Thread Next
From:
George Greer
Date:
September 13, 2012 03:37
Subject:
Smoke [blead] v5.17.3-299-gc5e8d5c FAIL(XF) linux 3.2.0-30-generic [debian] (x86_64/8 cpu)
Message ID:
201209131037.q8DAbcbj015480@m-l.org
Smoke logs available at http://m-l.org/~perl/smoke/perl/

Automated smoke report for 5.17.4 patch c5e8d5cb14d8999b3dd37aa58729254df170be03 v5.17.3-299-gc5e8d5c
zwei: Intel(R) Core(TM) i7 CPU 920 @ 2.67GHz (GenuineIntel 1600MHz) (x86_64/8 cpu)
    on        linux - 3.2.0-30-generic [debian]
    using     clang version 4.2.1 Compatible Ubuntu Clang 3.0 (tags/RELEASE_30/final)
    smoketime 18 hours 44 minutes (average 56 minutes 15 seconds)

Summary: FAIL(XF)

O = OK  F = Failure(s), extended report at the bottom
X = Failure(s) under TEST but not under harness
? = still running or test results not (yet) available
Build failures during:       - = unknown or N/A
c = Configure, m = make, M = make (after miniperl), t = make test-prep

v5.17.3-299-gc5e8d5c  Configuration (common) -A -Dcc=clang append:ccflags=" -fcatch-undefined-behavior "
----------- ---------------------------------------------------------
O O O O O O O O 
X X F X X X F X -Accflags=-DPERL_POISON
O O O O O O O O -Duse64bitall
O O O O O O O O -Dusemorebits
O O O O O O O O -Dmad
O O O O O O O X -Duseithreads
X X F X O X O X -Duseithreads -Accflags=-DPERL_POISON
O O O O O O O O -Duseithreads -Duse64bitall
O O O O O O O X -Duseithreads -Dusemorebits
O O O O O O O O -Duseithreads -Dmad
| | | | | +- LC_ALL = en_US.utf8 -DDEBUGGING
| | | | +--- PERLIO = perlio -DDEBUGGING
| | | +----- PERLIO = stdio  -DDEBUGGING
| | +------- LC_ALL = en_US.utf8
| +--------- PERLIO = perlio
+----------- PERLIO = stdio 

Locally applied patches:
    uncommitted-changes
    SMOKEc5e8d5cb14d8999b3dd37aa58729254df170be03

Failures: (common-args) -A -Dcc=clang append:ccflags=" -fcatch-undefined-behavior "
[stdio] -Accflags=-DPERL_POISON
[stdio] -DDEBUGGING -Accflags=-DPERL_POISON
[stdio] -Duseithreads -Accflags=-DPERL_POISON
Inconsistent test results (between TEST and harness):
    ../t/re/subst.t......................... ................................................... FAILED--expected 190 tests, saw 161
    ../t/re/substT.t........................ .................................................. FAILED--expected 190 tests, saw 161
    ../t/re/subst_wamp.t.................... .............................................. FAILED--expected 190 tests, saw 161

[perlio/en_US.utf8] -Accflags=-DPERL_POISON
[perlio/en_US.utf8] -DDEBUGGING -Accflags=-DPERL_POISON
[perlio/en_US.utf8] -Duseithreads -Accflags=-DPERL_POISON
Inconsistent test results (between TEST and harness):
    ../t/comp/require.t..................... ............................................... FAILED at test 47
    ../t/re/subst.t......................... ................................................... FAILED--expected 190 tests, saw 161
    ../t/re/substT.t........................ .................................................. FAILED--expected 190 tests, saw 161
    ../t/re/subst_wamp.t.................... .............................................. FAILED--expected 190 tests, saw 161

[minitest] -Accflags=-DPERL_POISON
[minitest] -DDEBUGGING -Accflags=-DPERL_POISON
[minitest] -Duseithreads -Accflags=-DPERL_POISON
    t/re/subst ..................... FAILED--expected 190 tests, saw 161
    t/re/substT .................... FAILED--expected 190 tests, saw 161
    t/re/subst_wamp ................ FAILED--expected 190 tests, saw 161

[en_US.utf8] -DDEBUGGING -Duseithreads
[perlio] -DDEBUGGING -Duseithreads -Accflags=-DPERL_POISON
[en_US.utf8] -DDEBUGGING -Duseithreads -Dusemorebits
Inconsistent test results (between TEST and harness):
    ../lib/Benchmark.t...................... ................................................ FAILED at test 15

[en_US.utf8] -DDEBUGGING -Duseithreads -Accflags=-DPERL_POISON
Inconsistent test results (between TEST and harness):
    ../t/comp/require.t..................... ............................................... FAILED at test 47

Compiler messages(gcc):
utf8.c:1707:20: warning: implicit conversion from 'int' to 'U8' (aka 'unsigned char') changes value from 65533 to 253 [-Wconstant-conversion]
scope.c:691:68: warning: conversion specifies type 'long' but the argument has type 'I32' (aka 'int') [-Wformat]
scope.c:691:72: warning: conversion specifies type 'long' but the argument has type 'I32' (aka 'int') [-Wformat]
perlio.c:5182:21: warning: comparison of integers of different signs: 'size_t' (aka 'unsigned long') and 'int' [-Wsign-compare]
pp.c:3474:22: warning: implicit conversion from 'int' to 'U8' (aka 'unsigned char') changes value from 65533 to 253 [-Wconstant-conversion]
pp.c:3788:12: warning: implicit conversion from 'int' to 'U8' (aka 'unsigned char') changes value from 65533 to 253 [-Wconstant-conversion]
pp.c:3996:12: warning: implicit conversion from 'int' to 'U8' (aka 'unsigned char') changes value from 65533 to 253 [-Wconstant-conversion]
pp.c:4224:26: warning: implicit conversion from 'int' to 'U8' (aka 'unsigned char') changes value from 65533 to 253 [-Wconstant-conversion]
Zlib.xs:620:5: warning: expression result unused [-Wunused-value]
scalar.xs:48:5: warning: expression result unused [-Wunused-value]
./const-c.inc:47:2: warning: expression result unused [-Wunused-value]
./const-c.inc:81:5: warning: expression result unused [-Wunused-value]
Call.xs:62:58: warning: conversion specifies type 'int' but the argument has type 'STRLEN' (aka 'unsigned long') [-Wformat]
Call.xs:62:78: warning: conversion specifies type 'int' but the argument has type 'STRLEN' (aka 'unsigned long') [-Wformat]
Call.xs:99:53: warning: conversion specifies type 'int' but the argument has type 'STRLEN' (aka 'unsigned long') [-Wformat]
Call.xs:155:46: warning: conversion specifies type 'int' but the argument has type 'STRLEN' (aka 'unsigned long') [-Wformat]
Call.xs:174:57: warning: conversion specifies type 'int' but the argument has type 'STRLEN' (aka 'unsigned long') [-Wformat]
Glob.xs:100:2: warning: expression result unused [-Wunused-value]
Glob.xs:108:6: warning: expression result unused [-Wunused-value]
./const-c.inc:38:2: warning: expression result unused [-Wunused-value]
./const-c.inc:73:5: warning: expression result unused [-Wunused-value]
Bzip2.xs:326:5: warning: expression result unused [-Wunused-value]
./const-c.inc:72:5: warning: expression result unused [-Wunused-value]
B.xs:2121:14: warning: comparison of unsigned expression >= 0 is always true [-Wtautological-compare]
Socket.xs:919:16: warning: more '%' conversions than data arguments [-Wformat]
Socket.xs:925:16: warning: more '%' conversions than data arguments [-Wformat]
Typemap.xs:179:46: warning: conversion specifies type 'unsigned int' but the argument has type 'UV' (aka 'unsigned long') [-Wformat]
Storable.xs:4068:2: warning: null passed to a callee which requires a non-null argument [-Wnonnull]
Storable.xs:4255:10: warning: null passed to a callee which requires a non-null argument [-Wnonnull]
Storable.xs:4505:2: warning: expression result unused [-Wunused-value]
Storable.xs:5550:2: warning: null passed to a callee which requires a non-null argument [-Wnonnull]
Storable.xs:5613:2: warning: null passed to a callee which requires a non-null argument [-Wnonnull]
Storable.xs:6124:5: warning: expression result unused [-Wunused-value]
Collate.xs:611:2: warning: expression result unused [-Wunused-value]
Collate.xs:601:2: warning: expression result unused [-Wunused-value]
Unicode.xs:176:6: warning: expression result unused [-Wunused-value]
Unicode.xs:342:6: warning: expression result unused [-Wunused-value]
ExtTest.xs:44:2: warning: expression result unused [-Wunused-value]
ExtTest.xs:78:5: warning: expression result unused [-Wunused-value]
Glob.xs:100:2: warning: 1 warning generated.
In file i:919:162 warning: ./const-c.inc:47:2: warning: expression result unused [-Wunused-value]
        ^~~~~~~~~~~~~~~~~~~~~~~~~~~~~~~~~~~~~~~~~~~~~~~~~~~~Typemap.xs:179:46: warning: conversion specifies type 'unsigned int' but the argument has type 'UV' (aka 'unsigned long') [-Wformat]
-- 
Report by Test::Smoke v1.44 build 1285 running on perl 5.14.2
(Reporter v0.035 / Smoker v0.045)


Thread Next


nntp.perl.org: Perl Programming lists via nntp and http.
Comments to Ask Bjørn Hansen at ask@perl.org | Group listing | About