develooper Front page | perl.perl5.porters | Postings from September 2012

Smoke [blead] v5.17.3-304-g650f067 FAIL(F) linux 3.2.0-30-generic [debian] (x86_64/8 cpu)

From:
George Greer
Date:
September 12, 2012 19:08
Subject:
Smoke [blead] v5.17.3-304-g650f067 FAIL(F) linux 3.2.0-30-generic [debian] (x86_64/8 cpu)
Message ID:
201209130208.q8D28146024277@m-l.org
Smoke logs available at http://m-l.org/~perl/smoke/perl/

Automated smoke report for 5.17.4 patch 650f067c54a3baf4a72cb6953bd10c90abb28bd2 v5.17.3-304-g650f067
zwei: Intel(R) Core(TM) i7 CPU 920 @ 2.67GHz (GenuineIntel 2668MHz) (x86_64/8 cpu)
    on        linux - 3.2.0-30-generic [debian]
    using     clang version 4.2.1 Compatible Ubuntu Clang 3.0 (tags/RELEASE_30/final)
    smoketime 49 minutes 28 seconds (average 12 minutes 22 seconds)

Summary: FAIL(F)

O = OK  F = Failure(s), extended report at the bottom
X = Failure(s) under TEST but not under harness
? = still running or test results not (yet) available
Build failures during:       - = unknown or N/A
c = Configure, m = make, M = make (after miniperl), t = make test-prep

v5.17.3-304-g650f067  Configuration (common) -A -Dcc=clang append:ccflags=" -fcatch-undefined-behavior -DPERL_POISON "
----------- ---------------------------------------------------------
F F F F     
F F O O     -Duseithreads
| +--------- -DDEBUGGING
+----------- no debugging


Locally applied patches:
    uncommitted-changes
    SMOKE650f067c54a3baf4a72cb6953bd10c90abb28bd2

Testsuite was run only with 'harness'

Failures: (common-args) -A -Dcc=clang append:ccflags=" -fcatch-undefined-behavior -DPERL_POISON "
[default] 
[default] -DDEBUGGING
[default] -Duseithreads
../t/re/subst.t.............................................FAILED
    Bad plan.  You planned 190 tests but ran 161.
../t/re/subst_wamp.t........................................FAILED
    Bad plan.  You planned 190 tests but ran 161.
../t/re/substT.t............................................FAILED
    Bad plan.  You planned 190 tests but ran 161.

[minitest] 
[minitest] -DDEBUGGING
[minitest] -Duseithreads
    t/re/subst ..................... FAILED--expected 190 tests, saw 161
    t/re/substT .................... FAILED--expected 190 tests, saw 161
    t/re/subst_wamp ................ FAILED--expected 190 tests, saw 161

Passed Todo tests: (common-args) -A -Dcc=clang append:ccflags=" -fcatch-undefined-behavior -DPERL_POISON "
[default] 
[default] -DDEBUGGING
[default] -Duseithreads
[default] -DDEBUGGING -Duseithreads
../cpan/CGI/t/tmpdir.t......................................PASSED
    3-9

Compiler messages(gcc):
scope.c:691:68: warning: conversion specifies type 'long' but the argument has type 'I32' (aka 'int') [-Wformat]
scope.c:691:72: warning: conversion specifies type 'long' but the argument has type 'I32' (aka 'int') [-Wformat]
utf8.c:1707:20: warning: implicit conversion from 'int' to 'U8' (aka 'unsigned char') changes value from 65533 to 253 [-Wconstant-conversion]
perlio.c:5182:21: warning: comparison of integers of different signs: 'size_t' (aka 'unsigned long') and 'int' [-Wsign-compare]
pp.c:3474:22: warning: implicit conversion from 'int' to 'U8' (aka 'unsigned char') changes value from 65533 to 253 [-Wconstant-conversion]
pp.c:3788:12: warning: implicit conversion from 'int' to 'U8' (aka 'unsigned char') changes value from 65533 to 253 [-Wconstant-conversion]
pp.c:3996:12: warning: implicit conversion from 'int' to 'U8' (aka 'unsigned char') changes value from 65533 to 253 [-Wconstant-conversion]
pp.c:4224:26: warning: implicit conversion from 'int' to 'U8' (aka 'unsigned char') changes value from 65533 to 253 [-Wconstant-conversion]
Zlib.xs:620:5: warning: expression result unused [-Wunused-value]
Call.xs:62:58: warning: conversion specifies type 'int' but the argument has type 'STRLEN' (aka 'unsigned long') [-Wformat]
Call.xs:62:78: warning: conversion specifies type 'int' but the argument has type 'STRLEN' (aka 'unsigned long') [-Wformat]
Call.xs:99:53: warning: conversion specifies type 'int' but the argument has type 'STRLEN' (aka 'unsigned long') [-Wformat]
Call.xs:155:46: warning: conversion specifies type 'int' but the argument has type 'STRLEN' (aka 'unsigned long') [-Wformat]
Call.xs:174:57: warning: conversion specifies type 'int' but the argument has type 'STRLEN' (aka 'unsigned long') [-Wformat]
Bzip2.xs:326:5: warning: expression result unused [-Wunused-value]
./const-c.inc:47:2: warning: expression result unused [-Wunused-value]
./const-c.inc:81:5: warning: expression result unused [-Wunused-value]
Glob.xs:100:2: warning: expression result unused [-Wunused-value]
Glob.xs:108:6: warning: expression result unused [-Wunused-value]
scalar.xs:48:5: warning: expression result unused [-Wunused-value]
Typemap.xs:179:46: warning: conversion specifies type 'unsigned int' but the argument has type 'UV' (aka 'unsigned long') [-Wformat]
./const-c.inc:38:2: warning: expression result unused [-Wunused-value]
./const-c.inc:72:5: warning: expression result unused [-Wunused-value]
Socket.xs:919:16: warning: more '%' conversions than data arguments [-Wformat]
Socket.xs:925:16: warning: more '%' conversions than data arguments [-Wformat]
./const-c.inc:73:5: warning: expression result unused [-Wunused-value]
Storable.xs:4068:2: warning: null passed to a callee which requires a non-null argument [-Wnonnull]
B.xs:2121:14: warning: comparison of unsigned expression >= 0 is always true [-Wtautological-compare]
Storable.xs:4255:10: warning: null passed to a callee which requires a non-null argument [-Wnonnull]
Storable.xs:4505:2: warning: expression result unused [-Wunused-value]
Storable.xs:5550:2: warning: null passed to a callee which requires a non-null argument [-Wnonnull]
Storable.xs:5613:2: warning: null passed to a callee which requires a non-null argument [-Wnonnull]
Storable.xs:6124:5: warning: expression result unused [-Wunused-value]
Collate.xs:611:2: warning: expression result unused [-Wunused-value]
Collate.xs:601:2: warning: expression result unused [-Wunused-value]
Unicode.xs:176:6: warning: expression result unused [-Wunused-value]
Unicode.xs:342:6: warning: expression result unused [-Wunused-value]
ExtTest.xs:44:2: warning: expression result unused [-Wunused-value]
ExtTest.xs:78:5: warning: expression result unused [-Wunused-value]
-- 
Report by Test::Smoke v1.44 build 1285 running on perl 5.14.2
(Reporter v0.035 / Smoker v0.045)




nntp.perl.org: Perl Programming lists via nntp and http.
Comments to Ask Bjørn Hansen at ask@perl.org | Group listing | About