develooper Front page | perl.perl5.porters | Postings from August 2012

Smoke [5.17.3] v5.17.2-309-g8dd3419 FAIL(F) MSWin32 Win7 Home Premium (x86/8 cpu)

From:
Steve Hay
Date:
August 12, 2012 14:14
Subject:
Smoke [5.17.3] v5.17.2-309-g8dd3419 FAIL(F) MSWin32 Win7 Home Premium (x86/8 cpu)
Message ID:
486480.712890625-sendEmail@hpwin7
Automated smoke report for 5.17.3 patch 8dd3419c92eda7bae0fbb0d327a28871dc427dc7 v5.17.2-309-g8dd3419
HPWIN7: Intel64 Family 6 Model 42 Stepping 7, GenuineIntel (x86/8 cpu)
    on        MSWin32 - Win7 Home Premium (64-bit) SP1
    using     cl version 16.00.40219.01
    smoketime 1 hour 9 minutes (average 34 minutes 34 seconds)

Summary: FAIL(F)

O = OK  F = Failure(s), extended report at the bottom
X = Failure(s) under TEST but not under harness
? = still running or test results not (yet) available
Build failures during:       - = unknown or N/A
c = Configure, m = make, M = make (after miniperl), t = make test-prep

v5.17.2-309-g8dd3419  Configuration (common) -DCCTYPE=MSVC100
----------- ---------------------------------------------------------
F F         -Duseithreads -Duselargefiles
| +--------- -DDEBUGGING
+----------- no debugging


Locally applied patches:
    SMOKE85b769704171cb40faee0cdff60865fbf100c4c0

Failures: (common-args) -DCCTYPE=MSVC100
[default] -Duseithreads -Duselargefiles
./t/op/fork.t..............................................FAILED
    24
./t/op/magic.t.............................................FAILED
    154, 157

[default] -DDEBUGGING -Duseithreads -Duselargefiles
./t/op/magic.t.............................................FAILED
    154, 157
./cpan/CPANPLUS/t/20_CPANPLUS-Dist-MM.t....................FAILED
    82
    Non-zero exit status: 1
./dist/IO/t/io_sock.t......................................FAILED
    25
    Non-zero exit status: 54
    Bad plan.  You planned 26 tests but ran 25.

MANIFEST did not declare '.GIT/CONFIG'
MANIFEST did not declare '.GIT/DESCRIPTION'
MANIFEST did not declare '.GIT/FETCH_HEAD'
MANIFEST did not declare '.GIT/HEAD'
MANIFEST did not declare '.GIT/HOOKS/APPLYPATCH-MSG.SAMPLE'
MANIFEST did not declare '.GIT/HOOKS/COMMIT-MSG.SAMPLE'
MANIFEST did not declare '.GIT/HOOKS/POST-COMMIT.SAMPLE'
MANIFEST did not declare '.GIT/HOOKS/POST-RECEIVE.SAMPLE'
MANIFEST did not declare '.GIT/HOOKS/POST-UPDATE.SAMPLE'
MANIFEST did not declare '.GIT/HOOKS/PRE-APPLYPATCH.SAMPLE'
MANIFEST did not declare '.GIT/HOOKS/PRE-COMMIT.SAMPLE'
MANIFEST did not declare '.GIT/HOOKS/PRE-REBASE.SAMPLE'
MANIFEST did not declare '.GIT/HOOKS/PREPARE-COMMIT-MSG.SAMPLE'
MANIFEST did not declare '.GIT/HOOKS/UPDATE.SAMPLE'
MANIFEST did not declare '.GIT/INDEX'
MANIFEST did not declare '.GIT/INFO/EXCLUDE'
MANIFEST did not declare '.GIT/LOGS/HEAD'
MANIFEST did not declare '.GIT/LOGS/REFS/HEADS/BLEAD'
MANIFEST did not declare '.GIT/LOGS/REFS/REMOTES/ORIGIN/BLEAD'
MANIFEST did not declare '.GIT/OBJECTS/02/E7275F750FE2F87A8636543C72F801231FB779'
MANIFEST did not declare '.GIT/OBJECTS/0C/C1D3ECF182B8F28E4EA441B8D5B2DD04668CD7'
MANIFEST did not declare '.GIT/OBJECTS/10/666F45F81C62C54E9B74233AC80AC0CE1C79CC'
MANIFEST did not declare '.GIT/OBJECTS/2C/7EADA33E3ADC1DDA7B0D9D8F04F3F71D2E38D7'
MANIFEST did not declare '.GIT/OBJECTS/3A/87455D8F34A7C7733C996A9319BC94DEAB2CAA'
MANIFEST did not declare '.GIT/OBJECTS/44/5E1C3849F6C38AE51A366977762166944B324C'
MANIFEST did not declare '.GIT/OBJECTS/53/77C67316FFD5D06DA79CA0F0B3FB1F5CB467A8'
MANIFEST did not declare '.GIT/OBJECTS/5E/97C24D21E820C1B7F574AB909C5373230F27FE'
MANIFEST did not declare '.GIT/OBJECTS/5F/3C4D41E0FB0712E92029CE2541646693A783BE'
MANIFEST did not declare '.GIT/OBJECTS/61/228C762AD9B92B72C69A6753A41FE64FBF4FE0'
MANIFEST did not declare '.GIT/OBJECTS/73/446B90D023820C80BED21A07618F2D7F0248E1'
MANIFEST did not declare '.GIT/OBJECTS/73/ECDFBC4B9B112D97A0E67D09CF3FF966FEA68D'
MANIFEST did not declare '.GIT/OBJECTS/7A/919E56CF662FE38F14C8AAFFE976D27E0EFF64'
MANIFEST did not declare '.GIT/OBJECTS/7A/9EB9E0F93DBEFC506FBF3349A15068206E6F0B'
MANIFEST did not declare '.GIT/OBJECTS/7B/A8970DD3A78097012503F0C4B1900E36B571A9'
MANIFEST did not declare '.GIT/OBJECTS/7F/58BF114CAE6EC9E1AC6BD4261FCD1B71D7BF6C'
MANIFEST did not declare '.GIT/OBJECTS/7F/849C2100F65435CA6BE4F56B923F683E228D80'
MANIFEST did not declare '.GIT/OBJECTS/86/78774118DE38E4BBE888F225E53CAA4E100B74'
MANIFEST did not declare '.GIT/OBJECTS/8F/0D05242FACB76DCFFCA950CE0F5C9259A051CF'
MANIFEST did not declare '.GIT/OBJECTS/96/387FC89C68342B93E9D9CB56D097F79B75A10E'
MANIFEST did not declare '.GIT/OBJECTS/96/7681DB2CA731EA5FCB1874E5F36FA10AA6E730'
MANIFEST did not declare '.GIT/OBJECTS/97/C78B277558E399F5E5BE3EDBEE47144546EC3C'
MANIFEST did not declare '.GIT/OBJECTS/9A/5C70614981F8286C405A4634DB5B942FE212C0'
MANIFEST did not declare '.GIT/OBJECTS/9F/186F890A2642F0478A32D877BD1F2A8E8A1285'
MANIFEST did not declare '.GIT/OBJECTS/A2/5F0A5B2072E158305043F8585C7D44065F7840'
MANIFEST did not declare '.GIT/OBJECTS/B6/6BC350456F47CE74A78CD444C4EBF5FB4B4E83'
MANIFEST did not declare '.GIT/OBJECTS/B8/D3C767693F24CE43FA1E41C98036586854AD71'
MANIFEST did not declare '.GIT/OBJECTS/C5/0F9CC432583AB471DEFE32043B3438BFC2B7A5'
MANIFEST did not declare '.GIT/OBJECTS/CB/BB74ADE91E184263EE574672212F870C950A3F'
MANIFEST did not declare '.GIT/OBJECTS/D3/E3F9AE5B9443FF46141C9DAE82C340CF36F20B'
MANIFEST did not declare '.GIT/OBJECTS/D4/7BAF14C15A855FD3EE8CCBAE3E8CC4223D8DA8'
MANIFEST did not declare '.GIT/OBJECTS/E3/A5BE26E81C06DDCEECF5D8DDF0BC9DE328BE76'
MANIFEST did not declare '.GIT/OBJECTS/E5/6A566BDB680E52902A515528E316AB1D718662'
MANIFEST did not declare '.GIT/OBJECTS/EB/80CBBAA1A0EE987F53D1493C4A721B8EDCE0B9'
MANIFEST did not declare '.GIT/OBJECTS/F8/5F649414F06CA9F99FCE46E2025CDF33FE16E9'
MANIFEST did not declare '.GIT/OBJECTS/FE/942E5BE7942086CFAE96875FEFB9D10EB2179D'
MANIFEST did not declare '.GIT/OBJECTS/PACK/PACK-6C18A822E0C6884297E23B22E3A67A86F675A21F.IDX'
MANIFEST did not declare '.GIT/OBJECTS/PACK/PACK-6C18A822E0C6884297E23B22E3A67A86F675A21F.PACK'
MANIFEST did not declare '.GIT/OBJECTS/PACK/PACK-B346214EA4AEA347A9DB58BF99C4063A67B8DD6C.IDX'
MANIFEST did not declare '.GIT/OBJECTS/PACK/PACK-B346214EA4AEA347A9DB58BF99C4063A67B8DD6C.PACK'
MANIFEST did not declare '.GIT/OBJECTS/PACK/PACK-D77874A0CDF54E8B1536B930B6008276950B2D0B.IDX'
MANIFEST did not declare '.GIT/OBJECTS/PACK/PACK-D77874A0CDF54E8B1536B930B6008276950B2D0B.PACK'
MANIFEST did not declare '.GIT/ORIG_HEAD'
MANIFEST did not declare '.GIT/PACKED-REFS'
MANIFEST did not declare '.GIT/REFS/HEADS/BLEAD'
MANIFEST did not declare '.GIT/REFS/REMOTES/ORIGIN/BLEAD'
MANIFEST did not declare '.GIT/REFS/REMOTES/ORIGIN/HEAD'
MANIFEST did not declare 'CPAN/.GITIGNORE'
MANIFEST did not declare 'CPAN/COMPRESS-RAW-BZIP2/.GITIGNORE'
MANIFEST did not declare 'CPAN/COMPRESS-RAW-ZLIB/.GITIGNORE'
MANIFEST did not declare 'CPAN/DB_FILE/.GITIGNORE'
MANIFEST did not declare 'CPAN/DEVEL-PPPORT/.GITIGNORE'
MANIFEST did not declare 'CPAN/ENCODE/.GITIGNORE'
MANIFEST did not declare 'CPAN/IO-COMPRESS/TST1848X00004.TMP'
MANIFEST did not declare 'CPAN/IO-COMPRESS/TST2608X00004.TMP'
MANIFEST did not declare 'CPAN/IO-COMPRESS/TST3044X00004.TMP'
MANIFEST did not declare 'CPAN/IO-COMPRESS/TST3332X00004.TMP'
MANIFEST did not declare 'CPAN/IO-COMPRESS/TST3484X00004.TMP'
MANIFEST did not declare 'CPAN/IO-COMPRESS/TST3916X00004.TMP'
MANIFEST did not declare 'CPAN/IO-COMPRESS/TST5380X00004.TMP'
MANIFEST did not declare 'CPAN/IO-COMPRESS/TST5912X00004.TMP'
MANIFEST did not declare 'CPAN/IO-COMPRESS/TST6256X00004.TMP'
MANIFEST did not declare 'CPAN/IO-COMPRESS/TST6584X00004.TMP'
MANIFEST did not declare 'CPAN/IO-COMPRESS/TST6720X00004.TMP'
MANIFEST did not declare 'CPAN/IO-COMPRESS/TST6872X00004.TMP'
MANIFEST did not declare 'CPAN/IO-COMPRESS/TST7072X00004.TMP'
MANIFEST did not declare 'CPAN/IO-COMPRESS/TST7284X00004.TMP'
MANIFEST did not declare 'CPAN/IO-COMPRESS/TST7332X00004.TMP'
MANIFEST did not declare 'CPAN/IO-COMPRESS/TST7364X00004.TMP'
MANIFEST did not declare 'CPAN/IO-COMPRESS/TST7660X00004.TMP'
MANIFEST did not declare 'CPAN/IO-COMPRESS/TST7964X00004.TMP'
MANIFEST did not declare 'CPAN/IO-COMPRESS/TST8044X00004.TMP'
MANIFEST did not declare 'CPAN/IO-COMPRESS/TST8164X00004.TMP'
MANIFEST did not declare 'CPAN/IO-COMPRESS/TST8248X00004.TMP'
MANIFEST did not declare 'CPAN/IO-COMPRESS/TST8308X00004.TMP'
MANIFEST did not declare 'CPAN/IO-COMPRESS/TST8764X00004.TMP'
MANIFEST did not declare 'CPAN/IO-COMPRESS/TST8780X00004.TMP'
MANIFEST did not declare 'CPAN/IPC-SYSV/.GITIGNORE'
MANIFEST did not declare 'CPAN/MODULE-BUILD/.GITIGNORE'
MANIFEST did not declare 'CPAN/MODULE-PLUGGABLE/T/LIB/EDITORJUNK/PLUGIN/.GITIGNORE'
MANIFEST did not declare 'CPAN/MODULE-PLUGGABLE/T/LIB/ODDTEST/PLUGIN/.GITIGNORE'
MANIFEST did not declare 'CPAN/POD-LATEX/.GITIGNORE'
MANIFEST did not declare 'CPAN/POD-PARSER/.GITIGNORE'
MANIFEST did not declare 'CPAN/PODLATORS/.GITIGNORE'
MANIFEST did not declare 'CPAN/SOCKET/.GITIGNORE'
MANIFEST did not declare 'CPAN/SYS-SYSLOG/.GITIGNORE'
MANIFEST did not declare 'CPAN/UNICODE-COLLATE/.GITIGNORE'
MANIFEST did not declare 'CPAN/UNICODE-NORMALIZE/.GITIGNORE'
MANIFEST did not declare 'DIST/.GITIGNORE'
MANIFEST did not declare 'DIST/EXTUTILS-CBUILDER/COMPILET_DEF.OLD'
MANIFEST did not declare 'DIST/IO/.GITIGNORE'
MANIFEST did not declare 'DIST/LIB/.GITIGNORE'
MANIFEST did not declare 'DIST/SEARCH-DICT/DICT-1676'
MANIFEST did not declare 'DIST/SEARCH-DICT/DICT-3484'
MANIFEST did not declare 'DIST/SEARCH-DICT/DICT-5612'
MANIFEST did not declare 'DIST/SEARCH-DICT/DICT-7364'
MANIFEST did not declare 'DIST/SEARCH-DICT/DICT-8648'
MANIFEST did not declare 'DIST/SEARCH-DICT/DICT-8824'
MANIFEST did not declare 'DIST/XSLOADER/.GITIGNORE'
MANIFEST did not declare 'EXT/.GITIGNORE'
MANIFEST did not declare 'EXT/B/.GITIGNORE'
MANIFEST did not declare 'EXT/DYNALOADER/.GITIGNORE'
MANIFEST did not declare 'EXT/ERRNO/.GITIGNORE'
MANIFEST did not declare 'EXT/FCNTL/.GITIGNORE'
MANIFEST did not declare 'EXT/FILE-GLOB/.GITIGNORE'
MANIFEST did not declare 'EXT/GDBM_FILE/.GITIGNORE'
MANIFEST did not declare 'EXT/I18N-LANGINFO/.GITIGNORE'
MANIFEST did not declare 'EXT/POD-FUNCTIONS/.GITIGNORE'
MANIFEST did not declare 'EXT/POD-HTML/.GITIGNORE'
MANIFEST did not declare 'EXT/POSIX/.GITIGNORE'
MANIFEST did not declare 'EXT/SDBM_FILE/SDBM/.GITIGNORE'
MANIFEST did not declare 'EXT/WIN32CORE/.GITIGNORE'
MANIFEST did not declare 'EXT/XS-APITEST/.GITIGNORE'
MANIFEST did not declare 'LIB/.GITIGNORE'
MANIFEST did not declare 'LIB/EXTUTILS/MINIPERL.PM'
MANIFEST did not declare 'MKTEST.JSN'
MANIFEST did not declare 'PATCHLEVEL.BAK'
MANIFEST did not declare 'POD/.GITIGNORE'
MANIFEST did not declare 'POLICY.SH'
MANIFEST did not declare 'T/TMP1368B.DIR'
MANIFEST did not declare 'T/TMP1368B.PAG'
MANIFEST did not declare 'T/TMP4344B.DIR'
MANIFEST did not declare 'T/TMP4344B.PAG'
MANIFEST did not declare 'T/TMP5024B.DIR'
MANIFEST did not declare 'T/TMP5024B.PAG'
MANIFEST did not declare 'T/TMP5056B.DIR'
MANIFEST did not declare 'T/TMP5056B.PAG'
MANIFEST did not declare 'T/TMP6780B.DIR'
MANIFEST did not declare 'T/TMP6780B.PAG'
MANIFEST did not declare 'T/TMP8056B.DIR'
MANIFEST did not declare 'T/TMP8056B.PAG'
MANIFEST did not declare 'UTILS/.GITIGNORE'
MANIFEST did not declare 'WIN32/.GITIGNORE'
MANIFEST did not declare 'WIN32/SMOKE.MK'
MANIFEST did not declare 'X2P/.GITIGNORE'

Passed Todo tests: (common-args) -DCCTYPE=MSVC100
[default] -Duseithreads -Duselargefiles
[default] -DDEBUGGING -Duseithreads -Duselargefiles
./cpan/CGI/t/tmpdir.t......................................PASSED
    3-9

Compiler messages(MSWin32):
.\mg.c(676) : warning C4646: function declared with __declspec(noreturn) has non-void return type
.\mg.c(681) : warning C4645: function declared with __declspec(noreturn) has a return statement
op.c(11013) : warning C4028: formal parameter 1 different from declaration
.\pp_hot.c(2688) : warning C4244: 'initializing' : conversion from 'I32' to 'U8', possible loss of data
.\pp_sort.c(1668) : warning C4244: 'initializing' : conversion from 'I32' to 'U8', possible loss of data
.\regcomp.c(10756) : warning C4244: '=' : conversion from 'UV' to 'char', possible loss of data
.\regcomp.c(12168) : warning C4244: '=' : conversion from 'IV' to 'U8', possible loss of data
.\regexec.c(4383) : warning C4244: 'initializing' : conversion from 'I32' to 'U8', possible loss of data
.\regexec.c(4386) : warning C4244: 'initializing' : conversion from 'I32' to 'U8', possible loss of data
op.c(11013) : warning C4028: formal parameter 2 different from declaration
IO.xs(493) : warning C4101: 'ret' : unreferenced local variable
ListUtil.xs(249) : warning C4244: 'initializing' : conversion from 'I32' to 'U8', possible loss of data
ListUtil.xs(297) : warning C4244: 'initializing' : conversion from 'I32' to 'U8', possible loss of data
Base64.xs(394) : warning C4146: unary minus operator applied to unsigned type, result still unsigned
Base64.xs(396) : warning C4146: unary minus operator applied to unsigned type, result still unsigned
POSIX.xs(707) : warning C4101: 'charstring' : unreferenced local variable
Storable.xs(4902) : warning C4101: 'mg' : unreferenced local variable
Storable.xs(4934) : warning C4101: 'mg' : unreferenced local variable
Piece.xs(950) : warning C4101: 'ret' : unreferenced local variable
APItest.xs(3069) : warning C4244: 'initializing' : conversion from 'I32' to 'U8', possible loss of data
APItest.xs(3417) : warning C4101: 'tmp' : unreferenced local variable
re_exec.c(4383) : warning C4244: 'initializing' : conversion from 'I32' to 'U8', possible loss of data
re_exec.c(4386) : warning C4244: 'initializing' : conversion from 'I32' to 'U8', possible loss of data
re_comp.c(10756) : warning C4244: '=' : conversion from 'UV' to 'char', possible loss of data
re_comp.c(12168) : warning C4244: '=' : conversion from 'IV' to 'U8', possible loss of data

-- 
Report by Test::Smoke v1.53 build 1374 running on perl 5.15.7
(Reporter v0.050 / Smoker v0.045)




nntp.perl.org: Perl Programming lists via nntp and http.
Comments to Ask Bjørn Hansen at ask@perl.org | Group listing | About