develooper Front page | perl.perl5.porters | Postings from June 2012

Smoke [blead] v5.17.1-208-gcf54f63 FAIL(F) MSWin32 Win2000 SP4 (x86/1 cpu)

From:
George Greer
Date:
June 27, 2012 17:00
Subject:
Smoke [blead] v5.17.1-208-gcf54f63 FAIL(F) MSWin32 Win2000 SP4 (x86/1 cpu)
Message ID:
20120628000039.23CC34E0014@zwei
Smoke logs available at http://m-l.org/~perl/smoke/perl/

Note: Due to a quirk of the virtual machine, build failures are generally
because of timing issues on the VM rather than Perl problems, unless all
of the grid says "M".

Automated smoke report for 5.17.2 patch cf54f63a3f69811725b5ee09265790a038abf829 v5.17.1-208-gcf54f63
perl-win2k: Intel(R) Core(TM) i7 CPU 920 @ 2.67GHz(~2661 MHz) (x86/1 cpu)
    on        MSWin32 - Win2000 SP4
    using     cl version 14.00.50727.762
    smoketime 2 hours 54 minutes (average 43 minutes 36 seconds)

Summary: FAIL(F)

O = OK  F = Failure(s), extended report at the bottom
X = Failure(s) under TEST but not under harness
? = still running or test results not (yet) available
Build failures during:       - = unknown or N/A
c = Configure, m = make, M = make (after miniperl), t = make test-prep

v5.17.1-208-gcf54f63  Configuration (common) none
----------- ---------------------------------------------------------
F F         
O O         -Duseithreads
| +--------- -DDEBUGGING
+----------- no debugging


Locally applied patches:
    uncommitted-changes
    SMOKEcf54f63a3f69811725b5ee09265790a038abf829

Failures: (common-args) none
[default] 
../lib/Benchmark.t..........................................FAILED
    15
    Non-zero exit status: 1

[default] -DDEBUGGING
../cpan/ExtUtils-MakeMaker/t/basic.t........................FAILED
    62
    Non-zero exit status: 1
../cpan/Memoize/t/expmod_t.t................................FAILED
    7

Passed Todo tests: (common-args) none
[default] 
[default] -DDEBUGGING
[default] -Duseithreads
[default] -DDEBUGGING -Duseithreads
../cpan/CGI/t/tmpdir.t......................................PASSED
    3-9

Compiler messages(MSWin32):
op.c(6730) : warning C4244: 'initializing' : conversion from 'U32' to 'const char', possible loss of data
op.c(10840) : warning C4028: formal parameter 1 different from declaration
..\pp.c(5832) : warning C4244: 'function' : conversion from 'U32' to 'const char', possible loss of data
..\pp_hot.c(2687) : warning C4244: 'initializing' : conversion from 'I32' to 'U8', possible loss of data
..\pp_sort.c(1668) : warning C4244: 'initializing' : conversion from 'I32' to 'U8', possible loss of data
..\regexec.c(4349) : warning C4244: 'initializing' : conversion from 'I32' to 'U8', possible loss of data
..\regexec.c(4352) : warning C4244: 'initializing' : conversion from 'I32' to 'U8', possible loss of data
..\toke.c(768) : warning C4244: '=' : conversion from 'U32' to 'U8', possible loss of data
IO.xs(493) : warning C4101: 'ret' : unreferenced local variable
ListUtil.xs(249) : warning C4244: 'initializing' : conversion from 'I32' to 'U8', possible loss of data
ListUtil.xs(297) : warning C4244: 'initializing' : conversion from 'I32' to 'U8', possible loss of data
Base64.xs(394) : warning C4146: unary minus operator applied to unsigned type, result still unsigned
Base64.xs(396) : warning C4146: unary minus operator applied to unsigned type, result still unsigned
POSIX.xs(707) : warning C4101: 'charstring' : unreferenced local variable
scalar.xs(175) : warning C4018: '>' : signed/unsigned mismatch
Piece.xs(950) : warning C4101: 'ret' : unreferenced local variable
APItest.xs(3046) : warning C4244: 'initializing' : conversion from 'I32' to 'U8', possible loss of data
APItest.xs(3370) : warning C4101: 'tmp' : unreferenced local variable
re_exec.c(4349) : warning C4244: 'initializing' : conversion from 'I32' to 'U8', possible loss of data
re_exec.c(4352) : warning C4244: 'initializing' : conversion from 'I32' to 'U8', possible loss of data
# NMAKE : fatal error U1077: 'D:\smoke\perl\blead\build\t\perl.exe' : return code '0x1'
# NMAKE : fatal error U1077: '"C:\Program Files\Microsoft Visual Studio 8\VC\BIN\nmake.EXE"' : return code '0x2'
op.c(10840) : warning C4028: formal parameter 2 different from declaration

-- 
Report by Test::Smoke v1.42 build 1267 running on perl 5.10.0
(Reporter v0.035 / Smoker v0.045)




nntp.perl.org: Perl Programming lists via nntp and http.
Comments to Ask Bjørn Hansen at ask@perl.org | Group listing | About