develooper Front page | perl.perl5.porters | Postings from June 2012

Smoke [5.17.2] v5.17.1-204-g4f8dbb2 FAIL(F) MSWin32 Win7 Home Premium (x86/8 cpu)

From:
Steve Hay
Date:
June 27, 2012 13:40
Subject:
Smoke [5.17.2] v5.17.1-204-g4f8dbb2 FAIL(F) MSWin32 Win7 Home Premium (x86/8 cpu)
Message ID:
342712.40234375-sendEmail@hpwin7
Automated smoke report for 5.17.2 patch 4f8dbb2da2038925c8238010259dcd81d79d7368 v5.17.1-204-g4f8dbb2
HPWIN7: Intel64 Family 6 Model 42 Stepping 7, GenuineIntel (x86/8 cpu)
    on        MSWin32 - Win7 Home Premium (64-bit) SP1
    using     cl version 16.00.40219.01
    smoketime 1 hour 4 minutes (average 32 minutes 23 seconds)

Summary: FAIL(F)

O = OK  F = Failure(s), extended report at the bottom
X = Failure(s) under TEST but not under harness
? = still running or test results not (yet) available
Build failures during:       - = unknown or N/A
c = Configure, m = make, M = make (after miniperl), t = make test-prep

v5.17.1-204-g4f8dbb2  Configuration (common) -DCCTYPE=MSVC100
----------- ---------------------------------------------------------
F F         -Duseithreads -Duselargefiles
| +--------- -DDEBUGGING
+----------- no debugging


Locally applied patches:
    uncommitted-changes
    SMOKE4f8dbb2da2038925c8238010259dcd81d79d7368

Failures: (common-args) -DCCTYPE=MSVC100
[default] -Duseithreads -Duselargefiles
./t/run/fresh_perl.t.......................................FAILED
    84
./t/io/open.t..............................................FAILED
    Non-zero exit status: 5
    Bad plan.  You planned 121 tests but ran 43.
./t/io/utf8.t..............................................FAILED
    Non-zero exit status: 5
    Bad plan.  You planned 55 tests but ran 52.
./t/re/charset.t...........................................FAILED
    Non-zero exit status: 5
    No plan found in TAP output
./t/re/pat_advanced.t......................................FAILED
    Non-zero exit status: 5
    No plan found in TAP output
./t/re/pat_advanced_thr.t..................................FAILED
    Non-zero exit status: 5
    No plan found in TAP output
./t/re/pat_rt_report.t.....................................FAILED
    Non-zero exit status: 5
    Bad plan.  You planned 2521 tests but ran 21.
./t/re/pat_rt_report_thr.t.................................FAILED
    Non-zero exit status: 5
    Bad plan.  You planned 2521 tests but ran 38.
./t/re/pat_special_cc.t....................................FAILED
    Non-zero exit status: 5
    Bad plan.  You planned 9 tests but ran 0.
./t/re/pat_special_cc_thr.t................................FAILED
    Non-zero exit status: 5
    Bad plan.  You planned 9 tests but ran 0.
./t/re/reg_posixcc.t.......................................FAILED
    Non-zero exit status: 5
    No plan found in TAP output
./t/re/regexp.t............................................FAILED
    Non-zero exit status: 5
    Bad plan.  You planned 1683 tests but ran 121.
./t/re/regexp_noamp.t......................................FAILED
    Non-zero exit status: 5
    Bad plan.  You planned 1683 tests but ran 121.
./t/re/regexp_notrie.t.....................................FAILED
    Non-zero exit status: 5
    Bad plan.  You planned 1683 tests but ran 121.
./t/re/regexp_qr.t.........................................FAILED
    Non-zero exit status: 5
    Bad plan.  You planned 1683 tests but ran 121.
./t/re/regexp_qr_embed.t...................................FAILED
    Non-zero exit status: 5
    Bad plan.  You planned 1683 tests but ran 121.
./t/re/regexp_qr_embed_thr.t...............................FAILED
    Non-zero exit status: 5
    Bad plan.  You planned 1683 tests but ran 121.
./t/re/regexp_trielist.t...................................FAILED
    Non-zero exit status: 5
    Bad plan.  You planned 1683 tests but ran 121.
./t/re/uniprops.t..........................................FAILED
    Non-zero exit status: 5
    No plan found in TAP output
./t/op/lc.t................................................FAILED
    Non-zero exit status: 5
    No plan found in TAP output
./t/op/sprintf2.t..........................................FAILED
    1320-1368
./t/op/studytied.t.........................................FAILED
    9
./t/op/taint.t.............................................FAILED
    Non-zero exit status: 5
    Bad plan.  You planned 797 tests but ran 694.
./t/op/tr.t................................................FAILED
    Non-zero exit status: 5
    Bad plan.  You planned 131 tests but ran 107.
./t/op/utfhash.t...........................................FAILED
    Non-zero exit status: 5
    No plan found in TAP output
./t/uni/lower.t............................................FAILED
    Non-zero exit status: 5
    No plan found in TAP output
./t/uni/parser.t...........................................FAILED
    Non-zero exit status: 5
    No plan found in TAP output
./t/uni/title.t............................................FAILED
    Non-zero exit status: 5
    No plan found in TAP output
./t/uni/upper.t............................................FAILED
    Non-zero exit status: 5
    No plan found in TAP output
./t/porting/podcheck.t.....................................FAILED
    Non-zero exit status: 5
    No plan found in TAP output
./cpan/CPAN-Meta-YAML/t/15_multibyte.t.....................FAILED
    Non-zero exit status: 5
    Bad plan.  You planned 10 tests but ran 4.
./cpan/Encode/t/enc_eucjp.t................................FAILED
    Non-zero exit status: 5
    No plan found in TAP output
./cpan/Encode/t/enc_module.t...............................FAILED
    Non-zero exit status: 5
    Bad plan.  You planned 3 tests but ran 0.
./cpan/Encode/t/enc_utf8.t.................................FAILED
    Non-zero exit status: 5
    No plan found in TAP output
./cpan/Encode/t/encoding.t.................................FAILED
    Non-zero exit status: 5
    No plan found in TAP output
./cpan/Encode/t/jperl.t....................................FAILED
    Non-zero exit status: 5
    Bad plan.  You planned 15 tests but ran 7.
./cpan/Encode/t/mime-header.t..............................FAILED
    Non-zero exit status: 5
    Bad plan.  You planned 13 tests but ran 2.
./cpan/ExtUtils-MakeMaker/t/meta_convert.t.................FAILED
    Non-zero exit status: 5
    No plan found in TAP output
./cpan/Pod-Simple/t/corpus.t...............................FAILED
    Non-zero exit status: 5
    Bad plan.  You planned 49 tests but ran 1.
./cpan/Pod-Simple/t/encod02.t..............................FAILED
    Non-zero exit status: 5
    Bad plan.  You planned 4 tests but ran 1.
./cpan/Pod-Simple/t/encod03.t..............................FAILED
    Non-zero exit status: 5
    Bad plan.  You planned 4 tests but ran 1.
./cpan/Test-Harness/t/regression.t.........................FAILED
    Non-zero exit status: 5
    No plan found in TAP output
./cpan/Test-Harness/t/unicode.t............................FAILED
    Non-zero exit status: 5
    No plan found in TAP output
./cpan/podlators/t/man-perlio.t............................FAILED
    Non-zero exit status: 5
    Bad plan.  You planned 7 tests but ran 5.
./cpan/podlators/t/man-utf8.t..............................FAILED
    Non-zero exit status: 5
    Bad plan.  You planned 7 tests but ran 5.
./cpan/podlators/t/man.t...................................FAILED
    Non-zero exit status: 5
    Bad plan.  You planned 33 tests but ran 6.
./cpan/podlators/t/text-encoding.t.........................FAILED
    Non-zero exit status: 5
    Bad plan.  You planned 5 tests but ran 4.
./cpan/podlators/t/text-perlio.t...........................FAILED
    Non-zero exit status: 5
    Bad plan.  You planned 4 tests but ran 2.
./cpan/podlators/t/text-utf8.t.............................FAILED
    Non-zero exit status: 5
    Bad plan.  You planned 4 tests but ran 2.
./dist/B-Deparse/t/deparse.t...............................FAILED
    Non-zero exit status: 5
    No plan found in TAP output
./dist/Data-Dumper/t/dumper.t..............................FAILED
    Non-zero exit status: 5
    No plan found in TAP output
./dist/Locale-Maketext/t/90_utf8.t.........................FAILED
    Non-zero exit status: 5
    Bad plan.  You planned 3 tests but ran 2.
./dist/Safe/t/safeutf8.t...................................FAILED
    Non-zero exit status: 5
    Bad plan.  You planned 7 tests but ran 3.
./dist/Storable/t/downgrade.t..............................FAILED
    Non-zero exit status: 5
    Bad plan.  You planned 169 tests but ran 148.
./dist/Storable/t/utf8hash.t...............................FAILED
    Non-zero exit status: 5
    Bad plan.  You planned 144 tests but ran 23.
./ext/XS-APItest/t/op.t....................................FAILED
    Non-zero exit status: 5
    No plan found in TAP output
./lib/Unicode/UCD.t........................................FAILED
    Non-zero exit status: 5
    No plan found in TAP output
./lib/warnings.t...........................................FAILED
    256

[default] -DDEBUGGING -Duseithreads -Duselargefiles
./t/op/studytied.t.........................................FAILED
    9
./lib/warnings.t...........................................FAILED
    256

Passed Todo tests: (common-args) -DCCTYPE=MSVC100
[default] -Duseithreads -Duselargefiles
[default] -DDEBUGGING -Duseithreads -Duselargefiles
./cpan/CGI/t/tmpdir.t......................................PASSED
    3-9

Compiler messages(MSWin32):
op.c(10840) : warning C4028: formal parameter 1 different from declaration
.\pp_hot.c(2687) : warning C4244: 'initializing' : conversion from 'I32' to 'U8', possible loss of data
.\pp_sort.c(1668) : warning C4244: 'initializing' : conversion from 'I32' to 'U8', possible loss of data
.\regexec.c(4347) : warning C4244: 'initializing' : conversion from 'I32' to 'U8', possible loss of data
.\regexec.c(4350) : warning C4244: 'initializing' : conversion from 'I32' to 'U8', possible loss of data
op.c(10840) : warning C4028: formal parameter 2 different from declaration
IO.xs(493) : warning C4101: 'ret' : unreferenced local variable
ListUtil.xs(249) : warning C4244: 'initializing' : conversion from 'I32' to 'U8', possible loss of data
ListUtil.xs(297) : warning C4244: 'initializing' : conversion from 'I32' to 'U8', possible loss of data
Base64.xs(394) : warning C4146: unary minus operator applied to unsigned type, result still unsigned
Base64.xs(396) : warning C4146: unary minus operator applied to unsigned type, result still unsigned
POSIX.xs(707) : warning C4101: 'charstring' : unreferenced local variable
Piece.xs(950) : warning C4101: 'ret' : unreferenced local variable
APItest.xs(3046) : warning C4244: 'initializing' : conversion from 'I32' to 'U8', possible loss of data
APItest.xs(3370) : warning C4101: 'tmp' : unreferenced local variable
re_exec.c(4347) : warning C4244: 'initializing' : conversion from 'I32' to 'U8', possible loss of data
re_exec.c(4350) : warning C4244: 'initializing' : conversion from 'I32' to 'U8', possible loss of data

-- 
Report by Test::Smoke v1.47 build 1309 running on perl 5.15.7
(Reporter v0.035 / Smoker v0.045)




nntp.perl.org: Perl Programming lists via nntp and http.
Comments to Ask Bjørn Hansen at ask@perl.org | Group listing | About