develooper Front page | perl.perl5.porters | Postings from June 2012

Smoke [blead] v5.17.1-205-g1fa930f FAIL(F) linux 3.2.0-25-generic [debian] (x86_64/8 cpu)

From:
George Greer
Date:
June 27, 2012 13:34
Subject:
Smoke [blead] v5.17.1-205-g1fa930f FAIL(F) linux 3.2.0-25-generic [debian] (x86_64/8 cpu)
Message ID:
201206272034.q5RKYNQc005475@m-l.org
Smoke logs available at http://m-l.org/~perl/smoke/perl/

Automated smoke report for 5.17.2 patch 1fa930f22a3485f9bb86d555541c3ac82dc767b6 v5.17.1-205-g1fa930f
zwei: Intel(R) Core(TM) i7 CPU 920 @ 2.67GHz (GenuineIntel 2668MHz) (x86_64/8 cpu)
    on        linux - 3.2.0-25-generic [debian]
    using     clang version 4.2.1 Compatible Ubuntu Clang 3.0 (tags/RELEASE_30/final)
    smoketime 47 minutes 6 seconds (average 11 minutes 46 seconds)

Summary: FAIL(F)

O = OK  F = Failure(s), extended report at the bottom
X = Failure(s) under TEST but not under harness
? = still running or test results not (yet) available
Build failures during:       - = unknown or N/A
c = Configure, m = make, M = make (after miniperl), t = make test-prep

v5.17.1-205-g1fa930f  Configuration (common) -A -Dcc=clang append:ccflags=" -fcatch-undefined-behavior -DPERL_POISON "
----------- ---------------------------------------------------------
F F O O     
F F O O     -Duseithreads
| +--------- -DDEBUGGING
+----------- no debugging


Locally applied patches:
    uncommitted-changes
    SMOKE1fa930f22a3485f9bb86d555541c3ac82dc767b6

Testsuite was run only with 'harness'

Failures: (common-args) -A -Dcc=clang append:ccflags=" -fcatch-undefined-behavior -DPERL_POISON "
[default] 
../t/run/fresh_perl.t.......................................FAILED
    84
../t/io/open.t..............................................FAILED
    Bad plan.  You planned 121 tests but ran 43.
../t/re/pat_special_cc.t....................................FAILED
    Bad plan.  You planned 9 tests but ran 0.
../t/io/utf8.t..............................................FAILED
    Bad plan.  You planned 55 tests but ran 52.
../t/re/pat_rt_report.t.....................................FAILED
    Bad plan.  You planned 2521 tests but ran 21.
../t/re/pat_advanced.t......................................FAILED
    No plan found in TAP output
../t/re/reg_posixcc.t.......................................FAILED
    No plan found in TAP output
../t/re/regexp.t............................................FAILED
    Bad plan.  You planned 1683 tests but ran 121.
../t/re/regexp_noamp.t......................................FAILED
    Bad plan.  You planned 1683 tests but ran 121.
../t/re/regexp_notrie.t.....................................FAILED
    Bad plan.  You planned 1683 tests but ran 121.
../t/re/regexp_qr.t.........................................FAILED
    Bad plan.  You planned 1683 tests but ran 121.
../t/re/regexp_qr_embed.t...................................FAILED
    Bad plan.  You planned 1683 tests but ran 121.
../t/re/regexp_trielist.t...................................FAILED
    Bad plan.  You planned 1683 tests but ran 121.
../t/re/charset.t...........................................FAILED
    No plan found in TAP output
../t/re/uniprops.t..........................................FAILED
    No plan found in TAP output
../t/op/lc.t................................................FAILED
    No plan found in TAP output
../t/op/tr.t................................................FAILED
    Bad plan.  You planned 131 tests but ran 107.
../t/op/utfhash.t...........................................FAILED
    No plan found in TAP output
../t/op/sprintf2.t..........................................FAILED
    1320-1368
../t/op/taint.t.............................................FAILED
    Bad plan.  You planned 797 tests but ran 694.
../t/uni/lower.t............................................FAILED
    No plan found in TAP output
../t/uni/parser.t...........................................FAILED
    No plan found in TAP output
../t/uni/title.t............................................FAILED
    No plan found in TAP output
../t/uni/upper.t............................................FAILED
    No plan found in TAP output
../t/porting/podcheck.t.....................................FAILED
    No plan found in TAP output
../cpan/Encode/t/enc_eucjp.t................................FAILED
    No plan found in TAP output
../cpan/Encode/t/enc_module.t...............................FAILED
    Bad plan.  You planned 3 tests but ran 0.
../cpan/Encode/t/enc_utf8.t.................................FAILED
    No plan found in TAP output
../cpan/CPAN-Meta-YAML/t/15_multibyte.t.....................FAILED
    Bad plan.  You planned 10 tests but ran 4.
../cpan/Pod-Simple/t/corpus.t...............................FAILED
    Bad plan.  You planned 49 tests but ran 1.
../cpan/Encode/t/encoding.t.................................FAILED
    No plan found in TAP output
../cpan/Pod-Simple/t/encod02.t..............................FAILED
    Bad plan.  You planned 4 tests but ran 1.
../cpan/Pod-Simple/t/encod03.t..............................FAILED
    Bad plan.  You planned 4 tests but ran 1.
../cpan/Encode/t/jperl.t....................................FAILED
    Bad plan.  You planned 15 tests but ran 7.
../cpan/Encode/t/mime-header.t..............................FAILED
    Bad plan.  You planned 13 tests but ran 2.
../dist/B-Deparse/t/deparse.t...............................FAILED
    No plan found in TAP output
../cpan/podlators/t/man-perlio.t............................FAILED
    Bad plan.  You planned 7 tests but ran 5.
../cpan/podlators/t/man-utf8.t..............................FAILED
    Bad plan.  You planned 7 tests but ran 5.
../cpan/podlators/t/man.t...................................FAILED
    Bad plan.  You planned 33 tests but ran 6.
../dist/Data-Dumper/t/dumper.t..............................FAILED
    No plan found in TAP output
../cpan/ExtUtils-MakeMaker/t/meta_convert.t.................FAILED
    No plan found in TAP output
../cpan/podlators/t/text-encoding.t.........................FAILED
    Bad plan.  You planned 5 tests but ran 4.
../cpan/podlators/t/text-perlio.t...........................FAILED
    Bad plan.  You planned 4 tests but ran 2.
../cpan/podlators/t/text-utf8.t.............................FAILED
    Bad plan.  You planned 4 tests but ran 2.
../dist/Locale-Maketext/t/90_utf8.t.........................FAILED
    Bad plan.  You planned 3 tests but ran 2.
../dist/Storable/t/downgrade.t..............................FAILED
    Bad plan.  You planned 169 tests but ran 148.
../dist/Safe/t/safeutf8.t...................................FAILED
    Bad plan.  You planned 7 tests but ran 3.
../cpan/Test-Harness/t/regression.t.........................FAILED
    No plan found in TAP output
../dist/Storable/t/utf8hash.t...............................FAILED
    Bad plan.  You planned 144 tests but ran 23.
../lib/Unicode/UCD.t........................................FAILED
    No plan found in TAP output
../cpan/Test-Harness/t/unicode.t............................FAILED
    No plan found in TAP output
../ext/XS-APItest/t/op.t....................................FAILED
    No plan found in TAP output

[minitest] 
[minitest] -Duseithreads
    t/run/fresh_perl ............... FAILED at test 84
    t/io/open ...................... FAILED--expected 121 tests, saw 43
    t/io/utf8 ...................... FAILED--expected 55 tests, saw 52
    t/re/charset ................... FAILED--no leader found
    t/re/pat_special_cc ............ FAILED--expected 9 tests, saw 0
    t/re/reg_posixcc ............... FAILED--no leader found
    t/re/regexp .................... FAILED--expected 1683 tests, saw 121
    t/re/regexp_noamp .............. FAILED--expected 1683 tests, saw 121
    t/re/regexp_notrie ............. FAILED--expected 1683 tests, saw 121
    t/re/regexp_qr ................. FAILED--expected 1683 tests, saw 121
    t/re/regexp_qr_embed ........... FAILED--expected 1683 tests, saw 121
    t/re/regexp_trielist ........... FAILED--expected 1683 tests, saw 121
    t/re/uniprops .................. FAILED--no leader found
    t/op/lc ........................ FAILED--no leader found
    t/op/sprintf2 .................. FAILED at test 1320
    t/op/utfhash ................... FAILED--no leader found
    t/uni/lower .................... FAILED--no leader found
    t/uni/parser ................... FAILED--no leader found
    t/uni/title .................... FAILED--no leader found
    t/uni/upper .................... FAILED--no leader found

[default] -Duseithreads
../t/io/open.t..............................................FAILED
    Bad plan.  You planned 121 tests but ran 43.
../t/run/fresh_perl.t.......................................FAILED
    84
../t/io/utf8.t..............................................FAILED
    Bad plan.  You planned 55 tests but ran 52.
../t/re/pat_special_cc.t....................................FAILED
    Bad plan.  You planned 9 tests but ran 0.
../t/re/pat_special_cc_thr.t................................FAILED
    Bad plan.  You planned 9 tests but ran 0.
../t/re/pat_rt_report.t.....................................FAILED
    Bad plan.  You planned 2521 tests but ran 21.
../t/re/pat_rt_report_thr.t.................................FAILED
    Bad plan.  You planned 2521 tests but ran 38.
../t/re/pat_advanced.t......................................FAILED
    No plan found in TAP output
../t/re/pat_advanced_thr.t..................................FAILED
    No plan found in TAP output
../t/re/reg_posixcc.t.......................................FAILED
    No plan found in TAP output
../t/re/charset.t...........................................FAILED
    No plan found in TAP output
../t/re/regexp.t............................................FAILED
    Bad plan.  You planned 1683 tests but ran 121.
../t/re/regexp_noamp.t......................................FAILED
    Bad plan.  You planned 1683 tests but ran 121.
../t/re/regexp_notrie.t.....................................FAILED
    Bad plan.  You planned 1683 tests but ran 121.
../t/re/regexp_qr.t.........................................FAILED
    Bad plan.  You planned 1683 tests but ran 121.
../t/re/regexp_qr_embed.t...................................FAILED
    Bad plan.  You planned 1683 tests but ran 121.
../t/re/regexp_trielist.t...................................FAILED
    Bad plan.  You planned 1683 tests but ran 121.
../t/re/uniprops.t..........................................FAILED
    No plan found in TAP output
../t/op/lc.t................................................FAILED
    No plan found in TAP output
../t/re/regexp_qr_embed_thr.t...............................FAILED
    Bad plan.  You planned 1683 tests but ran 121.
../t/op/tr.t................................................FAILED
    Bad plan.  You planned 131 tests but ran 107.
../t/op/utfhash.t...........................................FAILED
    No plan found in TAP output
../t/op/taint.t.............................................FAILED
    Bad plan.  You planned 797 tests but ran 694.
../t/op/sprintf2.t..........................................FAILED
    1320-1368
../t/uni/lower.t............................................FAILED
    No plan found in TAP output
../t/uni/parser.t...........................................FAILED
    No plan found in TAP output
../t/uni/title.t............................................FAILED
    No plan found in TAP output
../t/uni/upper.t............................................FAILED
    No plan found in TAP output
../t/porting/podcheck.t.....................................FAILED
    No plan found in TAP output
../cpan/Encode/t/enc_eucjp.t................................FAILED
    No plan found in TAP output
../cpan/Encode/t/enc_module.t...............................FAILED
    Bad plan.  You planned 3 tests but ran 0.
../cpan/Encode/t/enc_utf8.t.................................FAILED
    No plan found in TAP output
../cpan/CPAN-Meta-YAML/t/15_multibyte.t.....................FAILED
    Bad plan.  You planned 10 tests but ran 4.
../cpan/Encode/t/encoding.t.................................FAILED
    No plan found in TAP output
../cpan/Pod-Simple/t/corpus.t...............................FAILED
    Bad plan.  You planned 49 tests but ran 1.
../cpan/Pod-Simple/t/encod02.t..............................FAILED
    Bad plan.  You planned 4 tests but ran 1.
../cpan/Pod-Simple/t/encod03.t..............................FAILED
    Bad plan.  You planned 4 tests but ran 1.
../cpan/Encode/t/jperl.t....................................FAILED
    Bad plan.  You planned 15 tests but ran 7.
../cpan/Encode/t/mime-header.t..............................FAILED
    Bad plan.  You planned 13 tests but ran 2.
../cpan/podlators/t/man-perlio.t............................FAILED
    Bad plan.  You planned 7 tests but ran 5.
../cpan/podlators/t/man-utf8.t..............................FAILED
    Bad plan.  You planned 7 tests but ran 5.
../cpan/podlators/t/man.t...................................FAILED
    Bad plan.  You planned 33 tests but ran 6.
../cpan/ExtUtils-MakeMaker/t/meta_convert.t.................FAILED
    No plan found in TAP output
../cpan/podlators/t/text-encoding.t.........................FAILED
    Bad plan.  You planned 5 tests but ran 4.
../dist/B-Deparse/t/deparse.t...............................FAILED
    No plan found in TAP output
../dist/Data-Dumper/t/dumper.t..............................FAILED
    No plan found in TAP output
../cpan/podlators/t/text-perlio.t...........................FAILED
    Bad plan.  You planned 4 tests but ran 2.
../cpan/podlators/t/text-utf8.t.............................FAILED
    Bad plan.  You planned 4 tests but ran 2.
../dist/Locale-Maketext/t/90_utf8.t.........................FAILED
    Bad plan.  You planned 3 tests but ran 2.
../dist/Storable/t/downgrade.t..............................FAILED
    Bad plan.  You planned 169 tests but ran 148.
../dist/Safe/t/safeutf8.t...................................FAILED
    Bad plan.  You planned 7 tests but ran 3.
../dist/Storable/t/utf8hash.t...............................FAILED
    Bad plan.  You planned 144 tests but ran 23.
../cpan/Test-Harness/t/regression.t.........................FAILED
    No plan found in TAP output
../cpan/Test-Harness/t/unicode.t............................FAILED
    No plan found in TAP output
../lib/Unicode/UCD.t........................................FAILED
    No plan found in TAP output
../ext/XS-APItest/t/op.t....................................FAILED
    No plan found in TAP output

Passed Todo tests: (common-args) -A -Dcc=clang append:ccflags=" -fcatch-undefined-behavior -DPERL_POISON "
[default] 
[default] -DDEBUGGING
[default] -Duseithreads
[default] -DDEBUGGING -Duseithreads
../cpan/CGI/t/tmpdir.t......................................PASSED
    3-9

Compiler messages(gcc):
scope.c:691:68: warning: conversion specifies type 'long' but the argument has type 'I32' (aka 'int') [-Wformat]
scope.c:691:72: warning: conversion specifies type 'long' but the argument has type 'I32' (aka 'int') [-Wformat]
perlio.c:5194:21: warning: comparison of integers of different signs: 'size_t' (aka 'unsigned long') and 'int' [-Wsign-compare]
utf8.c:1695:20: warning: implicit conversion from 'int' to 'U8' (aka 'unsigned char') changes value from 65533 to 253 [-Wconstant-conversion]
pp.c:3458:22: warning: implicit conversion from 'int' to 'U8' (aka 'unsigned char') changes value from 65533 to 253 [-Wconstant-conversion]
pp.c:3772:12: warning: implicit conversion from 'int' to 'U8' (aka 'unsigned char') changes value from 65533 to 253 [-Wconstant-conversion]
pp.c:3980:12: warning: implicit conversion from 'int' to 'U8' (aka 'unsigned char') changes value from 65533 to 253 [-Wconstant-conversion]
pp.c:4208:26: warning: implicit conversion from 'int' to 'U8' (aka 'unsigned char') changes value from 65533 to 253 [-Wconstant-conversion]
Zlib.xs:620:5: warning: expression result unused [-Wunused-value]
./const-c.inc:47:2: warning: expression result unused [-Wunused-value]
./const-c.inc:81:5: warning: expression result unused [-Wunused-value]
Glob.xs:100:2: warning: expression result unused [-Wunused-value]
Glob.xs:108:6: warning: expression result unused [-Wunused-value]
Util.xs:55:9: warning: expression result unused [-Wunused-value]
Bzip2.xs:326:5: warning: expression result unused [-Wunused-value]
mro.xs:120:7: warning: expression result unused [-Wunused-value]
./const-c.inc:38:2: warning: expression result unused [-Wunused-value]
./const-c.inc:73:5: warning: expression result unused [-Wunused-value]
Call.xs:62:58: warning: conversion specifies type 'int' but the argument has type 'STRLEN' (aka 'unsigned long') [-Wformat]
Call.xs:62:78: warning: conversion specifies type 'int' but the argument has type 'STRLEN' (aka 'unsigned long') [-Wformat]
Call.xs:99:53: warning: conversion specifies type 'int' but the argument has type 'STRLEN' (aka 'unsigned long') [-Wformat]
Call.xs:155:46: warning: conversion specifies type 'int' but the argument has type 'STRLEN' (aka 'unsigned long') [-Wformat]
Call.xs:174:57: warning: conversion specifies type 'int' but the argument has type 'STRLEN' (aka 'unsigned long') [-Wformat]
scalar.xs:48:5: warning: expression result unused [-Wunused-value]
Storable.xs:1799:3: warning: expression result unused [-Wunused-value]
./const-c.inc:72:5: warning: expression result unused [-Wunused-value]
Opcode.xs:268:9: warning: expression result unused [-Wunused-value]
Storable.xs:4040:2: warning: null passed to a callee which requires a non-null argument [-Wnonnull]
Storable.xs:4227:10: warning: null passed to a callee which requires a non-null argument [-Wnonnull]
re_comp.c:5115:2: warning: expression result unused [-Wunused-value]
Storable.xs:4477:2: warning: expression result unused [-Wunused-value]
re_exec.c:2674:2: warning: expression result unused [-Wunused-value]
Typemap.xs:179:46: warning: conversion specifies type 'unsigned int' but the argument has type 'UV' (aka 'unsigned long') [-Wformat]
Typemap.xs:265:3: warning: expression result unused [-Wunused-value]
Typemap.xs:287:3: warning: expression result unused [-Wunused-value]
Typemap.xs:310:3: warning: expression result unused [-Wunused-value]
Typemap.xs:333:3: warning: expression result unused [-Wunused-value]
Typemap.xs:356:3: warning: expression result unused [-Wunused-value]
Storable.xs:5362:3: warning: expression result unused [-Wunused-value]
re_comp.c:5520:3: warning: expression result unused [-Wunused-value]
Storable.xs:5409:2: warning: expression result unused [-Wunused-value]
Storable.xs:5449:2: warning: null passed to a callee which requires a non-null argument [-Wnonnull]
Storable.xs:5512:2: warning: null passed to a callee which requires a non-null argument [-Wnonnull]
Storable.xs:5823:4: warning: expression result unused [-Wunused-value]
Storable.xs:5864:3: warning: expression result unused [-Wunused-value]
Storable.xs:6023:5: warning: expression result unused [-Wunused-value]
re_comp.c:5685:6: warning: expression result unused [-Wunused-value]
re_exec.c:4549:3: warning: expression result unused [-Wunused-value]
re_exec.c:4565:6: warning: expression result unused [-Wunused-value]
re_exec.c:4583:6: warning: expression result unused [-Wunused-value]
re_exec.c:5614:3: warning: expression result unused [-Wunused-value]
APItest.xs:112:5: warning: expression result unused [-Wunused-value]
APItest.xs:1508:2: warning: expression result unused [-Wunused-value]
APItest.xs:2212:2: warning: expression result unused [-Wunused-value]
Collate.xs:611:2: warning: expression result unused [-Wunused-value]
Collate.xs:601:2: warning: expression result unused [-Wunused-value]
Unicode.xs:176:6: warning: expression result unused [-Wunused-value]
Unicode.xs:334:6: warning: expression result unused [-Wunused-value]
ExtTest.xs:44:2: warning: expression result unused [-Wunused-value]
ExtTest.xs:78:5: warning: expression result unused [-Wunused-value]
-- 
Report by Test::Smoke v1.44 build 1285 running on perl 5.14.2
(Reporter v0.035 / Smoker v0.045)




nntp.perl.org: Perl Programming lists via nntp and http.
Comments to Ask Bjørn Hansen at ask@perl.org | Group listing | About