develooper Front page | perl.perl5.porters | Postings from June 2012

Smoke [blead] v5.17.1-205-g1fa930f FAIL(F) linux 3.2.0-25-generic [debian] (x86_64/8 cpu)

From:
George Greer
Date:
June 27, 2012 13:31
Subject:
Smoke [blead] v5.17.1-205-g1fa930f FAIL(F) linux 3.2.0-25-generic [debian] (x86_64/8 cpu)
Message ID:
201206272031.q5RKVKlX005326@m-l.org
Smoke logs available at http://m-l.org/~perl/smoke/perl/

Automated smoke report for 5.17.2 patch 1fa930f22a3485f9bb86d555541c3ac82dc767b6 v5.17.1-205-g1fa930f
zwei: Intel(R) Core(TM) i7 CPU 920 @ 2.67GHz (GenuineIntel 2668MHz) (x86_64/8 cpu)
    on        linux - 3.2.0-25-generic [debian]
    using     g++ version 4.6.3
    smoketime 43 minutes 35 seconds (average 10 minutes 54 seconds)

Summary: FAIL(F)

O = OK  F = Failure(s), extended report at the bottom
X = Failure(s) under TEST but not under harness
? = still running or test results not (yet) available
Build failures during:       - = unknown or N/A
c = Configure, m = make, M = make (after miniperl), t = make test-prep

v5.17.1-205-g1fa930f  Configuration (common) -Accflags=-DPERL_POISON -Dcc=g++
----------- ---------------------------------------------------------
F F O O     
F F O O     -Duseithreads
| +--------- -DDEBUGGING
+----------- no debugging


Locally applied patches:
    uncommitted-changes
    SMOKE1fa930f22a3485f9bb86d555541c3ac82dc767b6

Testsuite was run only with 'harness'

Failures: (common-args) -Accflags=-DPERL_POISON -Dcc=g++
[default] 
../t/run/fresh_perl.t.......................................FAILED
    84
../t/io/open.t..............................................FAILED
    Bad plan.  You planned 121 tests but ran 43.
../t/re/pat_special_cc.t....................................FAILED
    Bad plan.  You planned 9 tests but ran 0.
../t/io/utf8.t..............................................FAILED
    Bad plan.  You planned 55 tests but ran 52.
../t/re/pat_rt_report.t.....................................FAILED
    Bad plan.  You planned 2521 tests but ran 21.
../t/re/pat_advanced.t......................................FAILED
    No plan found in TAP output
../t/re/reg_posixcc.t.......................................FAILED
    No plan found in TAP output
../t/re/regexp.t............................................FAILED
    Bad plan.  You planned 1683 tests but ran 121.
../t/re/regexp_noamp.t......................................FAILED
    Bad plan.  You planned 1683 tests but ran 121.
../t/re/regexp_notrie.t.....................................FAILED
    Bad plan.  You planned 1683 tests but ran 121.
../t/re/regexp_qr.t.........................................FAILED
    Bad plan.  You planned 1683 tests but ran 121.
../t/re/regexp_qr_embed.t...................................FAILED
    Bad plan.  You planned 1683 tests but ran 121.
../t/re/regexp_trielist.t...................................FAILED
    Bad plan.  You planned 1683 tests but ran 121.
../t/re/charset.t...........................................FAILED
    No plan found in TAP output
../t/re/uniprops.t..........................................FAILED
    No plan found in TAP output
../t/op/lc.t................................................FAILED
    No plan found in TAP output
../t/op/tr.t................................................FAILED
    Bad plan.  You planned 131 tests but ran 107.
../t/op/utfhash.t...........................................FAILED
    No plan found in TAP output
../t/op/taint.t.............................................FAILED
    Bad plan.  You planned 797 tests but ran 694.
../t/op/sprintf2.t..........................................FAILED
    1320-1368
../t/uni/lower.t............................................FAILED
    No plan found in TAP output
../t/uni/parser.t...........................................FAILED
    No plan found in TAP output
../t/uni/title.t............................................FAILED
    No plan found in TAP output
../t/uni/upper.t............................................FAILED
    No plan found in TAP output
../t/porting/podcheck.t.....................................FAILED
    No plan found in TAP output
../cpan/Encode/t/enc_eucjp.t................................FAILED
    No plan found in TAP output
../cpan/Encode/t/enc_module.t...............................FAILED
    Bad plan.  You planned 3 tests but ran 0.
../cpan/Encode/t/enc_utf8.t.................................FAILED
    No plan found in TAP output
../cpan/CPAN-Meta-YAML/t/15_multibyte.t.....................FAILED
    Bad plan.  You planned 10 tests but ran 4.
../cpan/Encode/t/encoding.t.................................FAILED
    No plan found in TAP output
../cpan/Pod-Simple/t/corpus.t...............................FAILED
    Bad plan.  You planned 49 tests but ran 1.
../cpan/Pod-Simple/t/encod02.t..............................FAILED
    Bad plan.  You planned 4 tests but ran 1.
../cpan/Pod-Simple/t/encod03.t..............................FAILED
    Bad plan.  You planned 4 tests but ran 1.
../cpan/Encode/t/jperl.t....................................FAILED
    Bad plan.  You planned 15 tests but ran 7.
../cpan/Encode/t/mime-header.t..............................FAILED
    Bad plan.  You planned 13 tests but ran 2.
../cpan/ExtUtils-MakeMaker/t/meta_convert.t.................FAILED
    No plan found in TAP output
../cpan/podlators/t/man-perlio.t............................FAILED
    Bad plan.  You planned 7 tests but ran 5.
../cpan/podlators/t/man-utf8.t..............................FAILED
    Bad plan.  You planned 7 tests but ran 5.
../cpan/podlators/t/man.t...................................FAILED
    Bad plan.  You planned 33 tests but ran 6.
../dist/B-Deparse/t/deparse.t...............................FAILED
    No plan found in TAP output
../cpan/podlators/t/text-encoding.t.........................FAILED
    Bad plan.  You planned 5 tests but ran 4.
../dist/Data-Dumper/t/dumper.t..............................FAILED
    No plan found in TAP output
../cpan/podlators/t/text-perlio.t...........................FAILED
    Bad plan.  You planned 4 tests but ran 2.
../cpan/podlators/t/text-utf8.t.............................FAILED
    Bad plan.  You planned 4 tests but ran 2.
../dist/Locale-Maketext/t/90_utf8.t.........................FAILED
    Bad plan.  You planned 3 tests but ran 2.
../dist/Storable/t/downgrade.t..............................FAILED
    Bad plan.  You planned 169 tests but ran 148.
../dist/Safe/t/safeutf8.t...................................FAILED
    Bad plan.  You planned 7 tests but ran 3.
../dist/Storable/t/utf8hash.t...............................FAILED
    Bad plan.  You planned 144 tests but ran 23.
../cpan/Test-Harness/t/regression.t.........................FAILED
    No plan found in TAP output
../lib/Unicode/UCD.t........................................FAILED
    No plan found in TAP output
../cpan/Test-Harness/t/unicode.t............................FAILED
    No plan found in TAP output
../ext/XS-APItest/t/op.t....................................FAILED
    No plan found in TAP output

[minitest] 
[minitest] -Duseithreads
    t/run/fresh_perl ............... FAILED at test 84
    t/io/open ...................... FAILED--expected 121 tests, saw 43
    t/io/utf8 ...................... FAILED--expected 55 tests, saw 52
    t/re/charset ................... FAILED--no leader found
    t/re/pat_special_cc ............ FAILED--expected 9 tests, saw 0
    t/re/reg_posixcc ............... FAILED--no leader found
    t/re/regexp .................... FAILED--expected 1683 tests, saw 121
    t/re/regexp_noamp .............. FAILED--expected 1683 tests, saw 121
    t/re/regexp_notrie ............. FAILED--expected 1683 tests, saw 121
    t/re/regexp_qr ................. FAILED--expected 1683 tests, saw 121
    t/re/regexp_qr_embed ........... FAILED--expected 1683 tests, saw 121
    t/re/regexp_trielist ........... FAILED--expected 1683 tests, saw 121
    t/re/uniprops .................. FAILED--no leader found
    t/op/lc ........................ FAILED--no leader found
    t/op/sprintf2 .................. FAILED at test 1320
    t/op/utfhash ................... FAILED--no leader found
    t/uni/lower .................... FAILED--no leader found
    t/uni/parser ................... FAILED--no leader found
    t/uni/title .................... FAILED--no leader found
    t/uni/upper .................... FAILED--no leader found

[default] -Duseithreads
../t/run/fresh_perl.t.......................................FAILED
    84
../t/io/open.t..............................................FAILED
    Bad plan.  You planned 121 tests but ran 43.
../t/io/utf8.t..............................................FAILED
    Bad plan.  You planned 55 tests but ran 52.
../t/re/pat_special_cc.t....................................FAILED
    Bad plan.  You planned 9 tests but ran 0.
../t/re/pat_rt_report.t.....................................FAILED
    Bad plan.  You planned 2521 tests but ran 21.
../t/re/pat_special_cc_thr.t................................FAILED
    Bad plan.  You planned 9 tests but ran 0.
../t/re/pat_rt_report_thr.t.................................FAILED
    Bad plan.  You planned 2521 tests but ran 38.
../t/re/pat_advanced.t......................................FAILED
    No plan found in TAP output
../t/re/pat_advanced_thr.t..................................FAILED
    No plan found in TAP output
../t/re/reg_posixcc.t.......................................FAILED
    No plan found in TAP output
../t/re/charset.t...........................................FAILED
    No plan found in TAP output
../t/re/regexp.t............................................FAILED
    Bad plan.  You planned 1683 tests but ran 121.
../t/re/regexp_noamp.t......................................FAILED
    Bad plan.  You planned 1683 tests but ran 121.
../t/re/regexp_notrie.t.....................................FAILED
    Bad plan.  You planned 1683 tests but ran 121.
../t/re/regexp_qr.t.........................................FAILED
    Bad plan.  You planned 1683 tests but ran 121.
../t/re/regexp_qr_embed.t...................................FAILED
    Bad plan.  You planned 1683 tests but ran 121.
../t/re/regexp_trielist.t...................................FAILED
    Bad plan.  You planned 1683 tests but ran 121.
../t/re/uniprops.t..........................................FAILED
    No plan found in TAP output
../t/re/regexp_qr_embed_thr.t...............................FAILED
    Bad plan.  You planned 1683 tests but ran 121.
../t/op/lc.t................................................FAILED
    No plan found in TAP output
../t/op/tr.t................................................FAILED
    Bad plan.  You planned 131 tests but ran 107.
../t/op/utfhash.t...........................................FAILED
    No plan found in TAP output
../t/op/sprintf2.t..........................................FAILED
    1320-1368
../t/op/taint.t.............................................FAILED
    Bad plan.  You planned 797 tests but ran 694.
../t/uni/lower.t............................................FAILED
    No plan found in TAP output
../t/uni/parser.t...........................................FAILED
    No plan found in TAP output
../t/uni/title.t............................................FAILED
    No plan found in TAP output
../t/uni/upper.t............................................FAILED
    No plan found in TAP output
../t/porting/podcheck.t.....................................FAILED
    No plan found in TAP output
../cpan/Encode/t/enc_eucjp.t................................FAILED
    No plan found in TAP output
../cpan/Encode/t/enc_module.t...............................FAILED
    Bad plan.  You planned 3 tests but ran 0.
../cpan/Encode/t/enc_utf8.t.................................FAILED
    No plan found in TAP output
../cpan/CPAN-Meta-YAML/t/15_multibyte.t.....................FAILED
    Bad plan.  You planned 10 tests but ran 4.
../cpan/Encode/t/encoding.t.................................FAILED
    No plan found in TAP output
../cpan/Pod-Simple/t/corpus.t...............................FAILED
    Bad plan.  You planned 49 tests but ran 1.
../cpan/Pod-Simple/t/encod02.t..............................FAILED
    Bad plan.  You planned 4 tests but ran 1.
../cpan/Pod-Simple/t/encod03.t..............................FAILED
    Bad plan.  You planned 4 tests but ran 1.
../cpan/Encode/t/jperl.t....................................FAILED
    Bad plan.  You planned 15 tests but ran 7.
../cpan/Encode/t/mime-header.t..............................FAILED
    Bad plan.  You planned 13 tests but ran 2.
../cpan/ExtUtils-MakeMaker/t/meta_convert.t.................FAILED
    No plan found in TAP output
../cpan/podlators/t/man-perlio.t............................FAILED
    Bad plan.  You planned 7 tests but ran 5.
../cpan/podlators/t/man-utf8.t..............................FAILED
    Bad plan.  You planned 7 tests but ran 5.
../dist/B-Deparse/t/deparse.t...............................FAILED
    No plan found in TAP output
../cpan/podlators/t/man.t...................................FAILED
    Bad plan.  You planned 33 tests but ran 6.
../dist/Data-Dumper/t/dumper.t..............................FAILED
    No plan found in TAP output
../cpan/podlators/t/text-encoding.t.........................FAILED
    Bad plan.  You planned 5 tests but ran 4.
../cpan/podlators/t/text-perlio.t...........................FAILED
    Bad plan.  You planned 4 tests but ran 2.
../cpan/podlators/t/text-utf8.t.............................FAILED
    Bad plan.  You planned 4 tests but ran 2.
../dist/Locale-Maketext/t/90_utf8.t.........................FAILED
    Bad plan.  You planned 3 tests but ran 2.
../dist/Storable/t/downgrade.t..............................FAILED
    Bad plan.  You planned 169 tests but ran 148.
../dist/Safe/t/safeutf8.t...................................FAILED
    Bad plan.  You planned 7 tests but ran 3.
../dist/Storable/t/utf8hash.t...............................FAILED
    Bad plan.  You planned 144 tests but ran 23.
../cpan/Test-Harness/t/regression.t.........................FAILED
    No plan found in TAP output
../cpan/Test-Harness/t/unicode.t............................FAILED
    No plan found in TAP output
../lib/Unicode/UCD.t........................................FAILED
    No plan found in TAP output
../ext/XS-APItest/t/op.t....................................FAILED
    No plan found in TAP output

Passed Todo tests: (common-args) -Accflags=-DPERL_POISON -Dcc=g++
[default] 
[default] -DDEBUGGING
[default] -Duseithreads
[default] -DDEBUGGING -Duseithreads
../cpan/CGI/t/tmpdir.t......................................PASSED
    3-9

Compiler messages(gcc):
try.c: In function ‘int main()’:
try.c:36:10: warning: ignoring return value of ‘int pipe(int*)’, declared with attribute warn_unused_result [-Wunused-result]
try.c:37:10: warning: ignoring return value of ‘int pipe(int*)’, declared with attribute warn_unused_result [-Wunused-result]
try.c:53:35: warning: ignoring return value of ‘ssize_t write(int, const void*, size_t)’, declared with attribute warn_unused_result [-Wunused-result]
try.c:66:23: warning: ignoring return value of ‘ssize_t write(int, const void*, size_t)’, declared with attribute warn_unused_result [-Wunused-result]
try.c:72:35: warning: ignoring return value of ‘ssize_t write(int, const void*, size_t)’, declared with attribute warn_unused_result [-Wunused-result]
try.c:78:21: warning: ignoring return value of ‘ssize_t read(int, void*, size_t)’, declared with attribute warn_unused_result [-Wunused-result]
util.c: In function ‘char* S_write_no_mem()’:
util.c:68:34: warning: ignoring return value of ‘ssize_t write(int, const void*, size_t)’, declared with attribute warn_unused_result [-Wunused-result]
sv.c: In function ‘void Perl_sv_vcatpvfn(SV*, const char*, STRLEN, __va_list_tag (*)[1], SV**, I32, bool*)’:
sv.c:10128:41: warning: ignoring return value of ‘char* gcvt(double, int, char*)’, declared with attribute warn_unused_result [-Wunused-result]
sv.c:10977:53: warning: ignoring return value of ‘char* gcvt(double, int, char*)’, declared with attribute warn_unused_result [-Wunused-result]
regexec.c: In function ‘I32 S_regmatch(regmatch_info*, regnode*)’:
regexec.c:3965:7: warning: variable ‘throw_away’ set but not used [-Wunused-but-set-variable]
regexec.c:3965:1: warning: variable ‘throw_away’ set but not used [-Wunused-but-set-variable]
perlio.c: In function ‘void S_more_refcounted_fds(int)’:
perlio.c:2354:38: warning: ignoring return value of ‘ssize_t write(int, const void*, size_t)’, declared with attribute warn_unused_result [-Wunused-result]
pp_ctl.c: In function ‘OP* Perl_pp_goto()’:
pp_ctl.c:2874:8: warning: variable ‘newsp’ set but not used [-Wunused-but-set-variable]
pp_ctl.c:2875:7: warning: variable ‘gimme’ set but not used [-Wunused-but-set-variable]
perlio.c: In function ‘void PerlIO_debug(const char*, ...)’:
perlio.c:497:43: warning: ignoring return value of ‘ssize_t write(int, const void*, size_t)’, declared with attribute warn_unused_result [-Wunused-result]
sv.c: In function ‘char* Perl_sv_2pv_flags(SV*, STRLEN*, I32)’:
sv.c:2772:39: warning: ignoring return value of ‘char* gcvt(double, int, char*)’, declared with attribute warn_unused_result [-Wunused-result]
sv.c:2960:39: warning: ignoring return value of ‘char* gcvt(double, int, char*)’, declared with attribute warn_unused_result [-Wunused-result]
doio.c: In function ‘void S_exec_failed(const char*, int, int)’:
doio.c:1378:43: warning: ignoring return value of ‘ssize_t write(int, const void*, size_t)’, declared with attribute warn_unused_result [-Wunused-result]
doio.c: In function ‘PerlIOl** Perl_nextargv(GV*)’:
doio.c:875:46: warning: ignoring return value of ‘int fchown(int, __uid_t, __gid_t)’, declared with attribute warn_unused_result [-Wunused-result]
mg_vtable.h:94:54: warning: ‘PL_magic_vtable_names’ initialized and declared ‘extern’ [enabled by default]
sdbm.c: In function ‘int makroom(DBM*, long int, int)’:
sdbm.c:378:70: warning: ignoring return value of ‘ssize_t write(int, const void*, size_t)’, declared with attribute warn_unused_result [-Wunused-result]
Call.xs: In function ‘I32 filter_call(int, SV*, int)’:
Call.xs:63:58: warning: format ‘%d’ expects argument of type ‘int’, but argument 3 has type ‘STRLEN {aka long unsigned int}’ [-Wformat]
Call.xs:63:58: warning: format ‘%d’ expects argument of type ‘int’, but argument 5 has type ‘STRLEN {aka long unsigned int}’ [-Wformat]
Call.xs:100:41: warning: format ‘%d’ expects argument of type ‘int’, but argument 4 has type ‘STRLEN {aka long unsigned int}’ [-Wformat]
Call.xs:156:38: warning: format ‘%d’ expects argument of type ‘int’, but argument 3 has type ‘STRLEN {aka long unsigned int}’ [-Wformat]
Call.xs:175:51: warning: format ‘%d’ expects argument of type ‘int’, but argument 4 has type ‘long unsigned int’ [-Wformat]
regcomp.c: In function ‘void S_dump_trie(const _reg_trie_data*, HV*, AV*, U32)’:
regcomp.c:1054:5: warning: variable ‘re_debug_flags’ set but not used [-Wunused-but-set-variable]
regcomp.c: In function ‘void S_dump_trie_interim_list(const _reg_trie_data*, HV*, AV*, U32, U32)’:
regcomp.c:1145:5: warning: variable ‘re_debug_flags’ set but not used [-Wunused-but-set-variable]
regcomp.c: In function ‘void S_dump_trie_interim_table(const _reg_trie_data*, HV*, AV*, U32, U32)’:
regcomp.c:1203:5: warning: variable ‘re_debug_flags’ set but not used [-Wunused-but-set-variable]
regcomp.c: In function ‘REGEXP* Perl_re_op_compile(SV**, int, OP*, const regexp_engine*, REGEXP*, bool*, U32, U32)’:
regcomp.c:6441:5: warning: variable ‘re_debug_flags’ set but not used [-Wunused-but-set-variable]
regcomp.c: In function ‘SV* Perl_reg_named_buff_nextkey(REGEXP*, U32)’:
regcomp.c:6589:5: warning: variable ‘re_debug_flags’ set but not used [-Wunused-but-set-variable]
regcomp.c: In function ‘void Perl_pregfree2(REGEXP*)’:
regcomp.c:13462:5: warning: variable ‘re_debug_flags’ set but not used [-Wunused-but-set-variable]
util.c: In function ‘char* S_write_no_mem(PerlInterpreter*)’:
pp_ctl.c: In function ‘OP* Perl_pp_goto(PerlInterpreter*)’:
doio.c: In function ‘void S_exec_failed(PerlInterpreter*, const char*, int, int)’:
doio.c: In function ‘PerlIOl** Perl_nextargv(PerlInterpreter*, GV*)’:
perlio.c: In function ‘void S_more_refcounted_fds(PerlInterpreter*, int)’:
perlio.c:488:56: warning: ignoring return value of ‘ssize_t write(int, const void*, size_t)’, declared with attribute warn_unused_result [-Wunused-result]
regexec.c: In function ‘I32 S_regmatch(PerlInterpreter*, regmatch_info*, regnode*)’:
perl.c: In function ‘void S_init_tls_and_interp(PerlInterpreter*)’:
perl.c:103:2: warning: ignoring return value of ‘ssize_t write(int, const void*, size_t)’, declared with attribute warn_unused_result [-Wunused-result]
sv.c: In function ‘DIR* Perl_dirp_dup(PerlInterpreter*, DIR*, CLONE_PARAMS*)’:
sv.c:11424:26: warning: ignoring return value of ‘int fchdir(int)’, declared with attribute warn_unused_result [-Wunused-result]
sv.c: In function ‘void Perl_sv_vcatpvfn(PerlInterpreter*, SV*, const char*, STRLEN, __va_list_tag (*)[1], SV**, I32, bool*)’:
sv.c: In function ‘char* Perl_sv_2pv_flags(PerlInterpreter*, SV*, STRLEN*, I32)’:
shared.xs: In function ‘user_lock* S_get_userlock(PerlInterpreter*, SV*, bool)’:
shared.xs:348:5: warning: deprecated conversion from string constant to ‘char*’ [-Wwrite-strings]
shared.xs: In function ‘void S_sharedsv_dec(PerlInterpreter*, SV*)’:
shared.xs:521:5: warning: deprecated conversion from string constant to ‘char*’ [-Wwrite-strings]
shared.xs: In function ‘void Perl_sharedsv_share(PerlInterpreter*, SV*)’:
shared.xs:550:9: warning: deprecated conversion from string constant to ‘char*’ [-Wwrite-strings]
shared.xs: In function ‘int sharedsv_scalar_mg_get(PerlInterpreter*, SV*, MAGIC*)’:
shared.xs:725:5: warning: deprecated conversion from string constant to ‘char*’ [-Wwrite-strings]
shared.xs: In function ‘int sharedsv_scalar_mg_set(PerlInterpreter*, SV*, MAGIC*)’:
shared.xs:803:5: warning: deprecated conversion from string constant to ‘char*’ [-Wwrite-strings]
shared.xs: In function ‘int sharedsv_scalar_mg_free(PerlInterpreter*, SV*, MAGIC*)’:
shared.xs:821:5: warning: deprecated conversion from string constant to ‘char*’ [-Wwrite-strings]
shared.xs: In function ‘int sharedsv_scalar_mg_local(PerlInterpreter*, SV*, MAGIC*)’:
shared.xs:854:9: warning: deprecated conversion from string constant to ‘char*’ [-Wwrite-strings]
shared.xs: In function ‘int sharedsv_elem_mg_FETCH(PerlInterpreter*, SV*, MAGIC*)’:
shared.xs:891:5: warning: deprecated conversion from string constant to ‘char*’ [-Wwrite-strings]
shared.xs: In function ‘int sharedsv_elem_mg_STORE(PerlInterpreter*, SV*, MAGIC*)’:
shared.xs:944:5: warning: deprecated conversion from string constant to ‘char*’ [-Wwrite-strings]
shared.xs: In function ‘int sharedsv_elem_mg_DELETE(PerlInterpreter*, SV*, MAGIC*)’:
shared.xs:986:5: warning: deprecated conversion from string constant to ‘char*’ [-Wwrite-strings]
shared.xs: In function ‘U32 sharedsv_array_mg_FETCHSIZE(PerlInterpreter*, SV*, MAGIC*)’:
shared.xs:1049:5: warning: deprecated conversion from string constant to ‘char*’ [-Wwrite-strings]
shared.xs: In function ‘int sharedsv_array_mg_CLEAR(PerlInterpreter*, SV*, MAGIC*)’:
shared.xs:1069:5: warning: deprecated conversion from string constant to ‘char*’ [-Wwrite-strings]
shared.xs: In function ‘void Perl_sharedsv_lock(PerlInterpreter*, SV*)’:
shared.xs:1173:63: warning: deprecated conversion from string constant to ‘char*’ [-Wwrite-strings]
shared.xs: In function ‘void XS_threads__shared__tie_PUSH(PerlInterpreter*, CV*)’:
shared.xs:1269:13: warning: deprecated conversion from string constant to ‘char*’ [-Wwrite-strings]
shared.xs: In function ‘void XS_threads__shared__tie_UNSHIFT(PerlInterpreter*, CV*)’:
shared.xs:1286:9: warning: deprecated conversion from string constant to ‘char*’ [-Wwrite-strings]
shared.xs: In function ‘void XS_threads__shared__tie_POP(PerlInterpreter*, CV*)’:
shared.xs:1309:9: warning: deprecated conversion from string constant to ‘char*’ [-Wwrite-strings]
shared.xs: In function ‘void XS_threads__shared__tie_SHIFT(PerlInterpreter*, CV*)’:
shared.xs:1326:9: warning: deprecated conversion from string constant to ‘char*’ [-Wwrite-strings]
shared.xs: In function ‘void XS_threads__shared__tie_EXTEND(PerlInterpreter*, CV*)’:
shared.xs:1342:9: warning: deprecated conversion from string constant to ‘char*’ [-Wwrite-strings]
shared.xs: In function ‘void XS_threads__shared__tie_STORESIZE(PerlInterpreter*, CV*)’:
shared.xs:1352:9: warning: deprecated conversion from string constant to ‘char*’ [-Wwrite-strings]
shared.xs: In function ‘void XS_threads__shared__tie_EXISTS(PerlInterpreter*, CV*)’:
shared.xs:1364:13: warning: deprecated conversion from string constant to ‘char*’ [-Wwrite-strings]
shared.xs:1374:13: warning: deprecated conversion from string constant to ‘char*’ [-Wwrite-strings]
shared.xs: In function ‘void XS_threads__shared__tie_FIRSTKEY(PerlInterpreter*, CV*)’:
shared.xs:1390:9: warning: deprecated conversion from string constant to ‘char*’ [-Wwrite-strings]
shared.xs: In function ‘void XS_threads__shared__tie_NEXTKEY(PerlInterpreter*, CV*)’:
shared.xs:1418:9: warning: deprecated conversion from string constant to ‘char*’ [-Wwrite-strings]
shared.xs: In function ‘void XS_threads__shared_bless(PerlInterpreter*, CV*)’:
shared.xs:1678:13: warning: deprecated conversion from string constant to ‘char*’ [-Wwrite-strings]
Call.xs: In function ‘I32 filter_call(PerlInterpreter*, int, SV*, int)’:
threads.xs: In function ‘ithread* S_ithread_create(PerlInterpreter*, SV*, IV, int, int, int, int)’:
threads.xs:714:83: warning: ignoring return value of ‘ssize_t write(int, const void*, size_t)’, declared with attribute warn_unused_result [-Wunused-result]
regcomp.c: In function ‘void S_dump_trie(PerlInterpreter*, const _reg_trie_data*, HV*, AV*, U32)’:
regcomp.c: In function ‘void S_dump_trie_interim_list(PerlInterpreter*, const _reg_trie_data*, HV*, AV*, U32, U32)’:
regcomp.c: In function ‘void S_dump_trie_interim_table(PerlInterpreter*, const _reg_trie_data*, HV*, AV*, U32, U32)’:
regcomp.c: In function ‘REGEXP* Perl_re_op_compile(PerlInterpreter*, SV**, int, OP*, const regexp_engine*, REGEXP*, bool*, U32, U32)’:
regcomp.c: In function ‘SV* Perl_reg_named_buff_nextkey(PerlInterpreter*, REGEXP*, U32)’:
regcomp.c: In function ‘void Perl_pregfree2(PerlInterpreter*, REGEXP*)’:
-- 
Report by Test::Smoke v1.44 build 1285 running on perl 5.14.2
(Reporter v0.035 / Smoker v0.045)




nntp.perl.org: Perl Programming lists via nntp and http.
Comments to Ask Bjørn Hansen at ask@perl.org | Group listing | About