develooper Front page | perl.perl5.porters | Postings from June 2012

Smoke [blead] v5.17.1-171-g1e911c9 FAIL(F) MSWin32 Win2000 SP4 (x86/1 cpu)

From:
George Greer
Date:
June 27, 2012 07:44
Subject:
Smoke [blead] v5.17.1-171-g1e911c9 FAIL(F) MSWin32 Win2000 SP4 (x86/1 cpu)
Message ID:
20120627144419.2DE594E0014@zwei
Smoke logs available at http://m-l.org/~perl/smoke/perl/

Note: Due to a quirk of the virtual machine, build failures are generally
because of timing issues on the VM rather than Perl problems, unless all
of the grid says "M".

Automated smoke report for 5.17.2 patch 1e911c963ee7d7925e6e69f5101ae37c4d6fce1f v5.17.1-171-g1e911c9
perl-win2k: Intel(R) Core(TM) i7 CPU 920 @ 2.67GHz(~2661 MHz) (x86/1 cpu)
    on        MSWin32 - Win2000 SP4
    using     cl version 14.00.50727.762
    smoketime 2 hours 26 minutes (average 36 minutes 44 seconds)

Summary: FAIL(F)

O = OK  F = Failure(s), extended report at the bottom
X = Failure(s) under TEST but not under harness
? = still running or test results not (yet) available
Build failures during:       - = unknown or N/A
c = Configure, m = make, M = make (after miniperl), t = make test-prep

v5.17.1-171-g1e911c9  Configuration (common) none
----------- ---------------------------------------------------------
F F         
F F         -Duseithreads
| +--------- -DDEBUGGING
+----------- no debugging


Locally applied patches:
    uncommitted-changes
    SMOKE1e911c963ee7d7925e6e69f5101ae37c4d6fce1f

Failures: (common-args) none
[default] 
../lib/diagnostics.t........................................FAILED
    7

[default] -DDEBUGGING
../t/op/alarm.t.............................................FAILED
    4
../cpan/Memoize/t/expmod_t.t................................FAILED
    7
../lib/diagnostics.t........................................FAILED
    7

[default] -Duseithreads
../cpan/Memoize/t/expmod_t.t................................FAILED
    7
../lib/diagnostics.t........................................FAILED
    7

[default] -DDEBUGGING -Duseithreads
../t/op/alarm.t.............................................FAILED
    4
../lib/diagnostics.t........................................FAILED
    7

Passed Todo tests: (common-args) none
[default] 
[default] -DDEBUGGING
[default] -Duseithreads
[default] -DDEBUGGING -Duseithreads
../t/porting/diag.t.........................................PASSED
    1-9, 1186, 1251, 1393, 1396, 1399, 1407
    1410, 1417, 1423
../cpan/CGI/t/tmpdir.t......................................PASSED
    3-9

Compiler messages(MSWin32):
op.c(6730) : warning C4244: 'initializing' : conversion from 'U32' to 'const char', possible loss of data
op.c(10840) : warning C4028: formal parameter 1 different from declaration
..\pp.c(5833) : warning C4244: 'function' : conversion from 'U32' to 'const char', possible loss of data
..\pp_hot.c(2687) : warning C4244: 'initializing' : conversion from 'I32' to 'U8', possible loss of data
..\pp_sort.c(1668) : warning C4244: 'initializing' : conversion from 'I32' to 'U8', possible loss of data
..\regexec.c(4346) : warning C4244: 'initializing' : conversion from 'I32' to 'U8', possible loss of data
..\regexec.c(4349) : warning C4244: 'initializing' : conversion from 'I32' to 'U8', possible loss of data
..\toke.c(768) : warning C4244: '=' : conversion from 'U32' to 'U8', possible loss of data
IO.xs(493) : warning C4101: 'ret' : unreferenced local variable
ListUtil.xs(249) : warning C4244: 'initializing' : conversion from 'I32' to 'U8', possible loss of data
ListUtil.xs(297) : warning C4244: 'initializing' : conversion from 'I32' to 'U8', possible loss of data
Base64.xs(394) : warning C4146: unary minus operator applied to unsigned type, result still unsigned
Base64.xs(396) : warning C4146: unary minus operator applied to unsigned type, result still unsigned
POSIX.xs(707) : warning C4101: 'charstring' : unreferenced local variable
scalar.xs(175) : warning C4018: '>' : signed/unsigned mismatch
Piece.xs(950) : warning C4101: 'ret' : unreferenced local variable
APItest.xs(3046) : warning C4244: 'initializing' : conversion from 'I32' to 'U8', possible loss of data
APItest.xs(3370) : warning C4101: 'tmp' : unreferenced local variable
re_exec.c(4346) : warning C4244: 'initializing' : conversion from 'I32' to 'U8', possible loss of data
re_exec.c(4349) : warning C4244: 'initializing' : conversion from 'I32' to 'U8', possible loss of data
op.c(10840) : warning C4028: formal parameter 2 different from declaration

-- 
Report by Test::Smoke v1.42 build 1267 running on perl 5.10.0
(Reporter v0.035 / Smoker v0.045)




nntp.perl.org: Perl Programming lists via nntp and http.
Comments to Ask Bjørn Hansen at ask@perl.org | Group listing | About