develooper Front page | perl.perl5.porters | Postings from June 2012

Re: Smoke [smoke-me/chip/magicflags5] v5.17.0-533-g582cbb2 FAIL(X)linux 3.2.0-24-generic [debian] (x86_64/8 cpu)

Thread Next
From:
Chip Salzenberg
Date:
June 22, 2012 01:44
Subject:
Re: Smoke [smoke-me/chip/magicflags5] v5.17.0-533-g582cbb2 FAIL(X)linux 3.2.0-24-generic [debian] (x86_64/8 cpu)
Message ID:
4FE3730E.6050503@pobox.com
I appreciate this report, but I'm having a bit of trouble interpreting
it.  For example, the X O X O grid has two too few legends describing
the columns.  And how many of these fatures are unique to my patch?

On 6/18/2012 12:19 AM, George Greer wrote:
> Smoke logs available at http://m-l.org/~perl/smoke/perl/
>
> Automated smoke report for 5.17.0 patch 582cbb27c3b0af2d12b7baf4dae3919fa3180b13 v5.17.0-533-g582cbb2
> zwei: Intel(R) Core(TM) i7 CPU 920 @ 2.67GHz (GenuineIntel 2668MHz) (x86_64/8 cpu)
>     on        linux - 3.2.0-24-generic [debian]
>     using     g++ version 4.6.3
>     smoketime 20 hours 10 minutes (average 1 hour)
>
> Summary: FAIL(X)
>
> O = OK  F = Failure(s), extended report at the bottom
> X = Failure(s) under TEST but not under harness
> ? = still running or test results not (yet) available
> Build failures during:       - = unknown or N/A
> c = Configure, m = make, M = make (after miniperl), t = make test-prep
>
> v5.17.0-533-g582cbb2  Configuration (common) -Dcc=g++
> ----------- ---------------------------------------------------------
> X X O O X X O X 
> X X O X X X O X -Accflags=-DPERL_POISON
> X X O X X X O O -Duse64bitall
> X X O X X X O X -Dusemorebits
> X X O X X X O X -Dmad
> X X O X X X O X -Duseithreads
> X X O X X X O X -Duseithreads -Accflags=-DPERL_POISON
> X X O X X X O X -Duseithreads -Duse64bitall
> X X O X X X O X -Duseithreads -Dusemorebits
> X X O X X X O X -Duseithreads -Dmad
> | | | | | +- LC_ALL = en_US.utf8 -DDEBUGGING
> | | | | +--- PERLIO = perlio -DDEBUGGING
> | | | +----- PERLIO = stdio  -DDEBUGGING
> | | +------- LC_ALL = en_US.utf8
> | +--------- PERLIO = perlio
> +----------- PERLIO = stdio 
>
> Locally applied patches:
>     uncommitted-changes
>     SMOKE582cbb27c3b0af2d12b7baf4dae3919fa3180b13
>
> Failures: (common-args) -Dcc=g++
> [stdio] 
> [stdio] -DDEBUGGING
> [stdio] -Accflags=-DPERL_POISON
> [stdio] -DDEBUGGING -Accflags=-DPERL_POISON
> [stdio] -Duse64bitall
> [stdio] -DDEBUGGING -Duse64bitall
> [stdio] -Dusemorebits
> [stdio] -DDEBUGGING -Dusemorebits
> [stdio] -Dmad
> [stdio] -DDEBUGGING -Dmad
> [stdio] -Duseithreads
> Inconsistent test results (between TEST and harness):
>     ../t/op/tie_fetch_count.t............... ......................................... FAILED at test 58
>
> [perlio] 
> [perlio/en_US.utf8] -DDEBUGGING
> [perlio/en_US.utf8] -Accflags=-DPERL_POISON
> [perlio/en_US.utf8] -DDEBUGGING -Accflags=-DPERL_POISON
> [perlio/en_US.utf8] -Duse64bitall
> [perlio] -DDEBUGGING -Duse64bitall
> [perlio/en_US.utf8] -Dusemorebits
> [perlio/en_US.utf8] -DDEBUGGING -Dusemorebits
> [en_US.utf8] -Dmad
> [perlio/en_US.utf8] -DDEBUGGING -Dmad
> [perlio] -Duseithreads
> Inconsistent test results (between TEST and harness):
>     ../t/comp/require.t..................... ............................................... FAILED at test 47
>
> [perlio] -Dmad
> Inconsistent test results (between TEST and harness):
>     ../t/comp/require.t..................... ............................................... FAILED--expected 54 tests, saw 16
>
> [en_US.utf8] -Duseithreads
> [perlio] -DDEBUGGING -Duseithreads
> [perlio/en_US.utf8] -Duseithreads -Accflags=-DPERL_POISON
> [perlio/en_US.utf8] -DDEBUGGING -Duseithreads -Accflags=-DPERL_POISON
> [perlio] -Duseithreads -Duse64bitall
> [perlio/en_US.utf8] -DDEBUGGING -Duseithreads -Duse64bitall
> [perlio/en_US.utf8] -Duseithreads -Dusemorebits
> [perlio/en_US.utf8] -DDEBUGGING -Duseithreads -Dusemorebits
> [perlio/en_US.utf8] -Duseithreads -Dmad
> [perlio/en_US.utf8] -DDEBUGGING -Duseithreads -Dmad
> Inconsistent test results (between TEST and harness):
>     ../t/comp/require.t..................... ............................................... FAILED at test 47
>     ../lib/File/Find/t/taint.t.............. ........................................ FAILED at test 3
>     ../lib/File/Find/t/find.t............... ......................................... FAILED at test 3
>
> [stdio] -DDEBUGGING -Duseithreads
> [stdio] -Duseithreads -Accflags=-DPERL_POISON
> [stdio] -DDEBUGGING -Duseithreads -Accflags=-DPERL_POISON
> [stdio] -Duseithreads -Duse64bitall
> [stdio] -DDEBUGGING -Duseithreads -Duse64bitall
> [stdio] -Duseithreads -Dusemorebits
> [stdio] -DDEBUGGING -Duseithreads -Dusemorebits
> [stdio] -Duseithreads -Dmad
> [stdio] -DDEBUGGING -Duseithreads -Dmad
> Inconsistent test results (between TEST and harness):
>     ../lib/File/Find/t/taint.t.............. ........................................ FAILED at test 3
>     ../lib/File/Find/t/find.t............... ......................................... FAILED at test 3
>     ../t/op/tie_fetch_count.t............... ......................................... FAILED at test 58
>
> [en_US.utf8] -DDEBUGGING -Duseithreads
> [en_US.utf8] -Duseithreads -Duse64bitall
> Inconsistent test results (between TEST and harness):
>     ../lib/File/Find/t/taint.t.............. ........................................ FAILED at test 3
>     ../lib/File/Find/t/find.t............... ......................................... FAILED at test 3
>
> Compiler messages(gcc):
> try.c: In function ‘int main()’:
> try.c:36:10: warning: ignoring return value of ‘int pipe(int*)’, declared with attribute warn_unused_result [-Wunused-result]
> try.c:37:10: warning: ignoring return value of ‘int pipe(int*)’, declared with attribute warn_unused_result [-Wunused-result]
> try.c:53:35: warning: ignoring return value of ‘ssize_t write(int, const void*, size_t)’, declared with attribute warn_unused_result [-Wunused-result]
> try.c:66:23: warning: ignoring return value of ‘ssize_t write(int, const void*, size_t)’, declared with attribute warn_unused_result [-Wunused-result]
> try.c:72:35: warning: ignoring return value of ‘ssize_t write(int, const void*, size_t)’, declared with attribute warn_unused_result [-Wunused-result]
> try.c:78:21: warning: ignoring return value of ‘ssize_t read(int, void*, size_t)’, declared with attribute warn_unused_result [-Wunused-result]
> doio.c: In function ‘void S_exec_failed(const char*, int, int)’:
> doio.c:1379:43: warning: ignoring return value of ‘ssize_t write(int, const void*, size_t)’, declared with attribute warn_unused_result [-Wunused-result]
> doio.c: In function ‘PerlIOl** Perl_nextargv(GV*)’:
> doio.c:876:46: warning: ignoring return value of ‘int fchown(int, __uid_t, __gid_t)’, declared with attribute warn_unused_result [-Wunused-result]
> pp.c: In function ‘OP* Perl_pp_study()’:
> pp.c:653:29: warning: variable ‘s’ set but not used [-Wunused-but-set-variable]
> sv.c: In function ‘void Perl_sv_vcatpvfn_flags(SV*, const char*, STRLEN, __va_list_tag (*)[1], SV**, I32, bool*, U32)’:
> sv.c:10100:41: warning: ignoring return value of ‘char* gcvt(double, int, char*)’, declared with attribute warn_unused_result [-Wunused-result]
> sv.c:10949:53: warning: ignoring return value of ‘char* gcvt(double, int, char*)’, declared with attribute warn_unused_result [-Wunused-result]
> regexec.c: In function ‘char* S_find_byclass(regexp*, const regnode*, char*, const char*, regmatch_info*)’:
> regexec.c:1607:6: warning: variable ‘ok’ set but not used [-Wunused-but-set-variable]
> regexec.c:1613:6: warning: variable ‘ok’ set but not used [-Wunused-but-set-variable]
> regexec.c:1618:6: warning: variable ‘ok’ set but not used [-Wunused-but-set-variable]
> regexec.c:1628:6: warning: variable ‘ok’ set but not used [-Wunused-but-set-variable]
> regexec.c:1638:6: warning: variable ‘ok’ set but not used [-Wunused-but-set-variable]
> regexec.c:1643:6: warning: variable ‘ok’ set but not used [-Wunused-but-set-variable]
> regexec.c:1654:6: warning: variable ‘ok’ set but not used [-Wunused-but-set-variable]
> regexec.c:1661:6: warning: variable ‘ok’ set but not used [-Wunused-but-set-variable]
> regexec.c:1673:6: warning: variable ‘ok’ set but not used [-Wunused-but-set-variable]
> regexec.c:1680:6: warning: variable ‘ok’ set but not used [-Wunused-but-set-variable]
> regexec.c:1699:6: warning: variable ‘ok’ set but not used [-Wunused-but-set-variable]
> regexec.c:1706:6: warning: variable ‘ok’ set but not used [-Wunused-but-set-variable]
> mg_vtable.h:94:54: warning: ‘PL_magic_vtable_names’ initialized and declared ‘extern’ [enabled by default]
> regexec.c:1724:6: warning: variable ‘ok’ set but not used [-Wunused-but-set-variable]
> regexec.c:1731:6: warning: variable ‘ok’ set but not used [-Wunused-but-set-variable]
> regexec.c:1750:6: warning: variable ‘ok’ set but not used [-Wunused-but-set-variable]
> regexec.c:1768:6: warning: variable ‘ok’ set but not used [-Wunused-but-set-variable]
> sv.c: In function ‘char* Perl_sv_2pv_flags(SV*, STRLEN*, I32)’:
> sv.c:2921:39: warning: ignoring return value of ‘char* gcvt(double, int, char*)’, declared with attribute warn_unused_result [-Wunused-result]
> regexec.c: In function ‘I32 S_regmatch(regmatch_info*, regnode*)’:
> regexec.c:3788:7: warning: variable ‘ok’ set but not used [-Wunused-but-set-variable]
> regexec.c:3864:9: warning: variable ‘ok’ set but not used [-Wunused-but-set-variable]
> regexec.c:3868:1: warning: variable ‘ok’ set but not used [-Wunused-but-set-variable]
> regexec.c:3870:9: warning: variable ‘ok’ set but not used [-Wunused-but-set-variable]
> regexec.c:3874:1: warning: variable ‘ok’ set but not used [-Wunused-but-set-variable]
> regexec.c:3876:9: warning: variable ‘ok’ set but not used [-Wunused-but-set-variable]
> regexec.c:3879:1: warning: variable ‘ok’ set but not used [-Wunused-but-set-variable]
> regexec.c:3964:7: warning: variable ‘ok’ set but not used [-Wunused-but-set-variable]
> regexec.c:3964:1: warning: variable ‘ok’ set but not used [-Wunused-but-set-variable]
> regexec.c:3964:1: warning: variable ‘throw_away’ set but not used [-Wunused-but-set-variable]
> util.c: In function ‘char* S_write_no_mem()’:
> util.c:68:34: warning: ignoring return value of ‘ssize_t write(int, const void*, size_t)’, declared with attribute warn_unused_result [-Wunused-result]
> perlio.c: In function ‘void S_more_refcounted_fds(int)’:
> perlio.c:2354:38: warning: ignoring return value of ‘ssize_t write(int, const void*, size_t)’, declared with attribute warn_unused_result [-Wunused-result]
> pp_ctl.c: In function ‘OP* Perl_pp_goto()’:
> pp_ctl.c:2874:8: warning: variable ‘newsp’ set but not used [-Wunused-but-set-variable]
> pp_ctl.c:2875:7: warning: variable ‘gimme’ set but not used [-Wunused-but-set-variable]
> regexec.c:6039:2: warning: variable ‘sp’ set but not used [-Wunused-but-set-variable]
> regexec.c:3156:5: warning: variable ‘newsp’ set but not used [-Wunused-but-set-variable]
> regexec.c:3156:5: warning: variable ‘multicall_cop’ set but not used [-Wunused-but-set-variable]
> perlio.c: In function ‘void PerlIO_debug(const char*, ...)’:
> perlio.c:497:43: warning: ignoring return value of ‘ssize_t write(int, const void*, size_t)’, declared with attribute warn_unused_result [-Wunused-result]
> regexec.c: In function ‘I32 S_regrepeat(const regexp*, const regnode*, I32, int)’:
> regexec.c:6232:6: warning: variable ‘ok’ set but not used [-Wunused-but-set-variable]
> regexec.c:6277:6: warning: variable ‘ok’ set but not used [-Wunused-but-set-variable]
> regexec.c:6329:6: warning: variable ‘ok’ set but not used [-Wunused-but-set-variable]
> regexec.c:6378:6: warning: variable ‘ok’ set but not used [-Wunused-but-set-variable]
> regexec.c:6431:6: warning: variable ‘ok’ set but not used [-Wunused-but-set-variable]
> regexec.c:6464:6: warning: variable ‘ok’ set but not used [-Wunused-but-set-variable]
> sdbm.c: In function ‘int makroom(DBM*, long int, int)’:
> sdbm.c:378:70: warning: ignoring return value of ‘ssize_t write(int, const void*, size_t)’, declared with attribute warn_unused_result [-Wunused-result]
> Call.xs: In function ‘I32 filter_call(int, SV*, int)’:
> Call.xs:63:58: warning: format ‘%d’ expects argument of type ‘int’, but argument 3 has type ‘STRLEN {aka long unsigned int}’ [-Wformat]
> Call.xs:63:58: warning: format ‘%d’ expects argument of type ‘int’, but argument 5 has type ‘STRLEN {aka long unsigned int}’ [-Wformat]
> Call.xs:100:41: warning: format ‘%d’ expects argument of type ‘int’, but argument 4 has type ‘STRLEN {aka long unsigned int}’ [-Wformat]
> Call.xs:156:38: warning: format ‘%d’ expects argument of type ‘int’, but argument 3 has type ‘STRLEN {aka long unsigned int}’ [-Wformat]
> Call.xs:175:51: warning: format ‘%d’ expects argument of type ‘int’, but argument 4 has type ‘long unsigned int’ [-Wformat]
> regcomp.c: In function ‘void S_dump_trie(const _reg_trie_data*, HV*, AV*, U32)’:
> regcomp.c:1054:5: warning: variable ‘re_debug_flags’ set but not used [-Wunused-but-set-variable]
> regcomp.c: In function ‘void S_dump_trie_interim_list(const _reg_trie_data*, HV*, AV*, U32, U32)’:
> regcomp.c:1145:5: warning: variable ‘re_debug_flags’ set but not used [-Wunused-but-set-variable]
> regcomp.c: In function ‘void S_dump_trie_interim_table(const _reg_trie_data*, HV*, AV*, U32, U32)’:
> regcomp.c:1203:5: warning: variable ‘re_debug_flags’ set but not used [-Wunused-but-set-variable]
> regcomp.c: In function ‘REGEXP* Perl_re_op_compile(SV**, int, OP*, const regexp_engine*, REGEXP*, bool*, U32, U32)’:
> regcomp.c:6418:5: warning: variable ‘re_debug_flags’ set but not used [-Wunused-but-set-variable]
> regcomp.c: In function ‘SV* Perl_reg_named_buff_nextkey(REGEXP*, U32)’:
> regcomp.c:6566:5: warning: variable ‘re_debug_flags’ set but not used [-Wunused-but-set-variable]
> regcomp.c: In function ‘void Perl_pregfree2(REGEXP*)’:
> regcomp.c:13401:5: warning: variable ‘re_debug_flags’ set but not used [-Wunused-but-set-variable]
> sv.c:10949:53: warning: ignoring return value of ‘char* qgcvt(long double, int, char*)’, declared with attribute warn_unused_result [-Wunused-result]
> sv.c:2921:39: warning: ignoring return value of ‘char* qgcvt(long double, int, char*)’, declared with attribute warn_unused_result [-Wunused-result]
> toke.c: In function ‘int Perl_yylex()’:
> toke.c:8141:19: warning: variable ‘have_proto’ set but not used [-Wunused-but-set-variable]
> pp_ctl.c: In function ‘OP* Perl_pp_goto(PerlInterpreter*)’:
> perlio.c: In function ‘void S_more_refcounted_fds(PerlInterpreter*, int)’:
> regexec.c: In function ‘char* S_find_byclass(PerlInterpreter*, regexp*, const regnode*, char*, const char*, regmatch_info*)’:
> perlio.c:488:56: warning: ignoring return value of ‘ssize_t write(int, const void*, size_t)’, declared with attribute warn_unused_result [-Wunused-result]
> util.c: In function ‘char* S_write_no_mem(PerlInterpreter*)’:
> perl.c: In function ‘void S_init_tls_and_interp(PerlInterpreter*)’:
> perl.c:103:2: warning: ignoring return value of ‘ssize_t write(int, const void*, size_t)’, declared with attribute warn_unused_result [-Wunused-result]
> regexec.c: In function ‘I32 S_regmatch(PerlInterpreter*, regmatch_info*, regnode*)’:
> regexec.c:3788:1: warning: variable ‘ok’ set but not used [-Wunused-but-set-variable]
> doio.c: In function ‘void S_exec_failed(PerlInterpreter*, const char*, int, int)’:
> doio.c: In function ‘PerlIOl** Perl_nextargv(PerlInterpreter*, GV*)’:
> pp.c: In function ‘OP* Perl_pp_study(PerlInterpreter*)’:
> regexec.c: In function ‘I32 S_regrepeat(PerlInterpreter*, const regexp*, const regnode*, I32, int)’:
> regexec.c:6232:1: warning: variable ‘ok’ set but not used [-Wunused-but-set-variable]
> regexec.c:6277:1: warning: variable ‘ok’ set but not used [-Wunused-but-set-variable]
> regexec.c:6329:1: warning: variable ‘ok’ set but not used [-Wunused-but-set-variable]
> regexec.c:6378:1: warning: variable ‘ok’ set but not used [-Wunused-but-set-variable]
> regexec.c:6431:1: warning: variable ‘ok’ set but not used [-Wunused-but-set-variable]
> regexec.c:6464:1: warning: variable ‘ok’ set but not used [-Wunused-but-set-variable]
> sv.c: In function ‘DIR* Perl_dirp_dup(PerlInterpreter*, DIR*, CLONE_PARAMS*)’:
> sv.c:11396:26: warning: ignoring return value of ‘int fchdir(int)’, declared with attribute warn_unused_result [-Wunused-result]
> sv.c: In function ‘void Perl_sv_vcatpvfn_flags(PerlInterpreter*, SV*, const char*, STRLEN, __va_list_tag (*)[1], SV**, I32, bool*, U32)’:
> sv.c: In function ‘char* Perl_sv_2pv_flags(PerlInterpreter*, SV*, STRLEN*, I32)’:
> shared.xs: In function ‘user_lock* S_get_userlock(PerlInterpreter*, SV*, bool)’:
> shared.xs:348:5: warning: deprecated conversion from string constant to ‘char*’ [-Wwrite-strings]
> shared.xs: In function ‘void S_sharedsv_dec(PerlInterpreter*, SV*)’:
> shared.xs:521:5: warning: deprecated conversion from string constant to ‘char*’ [-Wwrite-strings]
> shared.xs: In function ‘void Perl_sharedsv_share(PerlInterpreter*, SV*)’:
> shared.xs:550:9: warning: deprecated conversion from string constant to ‘char*’ [-Wwrite-strings]
> shared.xs: In function ‘int sharedsv_scalar_mg_get(PerlInterpreter*, SV*, MAGIC*)’:
> shared.xs:725:5: warning: deprecated conversion from string constant to ‘char*’ [-Wwrite-strings]
> shared.xs: In function ‘int sharedsv_scalar_mg_set(PerlInterpreter*, SV*, MAGIC*)’:
> shared.xs:803:5: warning: deprecated conversion from string constant to ‘char*’ [-Wwrite-strings]
> shared.xs: In function ‘int sharedsv_scalar_mg_free(PerlInterpreter*, SV*, MAGIC*)’:
> shared.xs:821:5: warning: deprecated conversion from string constant to ‘char*’ [-Wwrite-strings]
> shared.xs: In function ‘int sharedsv_scalar_mg_local(PerlInterpreter*, SV*, MAGIC*)’:
> shared.xs:854:9: warning: deprecated conversion from string constant to ‘char*’ [-Wwrite-strings]
> shared.xs: In function ‘int sharedsv_elem_mg_FETCH(PerlInterpreter*, SV*, MAGIC*)’:
> shared.xs:891:5: warning: deprecated conversion from string constant to ‘char*’ [-Wwrite-strings]
> shared.xs: In function ‘int sharedsv_elem_mg_STORE(PerlInterpreter*, SV*, MAGIC*)’:
> shared.xs:944:5: warning: deprecated conversion from string constant to ‘char*’ [-Wwrite-strings]
> shared.xs: In function ‘int sharedsv_elem_mg_DELETE(PerlInterpreter*, SV*, MAGIC*)’:
> shared.xs:986:5: warning: deprecated conversion from string constant to ‘char*’ [-Wwrite-strings]
> shared.xs: In function ‘U32 sharedsv_array_mg_FETCHSIZE(PerlInterpreter*, SV*, MAGIC*)’:
> shared.xs:1049:5: warning: deprecated conversion from string constant to ‘char*’ [-Wwrite-strings]
> shared.xs: In function ‘int sharedsv_array_mg_CLEAR(PerlInterpreter*, SV*, MAGIC*)’:
> shared.xs:1069:5: warning: deprecated conversion from string constant to ‘char*’ [-Wwrite-strings]
> shared.xs: In function ‘void Perl_sharedsv_lock(PerlInterpreter*, SV*)’:
> shared.xs:1173:63: warning: deprecated conversion from string constant to ‘char*’ [-Wwrite-strings]
> shared.xs: In function ‘void XS_threads__shared__tie_PUSH(PerlInterpreter*, CV*)’:
> shared.xs:1269:13: warning: deprecated conversion from string constant to ‘char*’ [-Wwrite-strings]
> shared.xs: In function ‘void XS_threads__shared__tie_UNSHIFT(PerlInterpreter*, CV*)’:
> shared.xs:1286:9: warning: deprecated conversion from string constant to ‘char*’ [-Wwrite-strings]
> shared.xs: In function ‘void XS_threads__shared__tie_POP(PerlInterpreter*, CV*)’:
> shared.xs:1309:9: warning: deprecated conversion from string constant to ‘char*’ [-Wwrite-strings]
> shared.xs: In function ‘void XS_threads__shared__tie_SHIFT(PerlInterpreter*, CV*)’:
> shared.xs:1326:9: warning: deprecated conversion from string constant to ‘char*’ [-Wwrite-strings]
> shared.xs: In function ‘void XS_threads__shared__tie_EXTEND(PerlInterpreter*, CV*)’:
> shared.xs:1342:9: warning: deprecated conversion from string constant to ‘char*’ [-Wwrite-strings]
> shared.xs: In function ‘void XS_threads__shared__tie_STORESIZE(PerlInterpreter*, CV*)’:
> shared.xs:1352:9: warning: deprecated conversion from string constant to ‘char*’ [-Wwrite-strings]
> shared.xs: In function ‘void XS_threads__shared__tie_EXISTS(PerlInterpreter*, CV*)’:
> shared.xs:1364:13: warning: deprecated conversion from string constant to ‘char*’ [-Wwrite-strings]
> shared.xs:1374:13: warning: deprecated conversion from string constant to ‘char*’ [-Wwrite-strings]
> shared.xs: In function ‘void XS_threads__shared__tie_FIRSTKEY(PerlInterpreter*, CV*)’:
> shared.xs:1390:9: warning: deprecated conversion from string constant to ‘char*’ [-Wwrite-strings]
> shared.xs: In function ‘void XS_threads__shared__tie_NEXTKEY(PerlInterpreter*, CV*)’:
> shared.xs:1418:9: warning: deprecated conversion from string constant to ‘char*’ [-Wwrite-strings]
> shared.xs: In function ‘void XS_threads__shared_bless(PerlInterpreter*, CV*)’:
> shared.xs:1678:13: warning: deprecated conversion from string constant to ‘char*’ [-Wwrite-strings]
> threads.xs: In function ‘ithread* S_ithread_create(PerlInterpreter*, SV*, IV, int, int, int, int)’:
> threads.xs:714:83: warning: ignoring return value of ‘ssize_t write(int, const void*, size_t)’, declared with attribute warn_unused_result [-Wunused-result]
> Call.xs: In function ‘I32 filter_call(PerlInterpreter*, int, SV*, int)’:
> regcomp.c: In function ‘void S_dump_trie(PerlInterpreter*, const _reg_trie_data*, HV*, AV*, U32)’:
> regcomp.c: In function ‘void S_dump_trie_interim_list(PerlInterpreter*, const _reg_trie_data*, HV*, AV*, U32, U32)’:
> regcomp.c: In function ‘void S_dump_trie_interim_table(PerlInterpreter*, const _reg_trie_data*, HV*, AV*, U32, U32)’:
> regcomp.c: In function ‘REGEXP* Perl_re_op_compile(PerlInterpreter*, SV**, int, OP*, const regexp_engine*, REGEXP*, bool*, U32, U32)’:
> regcomp.c: In function ‘SV* Perl_reg_named_buff_nextkey(PerlInterpreter*, REGEXP*, U32)’:
> regcomp.c: In function ‘void Perl_pregfree2(PerlInterpreter*, REGEXP*)’:
> toke.c: In function ‘int Perl_yylex(PerlInterpreter*)’:
> shared.xs:348:5: warning: deprecated conversion from string constant to ‘char*’ [-Wwrite-strings] {aka long unsigned int}’ [-Wformat]



Thread Next


nntp.perl.org: Perl Programming lists via nntp and http.
Comments to Ask Bjørn Hansen at ask@perl.org | Group listing | About