develooper Front page | perl.perl5.porters | Postings from June 2012

Smoke [blead] v5.17.0-351-ge5cccf3 FAIL(FM) MSWin32 Win2000 SP4 (x86/1 cpu)

From:
George Greer
Date:
June 12, 2012 02:50
Subject:
Smoke [blead] v5.17.0-351-ge5cccf3 FAIL(FM) MSWin32 Win2000 SP4 (x86/1 cpu)
Message ID:
20120612095042.A080E4E0131@zwei
Smoke logs available at http://m-l.org/~perl/smoke/perl/

Note: VirtualBox clock issues have been apparently fixed by host reboot/upgrade.

Automated smoke report for 5.17.0 patch e5cccf3ce5d62591703f2998f30d65ba7f551844 v5.17.0-351-ge5cccf3
perl-win2k: Intel(R) Core(TM) i7 CPU 920 @ 2.67GHz(~2661 MHz) (x86/1 cpu)
    on        MSWin32 - Win2000 SP4
    using     cl version 14.00.50727.762
    smoketime 2 hours 1 minute (average 30 minutes 28 seconds)

Summary: FAIL(FM)

O = OK  F = Failure(s), extended report at the bottom
X = Failure(s) under TEST but not under harness
? = still running or test results not (yet) available
Build failures during:       - = unknown or N/A
c = Configure, m = make, M = make (after miniperl), t = make test-prep

v5.17.0-351-ge5cccf3  Configuration (common) none
----------- ---------------------------------------------------------
F F         
M F         -Duseithreads
| +--------- -DDEBUGGING
+----------- no debugging


Locally applied patches:
    uncommitted-changes
    SMOKEe5cccf3ce5d62591703f2998f30d65ba7f551844

Failures: (common-args) none
[default] 
../cpan/CPANPLUS/t/20_CPANPLUS-Dist-MM.t....................FAILED
    11-12, 14, 17-18, 42
    Non-zero exit status: 2
../cpan/ExtUtils-Constant/t/Constant.t......................FAILED
    3
    Bad plan.  You planned 302 tests but ran 3.
../cpan/ExtUtils-MakeMaker/t/basic.t........................FAILED
    22-51, 53-54, 56-62
    Non-zero exit status: 39
../cpan/ExtUtils-MakeMaker/t/INSTALL_BASE.t.................FAILED
    5-17
    Non-zero exit status: 13
../cpan/ExtUtils-MakeMaker/t/miniperl.t.....................FAILED
    5
    Non-zero exit status: 1
../cpan/ExtUtils-MakeMaker/t/PL_FILES.t.....................FAILED
    3-7
    Non-zero exit status: 5
../cpan/ExtUtils-MakeMaker/t/pm_to_blib.t...................FAILED
    4-5, 7
    Non-zero exit status: 2
../cpan/Memoize/t/expmod_t.t................................FAILED
    7

[default] -DDEBUGGING
../t/op/alarm.t.............................................FAILED
    4

[default] -DDEBUGGING -Duseithreads
../t/op/alarm.t.............................................FAILED
    4
../cpan/Memoize/t/expmod_t.t................................FAILED
    7
../cpan/Time-HiRes/t/usleep.t...............................FAILED
    3-4
    Non-zero exit status: 2

Passed Todo tests: (common-args) none
[default] 
[default] -DDEBUGGING
[default] -DDEBUGGING -Duseithreads
../cpan/CGI/t/tmpdir.t......................................PASSED
    3-9

Compiler messages(MSWin32):
op.c(6571) : warning C4244: 'initializing' : conversion from 'U32' to 'const char', possible loss of data
op.c(10671) : warning C4028: formal parameter 1 different from declaration
..\pp.c(5870) : warning C4244: 'function' : conversion from 'U32' to 'const char', possible loss of data
..\pp_hot.c(2671) : warning C4244: 'initializing' : conversion from 'I32' to 'U8', possible loss of data
..\pp_sort.c(1668) : warning C4244: 'initializing' : conversion from 'I32' to 'U8', possible loss of data
..\toke.c(765) : warning C4244: '=' : conversion from 'U32' to 'U8', possible loss of data
IO.xs(493) : warning C4101: 'ret' : unreferenced local variable
ListUtil.xs(297) : warning C4244: 'initializing' : conversion from 'I32' to 'U8', possible loss of data
ListUtil.xs(335) : warning C4244: 'initializing' : conversion from 'I32' to 'U8', possible loss of data
Base64.xs(394) : warning C4146: unary minus operator applied to unsigned type, result still unsigned
Base64.xs(396) : warning C4146: unary minus operator applied to unsigned type, result still unsigned
POSIX.xs(707) : warning C4101: 'charstring' : unreferenced local variable
scalar.xs(175) : warning C4018: '>' : signed/unsigned mismatch
Piece.xs(950) : warning C4101: 'ret' : unreferenced local variable
APItest.xs(3046) : warning C4244: 'initializing' : conversion from 'I32' to 'U8', possible loss of data
APItest.xs(3370) : warning C4101: 'tmp' : unreferenced local variable
# NMAKE : fatal error U1077: 'D:\smoke\perl\blead\build\t\perl.exe' : return code '0x1'
# NMAKE : fatal error U1077: '"C:\Program Files\Microsoft Visual Studio 8\VC\BIN\nmake.EXE"' : return code '0x2'
op.c(10671) : warning C4028: formal parameter 2 different from declaration

-- 
Report by Test::Smoke v1.42 build 1267 running on perl 5.10.0
(Reporter v0.035 / Smoker v0.045)




nntp.perl.org: Perl Programming lists via nntp and http.
Comments to Ask Bjørn Hansen at ask@perl.org | Group listing | About