develooper Front page | perl.perl5.porters | Postings from May 2012

Smoke [blead] v5.17.0-56-gfb55fee FAIL(F) linux 3.2.0-24-generic [debian] (x86_64/8 cpu)

From:
George Greer
Date:
May 29, 2012 16:33
Subject:
Smoke [blead] v5.17.0-56-gfb55fee FAIL(F) linux 3.2.0-24-generic [debian] (x86_64/8 cpu)
Message ID:
201205292333.q4TNXbC5025272@m-l.org
Smoke logs available at http://m-l.org/~perl/smoke/perl/

Automated smoke report for 5.17.0 patch fb55feefe971ae1552e21360ba05c793b60fefd6 v5.17.0-56-gfb55fee
zwei: Intel(R) Core(TM) i7 CPU 920 @ 2.67GHz (GenuineIntel 2668MHz) (x86_64/8 cpu)
    on        linux - 3.2.0-24-generic [debian]
    using     g++ version 4.6.3
    smoketime 41 minutes 10 seconds (average 10 minutes 18 seconds)

Summary: FAIL(F)

O = OK  F = Failure(s), extended report at the bottom
X = Failure(s) under TEST but not under harness
? = still running or test results not (yet) available
Build failures during:       - = unknown or N/A
c = Configure, m = make, M = make (after miniperl), t = make test-prep

v5.17.0-56-gfb55fee  Configuration (common) -Accflags=-DPERL_POISON -Dcc=g++
----------- ---------------------------------------------------------
O O O O     
O O F O     -Duseithreads
| +--------- -DDEBUGGING
+----------- no debugging


Locally applied patches:
    uncommitted-changes
    SMOKEfb55feefe971ae1552e21360ba05c793b60fefd6

Testsuite was run only with 'harness'

Failures: (common-args) -Accflags=-DPERL_POISON -Dcc=g++
[default] -DDEBUGGING -Duseithreads
../t/op/getppid.t...........................................FAILED
    3, 6-7

Passed Todo tests: (common-args) -Accflags=-DPERL_POISON -Dcc=g++
[default] 
[default] -DDEBUGGING
[default] -Duseithreads
[default] -DDEBUGGING -Duseithreads
../cpan/CGI/t/tmpdir.t......................................PASSED
    3-9

Compiler messages(gcc):
try.c: In function ‘int main()’:
try.c:36:10: warning: ignoring return value of ‘int pipe(int*)’, declared with attribute warn_unused_result [-Wunused-result]
try.c:37:10: warning: ignoring return value of ‘int pipe(int*)’, declared with attribute warn_unused_result [-Wunused-result]
try.c:53:35: warning: ignoring return value of ‘ssize_t write(int, const void*, size_t)’, declared with attribute warn_unused_result [-Wunused-result]
try.c:66:23: warning: ignoring return value of ‘ssize_t write(int, const void*, size_t)’, declared with attribute warn_unused_result [-Wunused-result]
try.c:72:35: warning: ignoring return value of ‘ssize_t write(int, const void*, size_t)’, declared with attribute warn_unused_result [-Wunused-result]
try.c:78:21: warning: ignoring return value of ‘ssize_t read(int, void*, size_t)’, declared with attribute warn_unused_result [-Wunused-result]
try.c: In function ‘int main(int, char**)’:
try.c:22:14: error: ‘KERN_PROC’ was not declared in this scope
try.c:23:14: error: ‘KERN_PROC_PATHNAME’ was not declared in this scope
try.c:48:25: error: invalid conversion from ‘void*’ to ‘char*’ [-fpermissive]
try.c:5785:17: warning: extra tokens at end of #ifdef directive [enabled by default]
try.c:5788:18: warning: extra tokens at end of #ifdef directive [enabled by default]
try.c:5791:19: warning: extra tokens at end of #ifdef directive [enabled by default]
try.c:5794:19: warning: extra tokens at end of #ifdef directive [enabled by default]
try.c:5821:17: warning: extra tokens at end of #ifdef directive [enabled by default]
try.c:5824:18: warning: extra tokens at end of #ifdef directive [enabled by default]
try.c:5827:19: warning: extra tokens at end of #ifdef directive [enabled by default]
try.c:5830:19: warning: extra tokens at end of #ifdef directive [enabled by default]
try.c:5857:17: warning: extra tokens at end of #ifdef directive [enabled by default]
try.c:5860:18: warning: extra tokens at end of #ifdef directive [enabled by default]
try.c:5863:19: warning: extra tokens at end of #ifdef directive [enabled by default]
try.c:5866:19: warning: extra tokens at end of #ifdef directive [enabled by default]
try.c:5893:16: warning: extra tokens at end of #ifdef directive [enabled by default]
try.c:5896:17: warning: extra tokens at end of #ifdef directive [enabled by default]
try.c:5899:18: warning: extra tokens at end of #ifdef directive [enabled by default]
try.c:5902:18: warning: extra tokens at end of #ifdef directive [enabled by default]
try.c:5929:18: warning: extra tokens at end of #ifdef directive [enabled by default]
try.c:5932:19: warning: extra tokens at end of #ifdef directive [enabled by default]
try.c:5935:20: warning: extra tokens at end of #ifdef directive [enabled by default]
try.c:5938:20: warning: extra tokens at end of #ifdef directive [enabled by default]
try.c:6817:18: warning: extra tokens at end of #ifdef directive [enabled by default]
try.c:6820:19: warning: extra tokens at end of #ifdef directive [enabled by default]
try.c:6823:20: warning: extra tokens at end of #ifdef directive [enabled by default]
try.c:6826:20: warning: extra tokens at end of #ifdef directive [enabled by default]
try.c:6853:18: warning: extra tokens at end of #ifdef directive [enabled by default]
try.c:6856:19: warning: extra tokens at end of #ifdef directive [enabled by default]
try.c:6859:20: warning: extra tokens at end of #ifdef directive [enabled by default]
try.c:6862:20: warning: extra tokens at end of #ifdef directive [enabled by default]
try.c:6889:18: warning: extra tokens at end of #ifdef directive [enabled by default]
try.c:6892:19: warning: extra tokens at end of #ifdef directive [enabled by default]
try.c:6895:20: warning: extra tokens at end of #ifdef directive [enabled by default]
try.c:6898:20: warning: extra tokens at end of #ifdef directive [enabled by default]
try.c:6925:17: warning: extra tokens at end of #ifdef directive [enabled by default]
try.c:6928:18: warning: extra tokens at end of #ifdef directive [enabled by default]
try.c:6931:19: warning: extra tokens at end of #ifdef directive [enabled by default]
try.c:6934:19: warning: extra tokens at end of #ifdef directive [enabled by default]
try.c:6961:19: warning: extra tokens at end of #ifdef directive [enabled by default]
try.c:6964:20: warning: extra tokens at end of #ifdef directive [enabled by default]
try.c:6967:21: warning: extra tokens at end of #ifdef directive [enabled by default]
try.c:6970:21: warning: extra tokens at end of #ifdef directive [enabled by default]
util.c: In function ‘char* S_write_no_mem()’:
util.c:68:34: warning: ignoring return value of ‘ssize_t write(int, const void*, size_t)’, declared with attribute warn_unused_result [-Wunused-result]
regexec.c: In function ‘char* S_find_byclass(regexp*, const regnode*, char*, const char*, regmatch_info*)’:
regexec.c:1604:6: warning: variable ‘ok’ set but not used [-Wunused-but-set-variable]
regexec.c:1610:6: warning: variable ‘ok’ set but not used [-Wunused-but-set-variable]
regexec.c:1615:6: warning: variable ‘ok’ set but not used [-Wunused-but-set-variable]
doio.c: In function ‘void S_exec_failed(const char*, int, int)’:
doio.c:1375:43: warning: ignoring return value of ‘ssize_t write(int, const void*, size_t)’, declared with attribute warn_unused_result [-Wunused-result]
regexec.c:1625:6: warning: variable ‘ok’ set but not used [-Wunused-but-set-variable]
regexec.c:1635:6: warning: variable ‘ok’ set but not used [-Wunused-but-set-variable]
regexec.c:1640:6: warning: variable ‘ok’ set but not used [-Wunused-but-set-variable]
regexec.c:1651:6: warning: variable ‘ok’ set but not used [-Wunused-but-set-variable]
regexec.c:1658:6: warning: variable ‘ok’ set but not used [-Wunused-but-set-variable]
regexec.c:1670:6: warning: variable ‘ok’ set but not used [-Wunused-but-set-variable]
regexec.c:1677:6: warning: variable ‘ok’ set but not used [-Wunused-but-set-variable]
regexec.c:1696:6: warning: variable ‘ok’ set but not used [-Wunused-but-set-variable]
regexec.c:1703:6: warning: variable ‘ok’ set but not used [-Wunused-but-set-variable]
regexec.c:1721:6: warning: variable ‘ok’ set but not used [-Wunused-but-set-variable]
regexec.c:1728:6: warning: variable ‘ok’ set but not used [-Wunused-but-set-variable]
regexec.c:1747:6: warning: variable ‘ok’ set but not used [-Wunused-but-set-variable]
doio.c: In function ‘PerlIOl** Perl_nextargv(GV*)’:
doio.c:872:46: warning: ignoring return value of ‘int fchown(int, __uid_t, __gid_t)’, declared with attribute warn_unused_result [-Wunused-result]
regexec.c:1765:6: warning: variable ‘ok’ set but not used [-Wunused-but-set-variable]
regexec.c: In function ‘I32 S_regmatch(regmatch_info*, regnode*)’:
regexec.c:3795:7: warning: variable ‘ok’ set but not used [-Wunused-but-set-variable]
regexec.c:3871:9: warning: variable ‘ok’ set but not used [-Wunused-but-set-variable]
regexec.c:3875:1: warning: variable ‘ok’ set but not used [-Wunused-but-set-variable]
regexec.c:3877:9: warning: variable ‘ok’ set but not used [-Wunused-but-set-variable]
regexec.c:3881:1: warning: variable ‘ok’ set but not used [-Wunused-but-set-variable]
regexec.c:3883:9: warning: variable ‘ok’ set but not used [-Wunused-but-set-variable]
regexec.c:3886:1: warning: variable ‘ok’ set but not used [-Wunused-but-set-variable]
regexec.c:3971:7: warning: variable ‘ok’ set but not used [-Wunused-but-set-variable]
regexec.c:3971:1: warning: variable ‘ok’ set but not used [-Wunused-but-set-variable]
regexec.c:3971:1: warning: variable ‘throw_away’ set but not used [-Wunused-but-set-variable]
perlio.c: In function ‘void S_more_refcounted_fds(int)’:
perlio.c:2354:38: warning: ignoring return value of ‘ssize_t write(int, const void*, size_t)’, declared with attribute warn_unused_result [-Wunused-result]
regexec.c: In function ‘I32 S_regrepeat(const regexp*, const regnode*, I32, int)’:
regexec.c:6142:6: warning: variable ‘ok’ set but not used [-Wunused-but-set-variable]
mg_vtable.h:95:54: warning: ‘PL_magic_vtable_names’ initialized and declared ‘extern’ [enabled by default]
sv.c: In function ‘void Perl_sv_vcatpvfn(SV*, const char*, STRLEN, __va_list_tag (*)[1], SV**, I32, bool*)’:
sv.c:10122:41: warning: ignoring return value of ‘char* gcvt(double, int, char*)’, declared with attribute warn_unused_result [-Wunused-result]
sv.c:10971:53: warning: ignoring return value of ‘char* gcvt(double, int, char*)’, declared with attribute warn_unused_result [-Wunused-result]
regexec.c:6187:6: warning: variable ‘ok’ set but not used [-Wunused-but-set-variable]
regexec.c:6239:6: warning: variable ‘ok’ set but not used [-Wunused-but-set-variable]
regexec.c:6288:6: warning: variable ‘ok’ set but not used [-Wunused-but-set-variable]
regexec.c:6341:6: warning: variable ‘ok’ set but not used [-Wunused-but-set-variable]
perlio.c: In function ‘void PerlIO_debug(const char*, ...)’:
perlio.c:497:43: warning: ignoring return value of ‘ssize_t write(int, const void*, size_t)’, declared with attribute warn_unused_result [-Wunused-result]
regexec.c:6374:6: warning: variable ‘ok’ set but not used [-Wunused-but-set-variable]
pp_ctl.c: In function ‘OP* Perl_pp_goto()’:
pp_ctl.c:2969:8: warning: variable ‘newsp’ set but not used [-Wunused-but-set-variable]
pp_ctl.c:2970:7: warning: variable ‘gimme’ set but not used [-Wunused-but-set-variable]
sv.c: In function ‘char* Perl_sv_2pv_flags(SV*, STRLEN*, I32)’:
sv.c:2750:39: warning: ignoring return value of ‘char* gcvt(double, int, char*)’, declared with attribute warn_unused_result [-Wunused-result]
sv.c:2942:39: warning: ignoring return value of ‘char* gcvt(double, int, char*)’, declared with attribute warn_unused_result [-Wunused-result]
sdbm.c: In function ‘int makroom(DBM*, long int, int)’:
sdbm.c:371:70: warning: ignoring return value of ‘ssize_t write(int, const void*, size_t)’, declared with attribute warn_unused_result [-Wunused-result]
Call.xs: In function ‘I32 filter_call(int, SV*, int)’:
Call.xs:63:58: warning: format ‘%d’ expects argument of type ‘int’, but argument 3 has type ‘STRLEN {aka long unsigned int}’ [-Wformat]
Call.xs:63:58: warning: format ‘%d’ expects argument of type ‘int’, but argument 5 has type ‘STRLEN {aka long unsigned int}’ [-Wformat]
Call.xs:100:41: warning: format ‘%d’ expects argument of type ‘int’, but argument 4 has type ‘STRLEN {aka long unsigned int}’ [-Wformat]
Call.xs:156:38: warning: format ‘%d’ expects argument of type ‘int’, but argument 3 has type ‘STRLEN {aka long unsigned int}’ [-Wformat]
Call.xs:175:51: warning: format ‘%d’ expects argument of type ‘int’, but argument 4 has type ‘long unsigned int’ [-Wformat]
regcomp.c: In function ‘void S_dump_trie(const _reg_trie_data*, HV*, AV*, U32)’:
regcomp.c:1048:5: warning: variable ‘re_debug_flags’ set but not used [-Wunused-but-set-variable]
regcomp.c: In function ‘void S_dump_trie_interim_list(const _reg_trie_data*, HV*, AV*, U32, U32)’:
regcomp.c:1139:5: warning: variable ‘re_debug_flags’ set but not used [-Wunused-but-set-variable]
regcomp.c: In function ‘void S_dump_trie_interim_table(const _reg_trie_data*, HV*, AV*, U32, U32)’:
regcomp.c:1197:5: warning: variable ‘re_debug_flags’ set but not used [-Wunused-but-set-variable]
regcomp.c: In function ‘REGEXP* Perl_re_compile(SV*, U32)’:
regcomp.c:5737:5: warning: variable ‘re_debug_flags’ set but not used [-Wunused-but-set-variable]
regcomp.c: In function ‘SV* Perl_reg_named_buff_nextkey(REGEXP*, U32)’:
regcomp.c:5887:5: warning: variable ‘re_debug_flags’ set but not used [-Wunused-but-set-variable]
regcomp.c: In function ‘void Perl_pregfree2(REGEXP*)’:
regcomp.c:12690:5: warning: variable ‘re_debug_flags’ set but not used [-Wunused-but-set-variable]
regexec.c: In function ‘char* S_find_byclass(PerlInterpreter*, regexp*, const regnode*, char*, const char*, regmatch_info*)’:
regexec.c: In function ‘I32 S_regmatch(PerlInterpreter*, regmatch_info*, regnode*)’:
regexec.c:3795:1: warning: variable ‘ok’ set but not used [-Wunused-but-set-variable]
util.c: In function ‘char* S_write_no_mem(PerlInterpreter*)’:
doio.c: In function ‘void S_exec_failed(PerlInterpreter*, const char*, int, int)’:
regexec.c: In function ‘I32 S_regrepeat(PerlInterpreter*, const regexp*, const regnode*, I32, int)’:
regexec.c:6142:1: warning: variable ‘ok’ set but not used [-Wunused-but-set-variable]
regexec.c:6187:1: warning: variable ‘ok’ set but not used [-Wunused-but-set-variable]
regexec.c:6239:1: warning: variable ‘ok’ set but not used [-Wunused-but-set-variable]
regexec.c:6288:1: warning: variable ‘ok’ set but not used [-Wunused-but-set-variable]
regexec.c:6341:1: warning: variable ‘ok’ set but not used [-Wunused-but-set-variable]
regexec.c:6374:1: warning: variable ‘ok’ set but not used [-Wunused-but-set-variable]
pp_ctl.c: In function ‘OP* Perl_pp_goto(PerlInterpreter*)’:
perlio.c: In function ‘void S_more_refcounted_fds(PerlInterpreter*, int)’:
perlio.c:488:56: warning: ignoring return value of ‘ssize_t write(int, const void*, size_t)’, declared with attribute warn_unused_result [-Wunused-result]
perl.c: In function ‘void S_init_tls_and_interp(PerlInterpreter*)’:
perl.c:103:2: warning: ignoring return value of ‘ssize_t write(int, const void*, size_t)’, declared with attribute warn_unused_result [-Wunused-result]
sv.c: In function ‘DIR* Perl_dirp_dup(PerlInterpreter*, DIR*, CLONE_PARAMS*)’:
sv.c:11418:26: warning: ignoring return value of ‘int fchdir(int)’, declared with attribute warn_unused_result [-Wunused-result]
sv.c: In function ‘void Perl_sv_vcatpvfn(PerlInterpreter*, SV*, const char*, STRLEN, __va_list_tag (*)[1], SV**, I32, bool*)’:
sv.c: In function ‘char* Perl_sv_2pv_flags(PerlInterpreter*, SV*, STRLEN*, I32)’:
Call.xs: In function ‘I32 filter_call(PerlInterpreter*, int, SV*, int)’:
threads.xs: In function ‘ithread* S_ithread_create(PerlInterpreter*, SV*, IV, int, int, int, int)’:
threads.xs:714:83: warning: ignoring return value of ‘ssize_t write(int, const void*, size_t)’, declared with attribute warn_unused_result [-Wunused-result]
shared.xs: In function ‘user_lock* S_get_userlock(PerlInterpreter*, SV*, bool)’:
shared.xs:348:5: warning: deprecated conversion from string constant to ‘char*’ [-Wwrite-strings]
shared.xs: In function ‘void S_sharedsv_dec(PerlInterpreter*, SV*)’:
shared.xs:521:5: warning: deprecated conversion from string constant to ‘char*’ [-Wwrite-strings]
shared.xs: In function ‘void Perl_sharedsv_share(PerlInterpreter*, SV*)’:
shared.xs:550:9: warning: deprecated conversion from string constant to ‘char*’ [-Wwrite-strings]
shared.xs: In function ‘int sharedsv_scalar_mg_get(PerlInterpreter*, SV*, MAGIC*)’:
shared.xs:725:5: warning: deprecated conversion from string constant to ‘char*’ [-Wwrite-strings]
shared.xs: In function ‘int sharedsv_scalar_mg_set(PerlInterpreter*, SV*, MAGIC*)’:
shared.xs:803:5: warning: deprecated conversion from string constant to ‘char*’ [-Wwrite-strings]
shared.xs: In function ‘int sharedsv_scalar_mg_free(PerlInterpreter*, SV*, MAGIC*)’:
shared.xs:821:5: warning: deprecated conversion from string constant to ‘char*’ [-Wwrite-strings]
shared.xs: In function ‘int sharedsv_scalar_mg_local(PerlInterpreter*, SV*, MAGIC*)’:
shared.xs:854:9: warning: deprecated conversion from string constant to ‘char*’ [-Wwrite-strings]
shared.xs: In function ‘int sharedsv_elem_mg_FETCH(PerlInterpreter*, SV*, MAGIC*)’:
shared.xs:891:5: warning: deprecated conversion from string constant to ‘char*’ [-Wwrite-strings]
shared.xs: In function ‘int sharedsv_elem_mg_STORE(PerlInterpreter*, SV*, MAGIC*)’:
shared.xs:944:5: warning: deprecated conversion from string constant to ‘char*’ [-Wwrite-strings]
shared.xs: In function ‘int sharedsv_elem_mg_DELETE(PerlInterpreter*, SV*, MAGIC*)’:
shared.xs:986:5: warning: deprecated conversion from string constant to ‘char*’ [-Wwrite-strings]
shared.xs: In function ‘U32 sharedsv_array_mg_FETCHSIZE(PerlInterpreter*, SV*, MAGIC*)’:
shared.xs:1049:5: warning: deprecated conversion from string constant to ‘char*’ [-Wwrite-strings]
shared.xs: In function ‘int sharedsv_array_mg_CLEAR(PerlInterpreter*, SV*, MAGIC*)’:
shared.xs:1069:5: warning: deprecated conversion from string constant to ‘char*’ [-Wwrite-strings]
shared.xs: In function ‘void Perl_sharedsv_lock(PerlInterpreter*, SV*)’:
shared.xs:1173:63: warning: deprecated conversion from string constant to ‘char*’ [-Wwrite-strings]
shared.xs: In function ‘void XS_threads__shared__tie_PUSH(PerlInterpreter*, CV*)’:
shared.xs:1269:13: warning: deprecated conversion from string constant to ‘char*’ [-Wwrite-strings]
shared.xs: In function ‘void XS_threads__shared__tie_UNSHIFT(PerlInterpreter*, CV*)’:
shared.xs:1286:9: warning: deprecated conversion from string constant to ‘char*’ [-Wwrite-strings]
shared.xs: In function ‘void XS_threads__shared__tie_POP(PerlInterpreter*, CV*)’:
shared.xs:1309:9: warning: deprecated conversion from string constant to ‘char*’ [-Wwrite-strings]
shared.xs: In function ‘void XS_threads__shared__tie_SHIFT(PerlInterpreter*, CV*)’:
shared.xs:1326:9: warning: deprecated conversion from string constant to ‘char*’ [-Wwrite-strings]
shared.xs: In function ‘void XS_threads__shared__tie_EXTEND(PerlInterpreter*, CV*)’:
shared.xs:1342:9: warning: deprecated conversion from string constant to ‘char*’ [-Wwrite-strings]
shared.xs: In function ‘void XS_threads__shared__tie_STORESIZE(PerlInterpreter*, CV*)’:
shared.xs:1352:9: warning: deprecated conversion from string constant to ‘char*’ [-Wwrite-strings]
shared.xs: In function ‘void XS_threads__shared__tie_EXISTS(PerlInterpreter*, CV*)’:
shared.xs:1364:13: warning: deprecated conversion from string constant to ‘char*’ [-Wwrite-strings]
shared.xs:1374:13: warning: deprecated conversion from string constant to ‘char*’ [-Wwrite-strings]
shared.xs: In function ‘void XS_threads__shared__tie_FIRSTKEY(PerlInterpreter*, CV*)’:
shared.xs:1390:9: warning: deprecated conversion from string constant to ‘char*’ [-Wwrite-strings]
shared.xs: In function ‘void XS_threads__shared__tie_NEXTKEY(PerlInterpreter*, CV*)’:
shared.xs:1418:9: warning: deprecated conversion from string constant to ‘char*’ [-Wwrite-strings]
shared.xs: In function ‘void XS_threads__shared_bless(PerlInterpreter*, CV*)’:
shared.xs:1678:13: warning: deprecated conversion from string constant to ‘char*’ [-Wwrite-strings]
regcomp.c: In function ‘void S_dump_trie(PerlInterpreter*, const _reg_trie_data*, HV*, AV*, U32)’:
regcomp.c: In function ‘void S_dump_trie_interim_list(PerlInterpreter*, const _reg_trie_data*, HV*, AV*, U32, U32)’:
regcomp.c: In function ‘void S_dump_trie_interim_table(PerlInterpreter*, const _reg_trie_data*, HV*, AV*, U32, U32)’:
doio.c: In function ‘PerlIOl** Perl_nextargv(PerlInterpreter*, GV*)’:
regcomp.c: In function ‘REGEXP* Perl_re_compile(PerlInterpreter*, SV*, U32)’:
regcomp.c: In function ‘SV* Perl_reg_named_buff_nextkey(PerlInterpreter*, REGEXP*, U32)’:
regcomp.c: In function ‘void Perl_pregfree2(PerlInterpreter*, REGEXP*)’:
-- 
Report by Test::Smoke v1.44 build 1285 running on perl 5.14.2
(Reporter v0.035 / Smoker v0.045)




nntp.perl.org: Perl Programming lists via nntp and http.
Comments to Ask Bjørn Hansen at ask@perl.org | Group listing | About