develooper Front page | perl.perl5.porters | Postings from March 2012

Smoke [blead] v5.15.9-47-g63429d5 FAIL(XF) linux 3.0.0-15-generic [debian] (x86_64/8 cpu)

Thread Next
From:
George Greer
Date:
March 28, 2012 18:03
Subject:
Smoke [blead] v5.15.9-47-g63429d5 FAIL(XF) linux 3.0.0-15-generic [debian] (x86_64/8 cpu)
Message ID:
201203290103.q2T13EPZ028042@m-l.org
Smoke logs available at http://m-l.org/~perl/smoke/perl/

Automated smoke report for 5.15.9 patch 63429d50b5b6c112d030f925ddce05a84d042758 v5.15.9-47-g63429d5
zwei: Intel(R) Core(TM) i7 CPU 920 @ 2.67GHz (GenuineIntel 1600MHz) (x86_64/8 cpu)
    on        linux - 3.0.0-15-generic [debian]
    using     g++ version 4.6.1
    smoketime 17 hours 3 minutes (average 51 minutes 11 seconds)

Summary: FAIL(XF)

O = OK  F = Failure(s), extended report at the bottom
X = Failure(s) under TEST but not under harness
? = still running or test results not (yet) available
Build failures during:       - = unknown or N/A
c = Configure, m = make, M = make (after miniperl), t = make test-prep

v5.15.9-47-g63429d5  Configuration (common) -Dcc=g++ -O
----------- ---------------------------------------------------------
O O F O O O F O -Uusenm
O O F O O O F O -Uusenm -Accflags=-DPERL_POISON
O O F O O O F O -Uusenm -Duse64bitall
O O F O O O F O -Uusenm -Dusemorebits
O O F X O O F O -Uusenm -Dmad
O O F O O O F O -Uusenm -Duseithreads
O O F O O O F O -Uusenm -Duseithreads -Accflags=-DPERL_POISON
O O F O O O F O -Uusenm -Duseithreads -Duse64bitall
O O F O X X F X -Uusenm -Duseithreads -Dusemorebits
O O F O O O F O -Uusenm -Duseithreads -Dmad
| | | | | +- LC_ALL = en_US.utf8 -DDEBUGGING
| | | | +--- PERLIO = perlio -DDEBUGGING
| | | +----- PERLIO = stdio  -DDEBUGGING
| | +------- LC_ALL = en_US.utf8
| +--------- PERLIO = perlio
+----------- PERLIO = stdio 

Locally applied patches:
    uncommitted-changes
    SMOKE63429d50b5b6c112d030f925ddce05a84d042758

Failures: (common-args) -Dcc=g++ -O
[minitest] -Uusenm
[minitest] -DDEBUGGING -Uusenm
[minitest] -Uusenm -Accflags=-DPERL_POISON
[minitest] -DDEBUGGING -Uusenm -Accflags=-DPERL_POISON
[minitest] -Uusenm -Duse64bitall
[minitest] -DDEBUGGING -Uusenm -Duse64bitall
[minitest] -Uusenm -Dusemorebits
[minitest] -DDEBUGGING -Uusenm -Dusemorebits
[minitest] -Uusenm -Dmad
[minitest] -DDEBUGGING -Uusenm -Dmad
[minitest] -Uusenm -Duseithreads
[minitest] -DDEBUGGING -Uusenm -Duseithreads
[minitest] -Uusenm -Duseithreads -Accflags=-DPERL_POISON
[minitest] -DDEBUGGING -Uusenm -Duseithreads -Accflags=-DPERL_POISON
[minitest] -Uusenm -Duseithreads -Duse64bitall
[minitest] -DDEBUGGING -Uusenm -Duseithreads -Duse64bitall
[minitest] -Uusenm -Duseithreads -Dusemorebits
[minitest] -DDEBUGGING -Uusenm -Duseithreads -Dusemorebits
[minitest] -Uusenm -Duseithreads -Dmad
[minitest] -DDEBUGGING -Uusenm -Duseithreads -Dmad
    t/uni/labels ................... FAILED--expected 9 tests, saw 8
    t/uni/parser ................... FAILED at test 38

[en_US.utf8] -Uusenm -Dmad
[stdio] -DDEBUGGING -Uusenm -Duseithreads -Dusemorebits
Inconsistent test results (between TEST and harness):
    ../lib/Benchmark.t...................... ................................................ FAILED at test 15

[perlio/en_US.utf8] -DDEBUGGING -Uusenm -Duseithreads -Dusemorebits
Inconsistent test results (between TEST and harness):
    ../t/comp/require.t..................... ............................................... FAILED at test 46

Compiler messages(gcc):
try.c: In function ‘int main()’:
try.c:36:10: warning: ignoring return value of ‘int pipe(int*)’, declared with attribute warn_unused_result [-Wunused-result]
try.c:37:10: warning: ignoring return value of ‘int pipe(int*)’, declared with attribute warn_unused_result [-Wunused-result]
try.c:53:35: warning: ignoring return value of ‘ssize_t write(int, const void*, size_t)’, declared with attribute warn_unused_result [-Wunused-result]
try.c:66:23: warning: ignoring return value of ‘ssize_t write(int, const void*, size_t)’, declared with attribute warn_unused_result [-Wunused-result]
try.c:72:35: warning: ignoring return value of ‘ssize_t write(int, const void*, size_t)’, declared with attribute warn_unused_result [-Wunused-result]
try.c:78:21: warning: ignoring return value of ‘ssize_t read(int, void*, size_t)’, declared with attribute warn_unused_result [-Wunused-result]
try.c: In function ‘int main(int, char**)’:
try.c:22:14: error: ‘KERN_PROC’ was not declared in this scope
try.c:23:14: error: ‘KERN_PROC_PATHNAME’ was not declared in this scope
try.c:48:25: error: invalid conversion from ‘void*’ to ‘char*’ [-fpermissive]
try.c:5785:17: warning: extra tokens at end of #ifdef directive [enabled by default]
try.c:5788:18: warning: extra tokens at end of #ifdef directive [enabled by default]
try.c:5791:19: warning: extra tokens at end of #ifdef directive [enabled by default]
try.c:5794:19: warning: extra tokens at end of #ifdef directive [enabled by default]
try.c:5821:17: warning: extra tokens at end of #ifdef directive [enabled by default]
try.c:5824:18: warning: extra tokens at end of #ifdef directive [enabled by default]
try.c:5827:19: warning: extra tokens at end of #ifdef directive [enabled by default]
try.c:5830:19: warning: extra tokens at end of #ifdef directive [enabled by default]
try.c:5857:17: warning: extra tokens at end of #ifdef directive [enabled by default]
try.c:5860:18: warning: extra tokens at end of #ifdef directive [enabled by default]
try.c:5863:19: warning: extra tokens at end of #ifdef directive [enabled by default]
try.c:5866:19: warning: extra tokens at end of #ifdef directive [enabled by default]
try.c:5893:16: warning: extra tokens at end of #ifdef directive [enabled by default]
try.c:5896:17: warning: extra tokens at end of #ifdef directive [enabled by default]
try.c:5899:18: warning: extra tokens at end of #ifdef directive [enabled by default]
try.c:5902:18: warning: extra tokens at end of #ifdef directive [enabled by default]
try.c:5929:18: warning: extra tokens at end of #ifdef directive [enabled by default]
try.c:5932:19: warning: extra tokens at end of #ifdef directive [enabled by default]
try.c:5935:20: warning: extra tokens at end of #ifdef directive [enabled by default]
try.c:5938:20: warning: extra tokens at end of #ifdef directive [enabled by default]
try.c:6817:18: warning: extra tokens at end of #ifdef directive [enabled by default]
try.c:6820:19: warning: extra tokens at end of #ifdef directive [enabled by default]
try.c:6823:20: warning: extra tokens at end of #ifdef directive [enabled by default]
try.c:6826:20: warning: extra tokens at end of #ifdef directive [enabled by default]
try.c:6853:18: warning: extra tokens at end of #ifdef directive [enabled by default]
try.c:6856:19: warning: extra tokens at end of #ifdef directive [enabled by default]
try.c:6859:20: warning: extra tokens at end of #ifdef directive [enabled by default]
try.c:6862:20: warning: extra tokens at end of #ifdef directive [enabled by default]
try.c:6889:18: warning: extra tokens at end of #ifdef directive [enabled by default]
try.c:6892:19: warning: extra tokens at end of #ifdef directive [enabled by default]
try.c:6895:20: warning: extra tokens at end of #ifdef directive [enabled by default]
try.c:6898:20: warning: extra tokens at end of #ifdef directive [enabled by default]
try.c:6925:17: warning: extra tokens at end of #ifdef directive [enabled by default]
try.c:6928:18: warning: extra tokens at end of #ifdef directive [enabled by default]
try.c:6931:19: warning: extra tokens at end of #ifdef directive [enabled by default]
try.c:6934:19: warning: extra tokens at end of #ifdef directive [enabled by default]
try.c:6961:19: warning: extra tokens at end of #ifdef directive [enabled by default]
try.c:6964:20: warning: extra tokens at end of #ifdef directive [enabled by default]
try.c:6967:21: warning: extra tokens at end of #ifdef directive [enabled by default]
try.c:6970:21: warning: extra tokens at end of #ifdef directive [enabled by default]
perlio.c: In function ‘void S_more_refcounted_fds(int)’:
perlio.c:2350:38: warning: ignoring return value of ‘ssize_t write(int, const void*, size_t)’, declared with attribute warn_unused_result [-Wunused-result]
perlio.c: In function ‘void PerlIO_debug(const char*, ...)’:
perlio.c:493:43: warning: ignoring return value of ‘ssize_t write(int, const void*, size_t)’, declared with attribute warn_unused_result [-Wunused-result]
regexec.c: In function ‘char* S_find_byclass(regexp*, const regnode*, char*, const char*, regmatch_info*)’:
regexec.c:1604:6: warning: variable ‘ok’ set but not used [-Wunused-but-set-variable]
regexec.c:1610:6: warning: variable ‘ok’ set but not used [-Wunused-but-set-variable]
regexec.c:1615:6: warning: variable ‘ok’ set but not used [-Wunused-but-set-variable]
regexec.c:1625:6: warning: variable ‘ok’ set but not used [-Wunused-but-set-variable]
regexec.c:1635:6: warning: variable ‘ok’ set but not used [-Wunused-but-set-variable]
regexec.c:1640:6: warning: variable ‘ok’ set but not used [-Wunused-but-set-variable]
regexec.c:1651:6: warning: variable ‘ok’ set but not used [-Wunused-but-set-variable]
regexec.c:1658:6: warning: variable ‘ok’ set but not used [-Wunused-but-set-variable]
regexec.c:1670:6: warning: variable ‘ok’ set but not used [-Wunused-but-set-variable]
regexec.c:1677:6: warning: variable ‘ok’ set but not used [-Wunused-but-set-variable]
regexec.c:1696:6: warning: variable ‘ok’ set but not used [-Wunused-but-set-variable]
regexec.c:1703:6: warning: variable ‘ok’ set but not used [-Wunused-but-set-variable]
regexec.c:1721:6: warning: variable ‘ok’ set but not used [-Wunused-but-set-variable]
regexec.c:1728:6: warning: variable ‘ok’ set but not used [-Wunused-but-set-variable]
regexec.c:1747:6: warning: variable ‘ok’ set but not used [-Wunused-but-set-variable]
regexec.c:1765:6: warning: variable ‘ok’ set but not used [-Wunused-but-set-variable]
regexec.c: In function ‘I32 S_regmatch(regmatch_info*, regnode*)’:
regexec.c:3753:7: warning: variable ‘ok’ set but not used [-Wunused-but-set-variable]
regexec.c:3829:9: warning: variable ‘ok’ set but not used [-Wunused-but-set-variable]
regexec.c:3833:1: warning: variable ‘ok’ set but not used [-Wunused-but-set-variable]
regexec.c:3835:9: warning: variable ‘ok’ set but not used [-Wunused-but-set-variable]
regexec.c:3839:1: warning: variable ‘ok’ set but not used [-Wunused-but-set-variable]
regexec.c:3841:9: warning: variable ‘ok’ set but not used [-Wunused-but-set-variable]
regexec.c:3844:1: warning: variable ‘ok’ set but not used [-Wunused-but-set-variable]
regexec.c:3929:7: warning: variable ‘ok’ set but not used [-Wunused-but-set-variable]
regexec.c:3929:1: warning: variable ‘ok’ set but not used [-Wunused-but-set-variable]
regexec.c:3929:1: warning: variable ‘throw_away’ set but not used [-Wunused-but-set-variable]
pp_ctl.c: In function ‘OP* Perl_pp_goto()’:
pp_ctl.c:2955:8: warning: variable ‘newsp’ set but not used [-Wunused-but-set-variable]
pp_ctl.c:2956:7: warning: variable ‘gimme’ set but not used [-Wunused-but-set-variable]
utf8.c: In function ‘UV Perl_to_utf8_case(const U8*, U8*, STRLEN*, SV**, const char*, const char*)’:
utf8.c:2265:18: warning: ‘UV Perl_utf8_to_uvchr(const U8*, STRLEN*)’ is deprecated (declared at utf8.c:855) [-Wdeprecated-declarations]
util.c: In function ‘char* S_write_no_mem()’:
util.c:68:34: warning: ignoring return value of ‘ssize_t write(int, const void*, size_t)’, declared with attribute warn_unused_result [-Wunused-result]
regexec.c: In function ‘I32 S_regrepeat(const regexp*, const regnode*, I32, int)’:
regexec.c:6113:6: warning: variable ‘ok’ set but not used [-Wunused-but-set-variable]
regexec.c:6158:6: warning: variable ‘ok’ set but not used [-Wunused-but-set-variable]
regexec.c:6210:6: warning: variable ‘ok’ set but not used [-Wunused-but-set-variable]
regexec.c:6259:6: warning: variable ‘ok’ set but not used [-Wunused-but-set-variable]
regexec.c:6312:6: warning: variable ‘ok’ set but not used [-Wunused-but-set-variable]
regexec.c:6345:6: warning: variable ‘ok’ set but not used [-Wunused-but-set-variable]
doio.c: In function ‘void S_exec_failed(const char*, int, int)’:
doio.c:1378:43: warning: ignoring return value of ‘ssize_t write(int, const void*, size_t)’, declared with attribute warn_unused_result [-Wunused-result]
doio.c: In function ‘PerlIOl** Perl_nextargv(GV*)’:
doio.c:872:46: warning: ignoring return value of ‘int fchown(int, __uid_t, __gid_t)’, declared with attribute warn_unused_result [-Wunused-result]
sv.c: In function ‘void Perl_sv_vcatpvfn(SV*, const char*, STRLEN, __va_list_tag (*)[1], SV**, I32, bool*)’:
sv.c:10126:41: warning: ignoring return value of ‘char* gcvt(double, int, char*)’, declared with attribute warn_unused_result [-Wunused-result]
sv.c:10975:53: warning: ignoring return value of ‘char* gcvt(double, int, char*)’, declared with attribute warn_unused_result [-Wunused-result]
mg_vtable.h:98:54: warning: ‘PL_magic_vtable_names’ initialized and declared ‘extern’ [enabled by default]
sv.c: In function ‘char* Perl_sv_2pv_flags(SV*, STRLEN*, I32)’:
sv.c:2750:39: warning: ignoring return value of ‘char* gcvt(double, int, char*)’, declared with attribute warn_unused_result [-Wunused-result]
sv.c:2942:39: warning: ignoring return value of ‘char* gcvt(double, int, char*)’, declared with attribute warn_unused_result [-Wunused-result]
regcomp.c: In function ‘regnode* S_regclass(RExC_state_t*, U32)’:
regcomp.c:10943:7: warning: ignoring return value of ‘regex_charset get_regex_charset(U32)’, declared with attribute warn_unused_result [-Wunused-result]
sdbm.c: In function ‘int makroom(DBM*, long int, int)’:
sdbm.c:371:70: warning: ignoring return value of ‘ssize_t write(int, const void*, size_t)’, declared with attribute warn_unused_result [-Wunused-result]
Call.xs: In function ‘I32 filter_call(int, SV*, int)’:
Call.xs:63:58: warning: format ‘%d’ expects argument of type ‘int’, but argument 3 has type ‘STRLEN {aka long unsigned int}’ [-Wformat]
Call.xs:63:58: warning: format ‘%d’ expects argument of type ‘int’, but argument 5 has type ‘STRLEN {aka long unsigned int}’ [-Wformat]
Call.xs:100:41: warning: format ‘%d’ expects argument of type ‘int’, but argument 4 has type ‘STRLEN {aka long unsigned int}’ [-Wformat]
Call.xs:156:38: warning: format ‘%d’ expects argument of type ‘int’, but argument 3 has type ‘STRLEN {aka long unsigned int}’ [-Wformat]
Call.xs:175:51: warning: format ‘%d’ expects argument of type ‘int’, but argument 4 has type ‘long unsigned int’ [-Wformat]
re_comp.c: In function ‘regnode* S_regclass(RExC_state_t*, U32)’:
re_comp.c:10943:7: warning: ignoring return value of ‘regex_charset get_regex_charset(U32)’, declared with attribute warn_unused_result [-Wunused-result]
regcomp.c: In function ‘void S_dump_trie(const _reg_trie_data*, HV*, AV*, U32)’:
regcomp.c:1045:5: warning: variable ‘re_debug_flags’ set but not used [-Wunused-but-set-variable]
regcomp.c: In function ‘void S_dump_trie_interim_list(const _reg_trie_data*, HV*, AV*, U32, U32)’:
regcomp.c:1136:5: warning: variable ‘re_debug_flags’ set but not used [-Wunused-but-set-variable]
regcomp.c: In function ‘void S_dump_trie_interim_table(const _reg_trie_data*, HV*, AV*, U32, U32)’:
regcomp.c:1194:5: warning: variable ‘re_debug_flags’ set but not used [-Wunused-but-set-variable]
regcomp.c: In function ‘REGEXP* Perl_re_compile(SV*, U32)’:
regcomp.c:5734:5: warning: variable ‘re_debug_flags’ set but not used [-Wunused-but-set-variable]
regcomp.c: In function ‘SV* Perl_reg_named_buff_nextkey(REGEXP*, U32)’:
regcomp.c:5884:5: warning: variable ‘re_debug_flags’ set but not used [-Wunused-but-set-variable]
regcomp.c: In function ‘void Perl_pregfree2(REGEXP*)’:
regcomp.c:12685:5: warning: variable ‘re_debug_flags’ set but not used [-Wunused-but-set-variable]
sv.c:10975:53: warning: ignoring return value of ‘char* qgcvt(long double, int, char*)’, declared with attribute warn_unused_result [-Wunused-result]
sv.c:2750:39: warning: ignoring return value of ‘char* qgcvt(long double, int, char*)’, declared with attribute warn_unused_result [-Wunused-result]
sv.c:2942:39: warning: ignoring return value of ‘char* qgcvt(long double, int, char*)’, declared with attribute warn_unused_result [-Wunused-result]
toke.c: In function ‘int Perl_yylex()’:
toke.c:8089:19: warning: variable ‘have_proto’ set but not used [-Wunused-but-set-variable]
perlio.c: In function ‘void S_more_refcounted_fds(PerlInterpreter*, int)’:
perlio.c:484:56: warning: ignoring return value of ‘ssize_t write(int, const void*, size_t)’, declared with attribute warn_unused_result [-Wunused-result]
utf8.c: In function ‘UV Perl_to_utf8_case(PerlInterpreter*, const U8*, U8*, STRLEN*, SV**, const char*, const char*)’:
utf8.c:2265:18: warning: ‘UV Perl_utf8_to_uvchr(PerlInterpreter*, const U8*, STRLEN*)’ is deprecated (declared at utf8.c:855) [-Wdeprecated-declarations]
util.c: In function ‘char* S_write_no_mem(PerlInterpreter*)’:
regexec.c: In function ‘char* S_find_byclass(PerlInterpreter*, regexp*, const regnode*, char*, const char*, regmatch_info*)’:
pp_ctl.c: In function ‘OP* Perl_pp_goto(PerlInterpreter*)’:
regexec.c: In function ‘I32 S_regmatch(PerlInterpreter*, regmatch_info*, regnode*)’:
regexec.c:3753:1: warning: variable ‘ok’ set but not used [-Wunused-but-set-variable]
doio.c: In function ‘void S_exec_failed(PerlInterpreter*, const char*, int, int)’:
regexec.c: In function ‘I32 S_regrepeat(PerlInterpreter*, const regexp*, const regnode*, I32, int)’:
regexec.c:6113:1: warning: variable ‘ok’ set but not used [-Wunused-but-set-variable]
regexec.c:6158:1: warning: variable ‘ok’ set but not used [-Wunused-but-set-variable]
regexec.c:6210:1: warning: variable ‘ok’ set but not used [-Wunused-but-set-variable]
regexec.c:6259:1: warning: variable ‘ok’ set but not used [-Wunused-but-set-variable]
regexec.c:6312:1: warning: variable ‘ok’ set but not used [-Wunused-but-set-variable]
regexec.c:6345:1: warning: variable ‘ok’ set but not used [-Wunused-but-set-variable]
doio.c: In function ‘PerlIOl** Perl_nextargv(PerlInterpreter*, GV*)’:
regcomp.c: In function ‘regnode* S_regclass(PerlInterpreter*, RExC_state_t*, U32)’:
perl.c: In function ‘void S_init_tls_and_interp(PerlInterpreter*)’:
perl.c:103:2: warning: ignoring return value of ‘ssize_t write(int, const void*, size_t)’, declared with attribute warn_unused_result [-Wunused-result]
sv.c: In function ‘DIR* Perl_dirp_dup(PerlInterpreter*, DIR*, CLONE_PARAMS*)’:
sv.c:11422:26: warning: ignoring return value of ‘int fchdir(int)’, declared with attribute warn_unused_result [-Wunused-result]
sv.c: In function ‘void Perl_sv_vcatpvfn(PerlInterpreter*, SV*, const char*, STRLEN, __va_list_tag (*)[1], SV**, I32, bool*)’:
sv.c: In function ‘char* Perl_sv_2pv_flags(PerlInterpreter*, SV*, STRLEN*, I32)’:
Call.xs: In function ‘I32 filter_call(PerlInterpreter*, int, SV*, int)’:
shared.xs: In function ‘user_lock* S_get_userlock(PerlInterpreter*, SV*, bool)’:
shared.xs:348:5: warning: deprecated conversion from string constant to ‘char*’ [-Wwrite-strings]
shared.xs: In function ‘void S_sharedsv_dec(PerlInterpreter*, SV*)’:
shared.xs:521:5: warning: deprecated conversion from string constant to ‘char*’ [-Wwrite-strings]
shared.xs: In function ‘void Perl_sharedsv_share(PerlInterpreter*, SV*)’:
shared.xs:550:9: warning: deprecated conversion from string constant to ‘char*’ [-Wwrite-strings]
shared.xs: In function ‘int sharedsv_scalar_mg_get(PerlInterpreter*, SV*, MAGIC*)’:
shared.xs:725:5: warning: deprecated conversion from string constant to ‘char*’ [-Wwrite-strings]
shared.xs: In function ‘int sharedsv_scalar_mg_set(PerlInterpreter*, SV*, MAGIC*)’:
shared.xs:803:5: warning: deprecated conversion from string constant to ‘char*’ [-Wwrite-strings]
shared.xs: In function ‘int sharedsv_scalar_mg_free(PerlInterpreter*, SV*, MAGIC*)’:
shared.xs:821:5: warning: deprecated conversion from string constant to ‘char*’ [-Wwrite-strings]
shared.xs: In function ‘int sharedsv_scalar_mg_local(PerlInterpreter*, SV*, MAGIC*)’:
shared.xs:854:9: warning: deprecated conversion from string constant to ‘char*’ [-Wwrite-strings]
shared.xs: In function ‘int sharedsv_elem_mg_FETCH(PerlInterpreter*, SV*, MAGIC*)’:
shared.xs:891:5: warning: deprecated conversion from string constant to ‘char*’ [-Wwrite-strings]
shared.xs: In function ‘int sharedsv_elem_mg_STORE(PerlInterpreter*, SV*, MAGIC*)’:
shared.xs:944:5: warning: deprecated conversion from string constant to ‘char*’ [-Wwrite-strings]
shared.xs: In function ‘int sharedsv_elem_mg_DELETE(PerlInterpreter*, SV*, MAGIC*)’:
shared.xs:986:5: warning: deprecated conversion from string constant to ‘char*’ [-Wwrite-strings]
shared.xs: In function ‘U32 sharedsv_array_mg_FETCHSIZE(PerlInterpreter*, SV*, MAGIC*)’:
shared.xs:1049:5: warning: deprecated conversion from string constant to ‘char*’ [-Wwrite-strings]
shared.xs: In function ‘int sharedsv_array_mg_CLEAR(PerlInterpreter*, SV*, MAGIC*)’:
shared.xs:1069:5: warning: deprecated conversion from string constant to ‘char*’ [-Wwrite-strings]
shared.xs: In function ‘void Perl_sharedsv_lock(PerlInterpreter*, SV*)’:
shared.xs:1173:63: warning: deprecated conversion from string constant to ‘char*’ [-Wwrite-strings]
shared.xs: In function ‘void XS_threads__shared__tie_PUSH(PerlInterpreter*, CV*)’:
shared.xs:1269:13: warning: deprecated conversion from string constant to ‘char*’ [-Wwrite-strings]
shared.xs: In function ‘void XS_threads__shared__tie_UNSHIFT(PerlInterpreter*, CV*)’:
shared.xs:1286:9: warning: deprecated conversion from string constant to ‘char*’ [-Wwrite-strings]
shared.xs: In function ‘void XS_threads__shared__tie_POP(PerlInterpreter*, CV*)’:
shared.xs:1309:9: warning: deprecated conversion from string constant to ‘char*’ [-Wwrite-strings]
shared.xs: In function ‘void XS_threads__shared__tie_SHIFT(PerlInterpreter*, CV*)’:
shared.xs:1326:9: warning: deprecated conversion from string constant to ‘char*’ [-Wwrite-strings]
shared.xs: In function ‘void XS_threads__shared__tie_EXTEND(PerlInterpreter*, CV*)’:
shared.xs:1342:9: warning: deprecated conversion from string constant to ‘char*’ [-Wwrite-strings]
shared.xs: In function ‘void XS_threads__shared__tie_STORESIZE(PerlInterpreter*, CV*)’:
shared.xs:1352:9: warning: deprecated conversion from string constant to ‘char*’ [-Wwrite-strings]
shared.xs: In function ‘void XS_threads__shared__tie_EXISTS(PerlInterpreter*, CV*)’:
shared.xs:1364:13: warning: deprecated conversion from string constant to ‘char*’ [-Wwrite-strings]
shared.xs:1374:13: warning: deprecated conversion from string constant to ‘char*’ [-Wwrite-strings]
shared.xs: In function ‘void XS_threads__shared__tie_FIRSTKEY(PerlInterpreter*, CV*)’:
shared.xs:1390:9: warning: deprecated conversion from string constant to ‘char*’ [-Wwrite-strings]
shared.xs: In function ‘void XS_threads__shared__tie_NEXTKEY(PerlInterpreter*, CV*)’:
shared.xs:1418:9: warning: deprecated conversion from string constant to ‘char*’ [-Wwrite-strings]
shared.xs: In function ‘void XS_threads__shared_bless(PerlInterpreter*, CV*)’:
shared.xs:1678:13: warning: deprecated conversion from string constant to ‘char*’ [-Wwrite-strings]
threads.xs: In function ‘ithread* S_ithread_create(PerlInterpreter*, SV*, IV, int, int, int, int)’:
threads.xs:714:83: warning: ignoring return value of ‘ssize_t write(int, const void*, size_t)’, declared with attribute warn_unused_result [-Wunused-result]
re_comp.c: In function ‘regnode* S_regclass(PerlInterpreter*, RExC_state_t*, U32)’:
regcomp.c: In function ‘void S_dump_trie(PerlInterpreter*, const _reg_trie_data*, HV*, AV*, U32)’:
regcomp.c: In function ‘void S_dump_trie_interim_list(PerlInterpreter*, const _reg_trie_data*, HV*, AV*, U32, U32)’:
regcomp.c: In function ‘void S_dump_trie_interim_table(PerlInterpreter*, const _reg_trie_data*, HV*, AV*, U32, U32)’:
regcomp.c: In function ‘REGEXP* Perl_re_compile(PerlInterpreter*, SV*, U32)’:
regcomp.c: In function ‘SV* Perl_reg_named_buff_nextkey(PerlInterpreter*, REGEXP*, U32)’:
regcomp.c: In function ‘void Perl_pregfree2(PerlInterpreter*, REGEXP*)’:
toke.c: In function ‘int Perl_yylex(PerlInterpreter*)’:
-- 
Report by Test::Smoke v1.44 build 1285 running on perl 5.12.4
(Reporter v0.035 / Smoker v0.045)


Thread Next


nntp.perl.org: Perl Programming lists via nntp and http.
Comments to Ask Bjørn Hansen at ask@perl.org | Group listing | About