develooper Front page | perl.perl5.porters | Postings from March 2012

Smoke [5.15.9] v5.15.9-46-gd03ce4f FAIL(F) openvms V8.4 (IA64/2 cpu)

From:
Craig A. Berry
Date:
March 27, 2012 09:02
Subject:
Smoke [5.15.9] v5.15.9-46-gd03ce4f FAIL(F) openvms V8.4 (IA64/2 cpu)
Message ID:
0M1J00MX6WJTGI00@st11b01mm-asmtp204.mac.com
Automated smoke report for 5.15.9 patch d03ce4f5412fd49bf3d119e68c5e987e3221dacf v5.15.9-46-gd03ce4f
ALMA: HP rx2600  (1.50GHz/6.0MB) (IA64/2 cpu)
    on        openvms - V8.4
    using     ? CC/DECC version 70390020
    smoketime 3 hours 33 minutes (average 1 hour 46 minutes)

Summary: FAIL(F)

O = OK  F = Failure(s), extended report at the bottom
X = Failure(s) under TEST but not under harness
? = still running or test results not (yet) available
Build failures during:       - = unknown or N/A
c = Configure, m = make, M = make (after miniperl), t = make test-prep

v5.15.9-46-gd03ce4f  Configuration (common) none
----------- ---------------------------------------------------------
F -         
F -         -Dusethreads
| +--------- -DDEBUGGING
+----------- no debugging


Locally applied patches:
    uncommitted-changes
    SMOKEd03ce4f5412fd49bf3d119e68c5e987e3221dacf

Failures: (common-args) none
[default] 
    t/porting/podcheck ............................................ FAILED at test 330
    cpan/Module-Build/t/PL_files .................................. FAILED at test 3
    cpan/Module-Build/t/properties/dist_suffix .................... FAILED at test 2
    cpan/Module-Build/t/runthrough ................................ FAILED at test 11
    cpan/Module-Build/t/tilde ..................................... FAILED at test 16
    cpan/Module-Metadata/t/metadata ............................... FAILED at test 114
    cpan/Socket/t/getaddrinfo ..................................... FAILED at test 22
    dist/Carp/t/Carp .............................................. FAILED--expected 59 tests, saw 34
    lib/perl5db ................................................... FAILED at test 18

[default] -Dusethreads
    t/porting/podcheck ............................................ FAILED at test 330
    cpan/Module-Build/t/PL_files .................................. FAILED at test 3
    cpan/Module-Build/t/properties/dist_suffix .................... FAILED at test 2
    cpan/Module-Build/t/runthrough ................................ FAILED at test 11
    cpan/Module-Build/t/tilde ..................................... FAILED at test 16
    cpan/Module-Metadata/t/metadata ............................... FAILED at test 114
    dist/Carp/t/Carp .............................................. FAILED--expected 59 tests, saw 34
    lib/perl5db ................................................... FAILED at test 18

MANIFEST declared 'T/TEST.PL' but it is missing

Compiler messages(VMS):

		if (invariant_head <= 0) {
....................^
%CC-I-QUESTCOMPARE, In this statement, the unsigned expression "invariant_head" is being compared with a relational operator to a constant whose value is not greater than zero.  This might not be what you intended.
at line number 3359 in file MDA0:[SMOKE.blead]sv.c;1

            if (ulen == -1) {
................^
%CC-I-QUESTCOMPARE1, In this statement, the unsigned expression "ulen" is being compared with an equality operator to a constant whose value is negative.  This might not be what you intended.
at line number 356 in file MDA0:[SMOKE.blead.cpan.Encode]Encode.xs;1

                    if (ulen == -1)
........................^
%CC-I-QUESTCOMPARE1, In this statement, the unsigned expression "ulen" is being compared with an equality operator to a constant whose value is negative.  This might not be what you intended.
at line number 360 in file MDA0:[SMOKE.blead.cpan.Encode]Encode.xs;1

-- 
Report by Test::Smoke v1.39 build 1235 running on perl 5.12.3
(Reporter v0.035 / Smoker v0.044)



nntp.perl.org: Perl Programming lists via nntp and http.
Comments to Ask Bjørn Hansen at ask@perl.org | Group listing | About