develooper Front page | perl.perl5.porters | Postings from January 2012

Smoke [blead] v5.15.6-540-g711a390 FAIL(m) linux 3.0.0-12-generic [debian] (x86_64/8 cpu)

From:
George Greer
Date:
January 14, 2012 01:23
Subject:
Smoke [blead] v5.15.6-540-g711a390 FAIL(m) linux 3.0.0-12-generic [debian] (x86_64/8 cpu)
Message ID:
201201140923.q0E9NS4T022790@m-l.org
Smoke logs available at http://m-l.org/~perl/smoke/perl/

Automated smoke report for 5.15.6 patch 711a39033e18c23e23b10bd69e998176f1b1f852 v5.15.6-540-g711a390
zwei: Intel(R) Core(TM) i7 CPU 920 @ 2.67GHz (GenuineIntel 2668MHz) (x86_64/8 cpu)
    on        linux - 3.0.0-12-generic [debian]
    using     g++ version 4.6.1
    smoketime 4 minutes 34 seconds (average 1 minute 8.500 seconds)

Summary: FAIL(m)

O = OK  F = Failure(s), extended report at the bottom
X = Failure(s) under TEST but not under harness
? = still running or test results not (yet) available
Build failures during:       - = unknown or N/A
c = Configure, m = make, M = make (after miniperl), t = make test-prep

v5.15.6-540-g711a390  Configuration (common) -Dcc=g++ -O
----------- ---------------------------------------------------------
m m         -Uusenm
m m         -Uusenm -Duseithreads
| +--------- -DDEBUGGING
+----------- no debugging


Locally applied patches:
    uncommitted-changes
    SMOKE711a39033e18c23e23b10bd69e998176f1b1f852

Testsuite was run only with 'harness'

Compiler messages(gcc):
try.c: In function ‘int main()’:
try.c:36:10: warning: ignoring return value of ‘int pipe(int*)’, declared with attribute warn_unused_result [-Wunused-result]
try.c:37:10: warning: ignoring return value of ‘int pipe(int*)’, declared with attribute warn_unused_result [-Wunused-result]
try.c:53:35: warning: ignoring return value of ‘ssize_t write(int, const void*, size_t)’, declared with attribute warn_unused_result [-Wunused-result]
try.c:66:23: warning: ignoring return value of ‘ssize_t write(int, const void*, size_t)’, declared with attribute warn_unused_result [-Wunused-result]
try.c:72:35: warning: ignoring return value of ‘ssize_t write(int, const void*, size_t)’, declared with attribute warn_unused_result [-Wunused-result]
try.c:78:21: warning: ignoring return value of ‘ssize_t read(int, void*, size_t)’, declared with attribute warn_unused_result [-Wunused-result]
try.c: In function ‘int main(int, char**)’:
try.c:22:14: error: ‘KERN_PROC’ was not declared in this scope
try.c:23:14: error: ‘KERN_PROC_PATHNAME’ was not declared in this scope
try.c:48:25: error: invalid conversion from ‘void*’ to ‘char*’ [-fpermissive]
try.c:5785:17: warning: extra tokens at end of #ifdef directive [enabled by default]
try.c:5788:18: warning: extra tokens at end of #ifdef directive [enabled by default]
try.c:5791:19: warning: extra tokens at end of #ifdef directive [enabled by default]
try.c:5794:19: warning: extra tokens at end of #ifdef directive [enabled by default]
try.c:5821:17: warning: extra tokens at end of #ifdef directive [enabled by default]
try.c:5824:18: warning: extra tokens at end of #ifdef directive [enabled by default]
try.c:5827:19: warning: extra tokens at end of #ifdef directive [enabled by default]
try.c:5830:19: warning: extra tokens at end of #ifdef directive [enabled by default]
try.c:5857:17: warning: extra tokens at end of #ifdef directive [enabled by default]
try.c:5860:18: warning: extra tokens at end of #ifdef directive [enabled by default]
try.c:5863:19: warning: extra tokens at end of #ifdef directive [enabled by default]
try.c:5866:19: warning: extra tokens at end of #ifdef directive [enabled by default]
try.c:5893:16: warning: extra tokens at end of #ifdef directive [enabled by default]
try.c:5896:17: warning: extra tokens at end of #ifdef directive [enabled by default]
try.c:5899:18: warning: extra tokens at end of #ifdef directive [enabled by default]
try.c:5902:18: warning: extra tokens at end of #ifdef directive [enabled by default]
try.c:5929:18: warning: extra tokens at end of #ifdef directive [enabled by default]
try.c:5932:19: warning: extra tokens at end of #ifdef directive [enabled by default]
try.c:5935:20: warning: extra tokens at end of #ifdef directive [enabled by default]
try.c:5938:20: warning: extra tokens at end of #ifdef directive [enabled by default]
try.c:6817:18: warning: extra tokens at end of #ifdef directive [enabled by default]
try.c:6820:19: warning: extra tokens at end of #ifdef directive [enabled by default]
try.c:6823:20: warning: extra tokens at end of #ifdef directive [enabled by default]
try.c:6826:20: warning: extra tokens at end of #ifdef directive [enabled by default]
try.c:6853:18: warning: extra tokens at end of #ifdef directive [enabled by default]
try.c:6856:19: warning: extra tokens at end of #ifdef directive [enabled by default]
try.c:6859:20: warning: extra tokens at end of #ifdef directive [enabled by default]
try.c:6862:20: warning: extra tokens at end of #ifdef directive [enabled by default]
try.c:6889:18: warning: extra tokens at end of #ifdef directive [enabled by default]
try.c:6892:19: warning: extra tokens at end of #ifdef directive [enabled by default]
try.c:6895:20: warning: extra tokens at end of #ifdef directive [enabled by default]
try.c:6898:20: warning: extra tokens at end of #ifdef directive [enabled by default]
try.c:6925:17: warning: extra tokens at end of #ifdef directive [enabled by default]
try.c:6928:18: warning: extra tokens at end of #ifdef directive [enabled by default]
try.c:6931:19: warning: extra tokens at end of #ifdef directive [enabled by default]
try.c:6934:19: warning: extra tokens at end of #ifdef directive [enabled by default]
try.c:6961:19: warning: extra tokens at end of #ifdef directive [enabled by default]
try.c:6964:20: warning: extra tokens at end of #ifdef directive [enabled by default]
try.c:6967:21: warning: extra tokens at end of #ifdef directive [enabled by default]
try.c:6970:21: warning: extra tokens at end of #ifdef directive [enabled by default]
op.c: In function ‘OP* Perl_op_lvalue_flags(OP*, I32, U32)’:
op.c:1769:7: warning: variable ‘okid’ set but not used [-Wunused-but-set-variable]
util.c: In function ‘char* S_write_no_mem()’:
util.c:68:34: warning: ignoring return value of ‘ssize_t write(int, const void*, size_t)’, declared with attribute warn_unused_result [-Wunused-result]
mg_vtable.h:98:54: warning: ‘PL_magic_vtable_names’ initialized and declared ‘extern’ [enabled by default]
doio.c: In function ‘void S_exec_failed(const char*, int, int)’:
doio.c:1374:43: warning: ignoring return value of ‘ssize_t write(int, const void*, size_t)’, declared with attribute warn_unused_result [-Wunused-result]
doio.c: In function ‘PerlIOl** Perl_nextargv(GV*)’:
doio.c:871:46: warning: ignoring return value of ‘int fchown(int, __uid_t, __gid_t)’, declared with attribute warn_unused_result [-Wunused-result]
regexec.c: In function ‘char* S_find_byclass(regexp*, const regnode*, char*, const char*, regmatch_info*)’:
regexec.c:1591:6: warning: variable ‘ok’ set but not used [-Wunused-but-set-variable]
regexec.c:1597:6: warning: variable ‘ok’ set but not used [-Wunused-but-set-variable]
regexec.c:1602:6: warning: variable ‘ok’ set but not used [-Wunused-but-set-variable]
pp_sys.c: In function ‘OP* Perl_pp_stat()’:
pp_sys.c:2765:6: error: jump to label ‘do_fstat_warning_check’ [-fpermissive]
pp_sys.c:2809:22: error:   from here [-fpermissive]
pp_sys.c:2762:7: error:   skips initialization of ‘bool havefp’
pp_sys.c:2783:17: error: jump to label ‘do_fstat_have_io’ [-fpermissive]
pp_sys.c:2813:18: error:   from here [-fpermissive]
regexec.c:1612:6: warning: variable ‘ok’ set but not used [-Wunused-but-set-variable]
regexec.c:1622:6: warning: variable ‘ok’ set but not used [-Wunused-but-set-variable]
regexec.c:1627:6: warning: variable ‘ok’ set but not used [-Wunused-but-set-variable]
regexec.c:1638:6: warning: variable ‘ok’ set but not used [-Wunused-but-set-variable]
regexec.c:1645:6: warning: variable ‘ok’ set but not used [-Wunused-but-set-variable]
regexec.c:1657:6: warning: variable ‘ok’ set but not used [-Wunused-but-set-variable]
regexec.c:1664:6: warning: variable ‘ok’ set but not used [-Wunused-but-set-variable]
regexec.c:1683:6: warning: variable ‘ok’ set but not used [-Wunused-but-set-variable]
regexec.c:1690:6: warning: variable ‘ok’ set but not used [-Wunused-but-set-variable]
regexec.c:1708:6: warning: variable ‘ok’ set but not used [-Wunused-but-set-variable]
regexec.c:1715:6: warning: variable ‘ok’ set but not used [-Wunused-but-set-variable]
regexec.c:1734:6: warning: variable ‘ok’ set but not used [-Wunused-but-set-variable]
regexec.c:1752:6: warning: variable ‘ok’ set but not used [-Wunused-but-set-variable]
regexec.c: In function ‘I32 S_regmatch(regmatch_info*, regnode*)’:
regexec.c:3741:7: warning: variable ‘ok’ set but not used [-Wunused-but-set-variable]
regexec.c:3817:9: warning: variable ‘ok’ set but not used [-Wunused-but-set-variable]
regexec.c:3821:1: warning: variable ‘ok’ set but not used [-Wunused-but-set-variable]
regexec.c:3823:9: warning: variable ‘ok’ set but not used [-Wunused-but-set-variable]
regexec.c:3827:1: warning: variable ‘ok’ set but not used [-Wunused-but-set-variable]
pp_ctl.c: In function ‘OP* Perl_pp_goto()’:
pp_ctl.c:2906:8: warning: variable ‘newsp’ set but not used [-Wunused-but-set-variable]
pp_ctl.c:2907:7: warning: variable ‘gimme’ set but not used [-Wunused-but-set-variable]
regexec.c:3829:9: warning: variable ‘ok’ set but not used [-Wunused-but-set-variable]
regexec.c:3832:1: warning: variable ‘ok’ set but not used [-Wunused-but-set-variable]
regexec.c:3917:7: warning: variable ‘ok’ set but not used [-Wunused-but-set-variable]
sv.c: In function ‘void Perl_sv_vcatpvfn(SV*, const char*, STRLEN, __va_list_tag (*)[1], SV**, I32, bool*)’:
sv.c:10087:41: warning: ignoring return value of ‘char* gcvt(double, int, char*)’, declared with attribute warn_unused_result [-Wunused-result]
sv.c:10936:53: warning: ignoring return value of ‘char* gcvt(double, int, char*)’, declared with attribute warn_unused_result [-Wunused-result]
regexec.c:3917:1: warning: variable ‘ok’ set but not used [-Wunused-but-set-variable]
regexec.c:3917:1: warning: variable ‘throw_away’ set but not used [-Wunused-but-set-variable]
perlio.c: In function ‘void S_more_refcounted_fds(int)’:
perlio.c:2355:38: warning: ignoring return value of ‘ssize_t write(int, const void*, size_t)’, declared with attribute warn_unused_result [-Wunused-result]
regexec.c: In function ‘I32 S_regrepeat(const regexp*, const regnode*, I32, int)’:
regexec.c:6112:6: warning: variable ‘ok’ set but not used [-Wunused-but-set-variable]
regexec.c:6157:6: warning: variable ‘ok’ set but not used [-Wunused-but-set-variable]
regexec.c:6209:6: warning: variable ‘ok’ set but not used [-Wunused-but-set-variable]
regexec.c:6258:6: warning: variable ‘ok’ set but not used [-Wunused-but-set-variable]
regexec.c:6311:6: warning: variable ‘ok’ set but not used [-Wunused-but-set-variable]
regexec.c:6344:6: warning: variable ‘ok’ set but not used [-Wunused-but-set-variable]
perlio.c: In function ‘void PerlIO_debug(const char*, ...)’:
perlio.c:495:43: warning: ignoring return value of ‘ssize_t write(int, const void*, size_t)’, declared with attribute warn_unused_result [-Wunused-result]
sv.c: In function ‘char* Perl_sv_2pv_flags(SV*, STRLEN*, I32)’:
sv.c:2747:39: warning: ignoring return value of ‘char* gcvt(double, int, char*)’, declared with attribute warn_unused_result [-Wunused-result]
sv.c:2936:39: warning: ignoring return value of ‘char* gcvt(double, int, char*)’, declared with attribute warn_unused_result [-Wunused-result]
regcomp.c: In function ‘void S_dump_trie(const _reg_trie_data*, HV*, AV*, U32)’:
regcomp.c:1040:5: warning: variable ‘re_debug_flags’ set but not used [-Wunused-but-set-variable]
regcomp.c: In function ‘void S_dump_trie_interim_list(const _reg_trie_data*, HV*, AV*, U32, U32)’:
regcomp.c:1131:5: warning: variable ‘re_debug_flags’ set but not used [-Wunused-but-set-variable]
regcomp.c: In function ‘void S_dump_trie_interim_table(const _reg_trie_data*, HV*, AV*, U32, U32)’:
regcomp.c:1189:5: warning: variable ‘re_debug_flags’ set but not used [-Wunused-but-set-variable]
regcomp.c: In function ‘REGEXP* Perl_re_compile(SV*, U32)’:
regcomp.c:5324:5: warning: variable ‘re_debug_flags’ set but not used [-Wunused-but-set-variable]
regcomp.c: In function ‘SV* Perl_reg_named_buff_nextkey(REGEXP*, U32)’:
regcomp.c:5474:5: warning: variable ‘re_debug_flags’ set but not used [-Wunused-but-set-variable]
regcomp.c: In function ‘void Perl_pregfree2(REGEXP*)’:
regcomp.c:12197:5: warning: variable ‘re_debug_flags’ set but not used [-Wunused-but-set-variable]
util.c: In function ‘char* S_write_no_mem(PerlInterpreter*)’:
op.c: In function ‘OP* Perl_op_lvalue_flags(PerlInterpreter*, OP*, I32, U32)’:
perl.c: In function ‘void S_init_tls_and_interp(PerlInterpreter*)’:
perl.c:105:2: warning: ignoring return value of ‘ssize_t write(int, const void*, size_t)’, declared with attribute warn_unused_result [-Wunused-result]
regexec.c: In function ‘char* S_find_byclass(PerlInterpreter*, regexp*, const regnode*, char*, const char*, regmatch_info*)’:
regexec.c: In function ‘I32 S_regmatch(PerlInterpreter*, regmatch_info*, regnode*)’:
regexec.c:3741:1: warning: variable ‘ok’ set but not used [-Wunused-but-set-variable]
regexec.c: In function ‘I32 S_regrepeat(PerlInterpreter*, const regexp*, const regnode*, I32, int)’:
regexec.c:6112:1: warning: variable ‘ok’ set but not used [-Wunused-but-set-variable]
regexec.c:6157:1: warning: variable ‘ok’ set but not used [-Wunused-but-set-variable]
regexec.c:6209:1: warning: variable ‘ok’ set but not used [-Wunused-but-set-variable]
regexec.c:6258:1: warning: variable ‘ok’ set but not used [-Wunused-but-set-variable]
regexec.c:6311:1: warning: variable ‘ok’ set but not used [-Wunused-but-set-variable]
regexec.c:6344:1: warning: variable ‘ok’ set but not used [-Wunused-but-set-variable]
pp_sys.c: In function ‘OP* Perl_pp_stat(PerlInterpreter*)’:
doio.c: In function ‘void S_exec_failed(PerlInterpreter*, const char*, int, int)’:
pp_ctl.c: In function ‘OP* Perl_pp_goto(PerlInterpreter*)’:
doio.c: In function ‘PerlIOl** Perl_nextargv(PerlInterpreter*, GV*)’:
perlio.c: In function ‘void S_more_refcounted_fds(PerlInterpreter*, int)’:
perlio.c:486:56: warning: ignoring return value of ‘ssize_t write(int, const void*, size_t)’, declared with attribute warn_unused_result [-Wunused-result]
sv.c: In function ‘DIR* Perl_dirp_dup(PerlInterpreter*, DIR*, CLONE_PARAMS*)’:
sv.c:11383:26: warning: ignoring return value of ‘int fchdir(int)’, declared with attribute warn_unused_result [-Wunused-result]
sv.c: In function ‘void Perl_sv_vcatpvfn(PerlInterpreter*, SV*, const char*, STRLEN, __va_list_tag (*)[1], SV**, I32, bool*)’:
sv.c: In function ‘char* Perl_sv_2pv_flags(PerlInterpreter*, SV*, STRLEN*, I32)’:
regcomp.c: In function ‘void S_dump_trie(PerlInterpreter*, const _reg_trie_data*, HV*, AV*, U32)’:
regcomp.c: In function ‘void S_dump_trie_interim_list(PerlInterpreter*, const _reg_trie_data*, HV*, AV*, U32, U32)’:
regcomp.c: In function ‘void S_dump_trie_interim_table(PerlInterpreter*, const _reg_trie_data*, HV*, AV*, U32, U32)’:
regcomp.c: In function ‘REGEXP* Perl_re_compile(PerlInterpreter*, SV*, U32)’:
regcomp.c: In function ‘SV* Perl_reg_named_buff_nextkey(PerlInterpreter*, REGEXP*, U32)’:
regcomp.c: In function ‘void Perl_pregfree2(PerlInterpreter*, REGEXP*)’:
-- 
Report by Test::Smoke v1.44 build 1285 running on perl 5.12.4
(Reporter v0.035 / Smoker v0.045)




nntp.perl.org: Perl Programming lists via nntp and http.
Comments to Ask Bjørn Hansen at ask@perl.org | Group listing | About