develooper Front page | perl.perl5.porters | Postings from December 2011

Smoke [blead] v5.15.6-307-g4bb78d6 FAIL(F) linux 3.0.0-12-generic [debian] (x86_64/8 cpu)

From:
George Greer
Date:
December 31, 2011 18:04
Subject:
Smoke [blead] v5.15.6-307-g4bb78d6 FAIL(F) linux 3.0.0-12-generic [debian] (x86_64/8 cpu)
Message ID:
201201010204.q0124LPW009197@m-l.org
Smoke logs available at http://m-l.org/~perl/smoke/perl/

Automated smoke report for 5.15.6 patch 4bb78d633325d95f788c504d75b0fcae3fbc9f46 v5.15.6-307-g4bb78d6
zwei: Intel(R) Core(TM) i7 CPU 920 @ 2.67GHz (GenuineIntel 1600MHz) (x86_64/8 cpu)
    on        linux - 3.0.0-12-generic [debian]
    using     clang version 4.2.1 Compatible Clang Compiler
    smoketime 1 hour 2 minutes (average 15 minutes 36 seconds)

Summary: FAIL(F)

O = OK  F = Failure(s), extended report at the bottom
X = Failure(s) under TEST but not under harness
? = still running or test results not (yet) available
Build failures during:       - = unknown or N/A
c = Configure, m = make, M = make (after miniperl), t = make test-prep

v5.15.6-307-g4bb78d6  Configuration (common) -A -Dcc=clang append:ccflags=" -fcatch-undefined-behavior "
----------- ---------------------------------------------------------
O F O F     
O F O F     -Duseithreads
| +--------- -DDEBUGGING
+----------- no debugging


Locally applied patches:
    uncommitted-changes
    SMOKE4bb78d633325d95f788c504d75b0fcae3fbc9f46

Testsuite was run only with 'harness'

Failures: (common-args) -A -Dcc=clang append:ccflags=" -fcatch-undefined-behavior "
[minitest] 
[minitest] -DDEBUGGING
[minitest] -Duseithreads
[minitest] -DDEBUGGING -Duseithreads
    t/re/regexp .................... FAILED--expected 1558 tests, saw 1538
    t/re/regexp_noamp .............. FAILED--expected 1558 tests, saw 1538
    t/re/regexp_notrie ............. FAILED--expected 1558 tests, saw 1538
    t/re/regexp_qr ................. FAILED--expected 1558 tests, saw 1538
    t/re/regexp_qr_embed ........... FAILED--expected 1558 tests, saw 1538
    t/re/regexp_trielist ........... FAILED--expected 1558 tests, saw 1538

Passed Todo tests: (common-args) -A -Dcc=clang append:ccflags=" -fcatch-undefined-behavior "
[default] 
[default] -DDEBUGGING
[default] -Duseithreads
[default] -DDEBUGGING -Duseithreads
../cpan/CGI/t/tmpdir.t......................................PASSED
    3-9

Compiler messages(gcc):
try.c:22:14: error: use of undeclared identifier 'KERN_PROC'; did you mean 'KERN_PROF'?
try.c:23:14: error: use of undeclared identifier 'KERN_PROC_PATHNAME'
try.c:5785:17: warning: extra tokens at end of #ifdef directive [-Wextra-tokens]
try.c:5788:18: warning: extra tokens at end of #ifdef directive [-Wextra-tokens]
try.c:5791:19: warning: extra tokens at end of #ifdef directive [-Wextra-tokens]
try.c:5794:19: warning: extra tokens at end of #ifdef directive [-Wextra-tokens]
try.c:5821:17: warning: extra tokens at end of #ifdef directive [-Wextra-tokens]
try.c:5824:18: warning: extra tokens at end of #ifdef directive [-Wextra-tokens]
try.c:5827:19: warning: extra tokens at end of #ifdef directive [-Wextra-tokens]
try.c:5830:19: warning: extra tokens at end of #ifdef directive [-Wextra-tokens]
try.c:5857:17: warning: extra tokens at end of #ifdef directive [-Wextra-tokens]
try.c:5860:18: warning: extra tokens at end of #ifdef directive [-Wextra-tokens]
try.c:5863:19: warning: extra tokens at end of #ifdef directive [-Wextra-tokens]
try.c:5866:19: warning: extra tokens at end of #ifdef directive [-Wextra-tokens]
try.c:5893:16: warning: extra tokens at end of #ifdef directive [-Wextra-tokens]
try.c:5896:17: warning: extra tokens at end of #ifdef directive [-Wextra-tokens]
try.c:5899:18: warning: extra tokens at end of #ifdef directive [-Wextra-tokens]
try.c:5902:18: warning: extra tokens at end of #ifdef directive [-Wextra-tokens]
try.c:5929:18: warning: extra tokens at end of #ifdef directive [-Wextra-tokens]
try.c:5932:19: warning: extra tokens at end of #ifdef directive [-Wextra-tokens]
try.c:5935:20: warning: extra tokens at end of #ifdef directive [-Wextra-tokens]
try.c:5938:20: warning: extra tokens at end of #ifdef directive [-Wextra-tokens]
try.c:6817:18: warning: extra tokens at end of #ifdef directive [-Wextra-tokens]
try.c:6820:19: warning: extra tokens at end of #ifdef directive [-Wextra-tokens]
try.c:6823:20: warning: extra tokens at end of #ifdef directive [-Wextra-tokens]
try.c:6826:20: warning: extra tokens at end of #ifdef directive [-Wextra-tokens]
try.c:6853:18: warning: extra tokens at end of #ifdef directive [-Wextra-tokens]
try.c:6856:19: warning: extra tokens at end of #ifdef directive [-Wextra-tokens]
try.c:6859:20: warning: extra tokens at end of #ifdef directive [-Wextra-tokens]
try.c:6862:20: warning: extra tokens at end of #ifdef directive [-Wextra-tokens]
try.c:6889:18: warning: extra tokens at end of #ifdef directive [-Wextra-tokens]
try.c:6892:19: warning: extra tokens at end of #ifdef directive [-Wextra-tokens]
try.c:6895:20: warning: extra tokens at end of #ifdef directive [-Wextra-tokens]
try.c:6898:20: warning: extra tokens at end of #ifdef directive [-Wextra-tokens]
try.c:6925:17: warning: extra tokens at end of #ifdef directive [-Wextra-tokens]
try.c:6928:18: warning: extra tokens at end of #ifdef directive [-Wextra-tokens]
try.c:6931:19: warning: extra tokens at end of #ifdef directive [-Wextra-tokens]
try.c:6934:19: warning: extra tokens at end of #ifdef directive [-Wextra-tokens]
try.c:6961:19: warning: extra tokens at end of #ifdef directive [-Wextra-tokens]
try.c:6964:20: warning: extra tokens at end of #ifdef directive [-Wextra-tokens]
try.c:6967:21: warning: extra tokens at end of #ifdef directive [-Wextra-tokens]
try.c:6970:21: warning: extra tokens at end of #ifdef directive [-Wextra-tokens]
sv.c:502:5: warning: expression result unused [-Wunused-value]
sv.c:544:5: warning: expression result unused [-Wunused-value]
perl.c:364:6: warning: expression result unused [-Wunused-value]
doop.c:696:3: warning: expression result unused [-Wunused-value]
doop.c:691:5: warning: expression result unused [-Wunused-value]
sv.c:2754:3: warning: expression result unused [-Wunused-value]
util.c:571:5: warning: expression result unused [-Wunused-value]
mro.c:619:21: warning: expression result unused [-Wunused-value]
mro.c:665:2: warning: expression result unused [-Wunused-value]
sv.c:3649:6: warning: expression result unused [-Wunused-value]
pp_hot.c:144:3: warning: expression result unused [-Wunused-value]
toke.c:2206:3: warning: expression result unused [-Wunused-value]
toke.c:3862:5: warning: expression result unused [-Wunused-value]
util.c:2715:5: warning: expression result unused [-Wunused-value]
util.c:2875:5: warning: expression result unused [-Wunused-value]
sv.c:4076:6: warning: expression result unused [-Wunused-value]
sv.c:4078:6: warning: expression result unused [-Wunused-value]
toke.c:7637:7: warning: expression result unused [-Wunused-value]
sv.c:4483:5: warning: expression result unused [-Wunused-value]
sv.c:4534:5: warning: expression result unused [-Wunused-value]
sv.c:4592:6: warning: expression result unused [-Wunused-value]
sv.c:4639:5: warning: expression result unused [-Wunused-value]
sv.c:5198:5: warning: expression result unused [-Wunused-value]
pp_hot.c:1203:5: warning: expression result unused [-Wunused-value]
doio.c:637:17: warning: expression result unused [-Wunused-value]
doio.c:641:17: warning: expression result unused [-Wunused-value]
pp_hot.c:1625:2: warning: expression result unused [-Wunused-value]
pp_sys.c:443:25: warning: expression result unused [-Wunused-value]
pp_sys.c:480:25: warning: expression result unused [-Wunused-value]
pp_hot.c:2326:6: warning: expression result unused [-Wunused-value]
scope.c:691:68: warning: conversion specifies type 'long' but the argument has type 'I32' (aka 'int') [-Wformat]
scope.c:691:72: warning: conversion specifies type 'long' but the argument has type 'I32' (aka 'int') [-Wformat]
op.c:7983:5: warning: expression result unused [-Wunused-value]
utf8.c:1432:20: warning: implicit conversion from 'int' to 'U8' (aka 'unsigned char') changes value from 65533 to 253 [-Wconstant-conversion]
op.c:9371:9: warning: array index of '2' indexes past the end of an array (that contains 1 elements) [-Warray-bounds]
op.c:10031:4: warning: expression result unused [-Wunused-value]
pp_sys.c:1732:2: warning: expression result unused [-Wunused-value]
pp_ctl.c:277:2: warning: expression result unused [-Wunused-value]
sv.c:7569:5: warning: expression result unused [-Wunused-value]
doio.c:2285:2: warning: expression result unused [-Wunused-value]
pp_ctl.c:397:2: warning: expression result unused [-Wunused-value]
pp_ctl.c:409:8: warning: expression result unused [-Wunused-value]
regcomp.c:11796:11: warning: expression result unused [-Wunused-value]
pp_ctl.c:968:3: warning: expression result unused [-Wunused-value]
sv.c:9066:6: warning: expression result unused [-Wunused-value]
perlio.c:5487:21: warning: comparison of integers of different signs: 'size_t' (aka 'unsigned long') and 'int' [-Wsign-compare]
sv.c:9462:5: warning: expression result unused [-Wunused-value]
regexec.c:4214:19: warning: expression result unused [-Wunused-value]
regexec.c:5479:9: warning: expression result unused [-Wunused-value]
pp_ctl.c:2238:3: warning: expression result unused [-Wunused-value]
pp_ctl.c:2253:6: warning: expression result unused [-Wunused-value]
pp.c:3357:5: warning: expression result unused [-Wunused-value]
pp.c:3534:22: warning: implicit conversion from 'int' to 'U8' (aka 'unsigned char') changes value from 65533 to 253 [-Wconstant-conversion]
pp.c:3602:2: warning: expression result unused [-Wunused-value]
pp_ctl.c:4478:5: warning: expression result unused [-Wunused-value]
pp.c:3745:2: warning: expression result unused [-Wunused-value]
pp.c:3848:12: warning: implicit conversion from 'int' to 'U8' (aka 'unsigned char') changes value from 65533 to 253 [-Wconstant-conversion]
pp.c:3982:2: warning: expression result unused [-Wunused-value]
pp.c:4056:12: warning: implicit conversion from 'int' to 'U8' (aka 'unsigned char') changes value from 65533 to 253 [-Wconstant-conversion]
pp.c:4081:2: warning: expression result unused [-Wunused-value]
pp_ctl.c:5466:5: warning: expression result unused [-Wunused-value]
./const-c.inc:47:2: warning: expression result unused [-Wunused-value]
./const-c.inc:81:5: warning: expression result unused [-Wunused-value]
Bzip2.xs:326:5: warning: expression result unused [-Wunused-value]
Call.xs:62:58: warning: conversion specifies type 'int' but the argument has type 'STRLEN' (aka 'unsigned long') [-Wformat]
Call.xs:62:78: warning: conversion specifies type 'int' but the argument has type 'STRLEN' (aka 'unsigned long') [-Wformat]
Call.xs:99:53: warning: conversion specifies type 'int' but the argument has type 'STRLEN' (aka 'unsigned long') [-Wformat]
Call.xs:155:46: warning: conversion specifies type 'int' but the argument has type 'STRLEN' (aka 'unsigned long') [-Wformat]
Call.xs:174:57: warning: conversion specifies type 'int' but the argument has type 'STRLEN' (aka 'unsigned long') [-Wformat]
mro.xs:120:7: warning: expression result unused [-Wunused-value]
Storable.xs:1793:3: warning: expression result unused [-Wunused-value]
Storable.xs:4035:2: warning: null passed to a callee which requires a non-null argument [-Wnonnull]
Storable.xs:4468:2: warning: expression result unused [-Wunused-value]
Dumper.xs:651:4: warning: expression result unused [-Wunused-value]
Storable.xs:5353:3: warning: expression result unused [-Wunused-value]
Storable.xs:5400:2: warning: expression result unused [-Wunused-value]
Storable.xs:5440:2: warning: null passed to a callee which requires a non-null argument [-Wnonnull]
Storable.xs:5503:2: warning: null passed to a callee which requires a non-null argument [-Wnonnull]
Storable.xs:5814:4: warning: expression result unused [-Wunused-value]
scalar.xs:48:5: warning: expression result unused [-Wunused-value]
Storable.xs:5855:3: warning: expression result unused [-Wunused-value]
Storable.xs:6014:5: warning: expression result unused [-Wunused-value]
Glob.xs:100:2: warning: expression result unused [-Wunused-value]
Glob.xs:108:6: warning: expression result unused [-Wunused-value]
Util.xs:55:9: warning: expression result unused [-Wunused-value]
Opcode.xs:268:9: warning: expression result unused [-Wunused-value]
./const-c.inc:38:2: warning: expression result unused [-Wunused-value]
./const-c.inc:73:5: warning: expression result unused [-Wunused-value]
re_exec.c:4214:19: warning: expression result unused [-Wunused-value]
./const-c.inc:72:5: warning: expression result unused [-Wunused-value]
Socket.xs:252:2: warning: expression result unused [-Wunused-value]
re_exec.c:5479:9: warning: expression result unused [-Wunused-value]
Socket.xs:493:44: warning: conversion specifies type 'int' but the argument has type 'STRLEN' (aka 'unsigned long') [-Wformat]
Socket.xs:493:58: warning: conversion specifies type 'int' but the argument has type 'unsigned long' [-Wformat]
Socket.xs:514:44: warning: conversion specifies type 'int' but the argument has type 'STRLEN' (aka 'unsigned long') [-Wformat]
Socket.xs:514:67: warning: conversion specifies type 'int' but the argument has type 'unsigned long' [-Wformat]
Socket.xs:641:44: warning: conversion specifies type 'int' but the argument has type 'STRLEN' (aka 'unsigned long') [-Wformat]
Socket.xs:641:58: warning: conversion specifies type 'int' but the argument has type 'unsigned long' [-Wformat]
Socket.xs:665:47: warning: conversion specifies type 'int' but the argument has type 'STRLEN' (aka 'unsigned long') [-Wformat]
Socket.xs:665:61: warning: conversion specifies type 'int' but the argument has type 'unsigned long' [-Wformat]
Socket.xs:697:40: warning: conversion specifies type 'int' but the argument has type 'STRLEN' (aka 'unsigned long') [-Wformat]
Socket.xs:697:54: warning: conversion specifies type 'int' but the argument has type 'unsigned long' [-Wformat]
Socket.xs:730:44: warning: conversion specifies type 'int' but the argument has type 'STRLEN' (aka 'unsigned long') [-Wformat]
Socket.xs:730:58: warning: conversion specifies type 'int' but the argument has type 'unsigned long' [-Wformat]
Socket.xs:840:40: warning: conversion specifies type 'int' but the argument has type 'STRLEN' (aka 'unsigned long') [-Wformat]
Socket.xs:840:54: warning: conversion specifies type 'int' but the argument has type 'unsigned long' [-Wformat]
Socket.xs:861:44: warning: conversion specifies type 'int' but the argument has type 'STRLEN' (aka 'unsigned long') [-Wformat]
Socket.xs:861:58: warning: conversion specifies type 'int' but the argument has type 'unsigned long' [-Wformat]
Typemap.xs:95:3: warning: expression result unused [-Wunused-value]
Typemap.xs:130:3: warning: expression result unused [-Wunused-value]
Typemap.xs:166:3: warning: expression result unused [-Wunused-value]
Typemap.xs:202:3: warning: expression result unused [-Wunused-value]
Typemap.xs:243:3: warning: expression result unused [-Wunused-value]
Zlib.xs:593:5: warning: expression result unused [-Wunused-value]
APItest.xs:112:5: warning: expression result unused [-Wunused-value]
APItest.xs:1452:2: warning: expression result unused [-Wunused-value]
APItest.xs:2156:2: warning: expression result unused [-Wunused-value]
Collate.xs:607:2: warning: expression result unused [-Wunused-value]
Collate.xs:597:2: warning: expression result unused [-Wunused-value]
Unicode.xs:176:6: warning: expression result unused [-Wunused-value]
Unicode.xs:334:6: warning: expression result unused [-Wunused-value]
ExtTest.xs:44:2: warning: expression result unused [-Wunused-value]
ExtTest.xs:78:5: warning: expression result unused [-Wunused-value]
regexec.c:2620:8: warning: expression result unused [-Wunused-value]
re_exec.c:2620:8: warning: expression result unused [-Wunused-value]
-- 
Report by Test::Smoke v1.44 build 1285 running on perl 5.12.4
(Reporter v0.035 / Smoker v0.045)




nntp.perl.org: Perl Programming lists via nntp and http.
Comments to Ask Bjørn Hansen at ask@perl.org | Group listing | About