develooper Front page | perl.perl5.porters | Postings from December 2011

Smoke [blead] v5.15.6-35-g00c2875 FAIL(F) linux 3.0.0-12-generic [debian] (x86_64/8 cpu)

From:
George Greer
Date:
December 21, 2011 11:42
Subject:
Smoke [blead] v5.15.6-35-g00c2875 FAIL(F) linux 3.0.0-12-generic [debian] (x86_64/8 cpu)
Message ID:
201112211942.pBLJgE36004775@m-l.org
Smoke logs available at http://m-l.org/~perl/smoke/perl/

Automated smoke report for 5.15.6 patch 00c2875021fb463491c0dcd5941d2eb5c7cc9cea v5.15.6-35-g00c2875
zwei: Intel(R) Core(TM) i7 CPU 920 @ 2.67GHz (GenuineIntel 2668MHz) (x86_64/8 cpu)
    on        linux - 3.0.0-12-generic [debian]
    using     clang version 4.2.1 Compatible Clang Compiler
    smoketime 1 hour 40 minutes (average 25 minutes 14 seconds)

Summary: FAIL(F)

O = OK  F = Failure(s), extended report at the bottom
X = Failure(s) under TEST but not under harness
? = still running or test results not (yet) available
Build failures during:       - = unknown or N/A
c = Configure, m = make, M = make (after miniperl), t = make test-prep

v5.15.6-35-g00c2875  Configuration (common) -A -Dcc=clang append:ccflags=" -fcatch-undefined-behavior "
----------- ---------------------------------------------------------
F O F O     
F O F O     -Duseithreads
| +--------- -DDEBUGGING
+----------- no debugging


Locally applied patches:
    uncommitted-changes
    SMOKE00c2875021fb463491c0dcd5941d2eb5c7cc9cea

Testsuite was run only with 'harness'

Failures: (common-args) -A -Dcc=clang append:ccflags=" -fcatch-undefined-behavior "
[default] 
[default] -DDEBUGGING
[default] -Duseithreads
[default] -DDEBUGGING -Duseithreads
../t/porting/podcheck.t.....................................FAILED
    294, 296

MANIFEST did not declare 'Porting/make-rmg-checklist'

Passed Todo tests: (common-args) -A -Dcc=clang append:ccflags=" -fcatch-undefined-behavior "
[default] 
[default] -DDEBUGGING
[default] -Duseithreads
[default] -DDEBUGGING -Duseithreads
../cpan/CGI/t/tmpdir.t......................................PASSED
    3-9

Compiler messages(gcc):
try.c:22:14: error: use of undeclared identifier 'KERN_PROC'; did you mean 'KERN_PROF'?
try.c:23:14: error: use of undeclared identifier 'KERN_PROC_PATHNAME'
try.c:5785:17: warning: extra tokens at end of #ifdef directive [-Wextra-tokens]
try.c:5788:18: warning: extra tokens at end of #ifdef directive [-Wextra-tokens]
try.c:5791:19: warning: extra tokens at end of #ifdef directive [-Wextra-tokens]
try.c:5794:19: warning: extra tokens at end of #ifdef directive [-Wextra-tokens]
try.c:5821:17: warning: extra tokens at end of #ifdef directive [-Wextra-tokens]
try.c:5824:18: warning: extra tokens at end of #ifdef directive [-Wextra-tokens]
try.c:5827:19: warning: extra tokens at end of #ifdef directive [-Wextra-tokens]
try.c:5830:19: warning: extra tokens at end of #ifdef directive [-Wextra-tokens]
try.c:5857:17: warning: extra tokens at end of #ifdef directive [-Wextra-tokens]
try.c:5860:18: warning: extra tokens at end of #ifdef directive [-Wextra-tokens]
try.c:5863:19: warning: extra tokens at end of #ifdef directive [-Wextra-tokens]
try.c:5866:19: warning: extra tokens at end of #ifdef directive [-Wextra-tokens]
try.c:5893:16: warning: extra tokens at end of #ifdef directive [-Wextra-tokens]
try.c:5896:17: warning: extra tokens at end of #ifdef directive [-Wextra-tokens]
try.c:5899:18: warning: extra tokens at end of #ifdef directive [-Wextra-tokens]
try.c:5902:18: warning: extra tokens at end of #ifdef directive [-Wextra-tokens]
try.c:5929:18: warning: extra tokens at end of #ifdef directive [-Wextra-tokens]
try.c:5932:19: warning: extra tokens at end of #ifdef directive [-Wextra-tokens]
try.c:5935:20: warning: extra tokens at end of #ifdef directive [-Wextra-tokens]
try.c:5938:20: warning: extra tokens at end of #ifdef directive [-Wextra-tokens]
try.c:6817:18: warning: extra tokens at end of #ifdef directive [-Wextra-tokens]
try.c:6820:19: warning: extra tokens at end of #ifdef directive [-Wextra-tokens]
try.c:6823:20: warning: extra tokens at end of #ifdef directive [-Wextra-tokens]
try.c:6826:20: warning: extra tokens at end of #ifdef directive [-Wextra-tokens]
try.c:6853:18: warning: extra tokens at end of #ifdef directive [-Wextra-tokens]
try.c:6856:19: warning: extra tokens at end of #ifdef directive [-Wextra-tokens]
try.c:6859:20: warning: extra tokens at end of #ifdef directive [-Wextra-tokens]
try.c:6862:20: warning: extra tokens at end of #ifdef directive [-Wextra-tokens]
try.c:6889:18: warning: extra tokens at end of #ifdef directive [-Wextra-tokens]
try.c:6892:19: warning: extra tokens at end of #ifdef directive [-Wextra-tokens]
try.c:6895:20: warning: extra tokens at end of #ifdef directive [-Wextra-tokens]
try.c:6898:20: warning: extra tokens at end of #ifdef directive [-Wextra-tokens]
try.c:6925:17: warning: extra tokens at end of #ifdef directive [-Wextra-tokens]
try.c:6928:18: warning: extra tokens at end of #ifdef directive [-Wextra-tokens]
try.c:6931:19: warning: extra tokens at end of #ifdef directive [-Wextra-tokens]
try.c:6934:19: warning: extra tokens at end of #ifdef directive [-Wextra-tokens]
try.c:6961:19: warning: extra tokens at end of #ifdef directive [-Wextra-tokens]
try.c:6964:20: warning: extra tokens at end of #ifdef directive [-Wextra-tokens]
try.c:6967:21: warning: extra tokens at end of #ifdef directive [-Wextra-tokens]
try.c:6970:21: warning: extra tokens at end of #ifdef directive [-Wextra-tokens]
perl.c:364:6: warning: expression result unused [-Wunused-value]
mro.c:619:21: warning: expression result unused [-Wunused-value]
mro.c:665:2: warning: expression result unused [-Wunused-value]
util.c:571:5: warning: expression result unused [-Wunused-value]
perlio.c:5486:21: warning: comparison of integers of different signs: 'size_t' (aka 'unsigned long') and 'int' [-Wsign-compare]
util.c:2715:5: warning: expression result unused [-Wunused-value]
util.c:2875:5: warning: expression result unused [-Wunused-value]
doio.c:637:17: warning: expression result unused [-Wunused-value]
doio.c:641:17: warning: expression result unused [-Wunused-value]
pp_ctl.c:277:2: warning: expression result unused [-Wunused-value]
doop.c:696:3: warning: expression result unused [-Wunused-value]
doop.c:691:5: warning: expression result unused [-Wunused-value]
pp_hot.c:144:3: warning: expression result unused [-Wunused-value]
pp_ctl.c:397:2: warning: expression result unused [-Wunused-value]
pp_ctl.c:409:8: warning: expression result unused [-Wunused-value]
toke.c:2207:3: warning: expression result unused [-Wunused-value]
pp_ctl.c:968:3: warning: expression result unused [-Wunused-value]
sv.c:502:5: warning: expression result unused [-Wunused-value]
sv.c:544:5: warning: expression result unused [-Wunused-value]
utf8.c:1432:20: warning: implicit conversion from 'int' to 'U8' (aka 'unsigned char') changes value from 65533 to 253 [-Wconstant-conversion]
toke.c:3863:5: warning: expression result unused [-Wunused-value]
scope.c:689:68: warning: conversion specifies type 'long' but the argument has type 'I32' (aka 'int') [-Wformat]
scope.c:689:72: warning: conversion specifies type 'long' but the argument has type 'I32' (aka 'int') [-Wformat]
pp_sys.c:439:25: warning: expression result unused [-Wunused-value]
pp_sys.c:476:25: warning: expression result unused [-Wunused-value]
pp_hot.c:1202:5: warning: expression result unused [-Wunused-value]
doio.c:2285:2: warning: expression result unused [-Wunused-value]
op.c:8029:5: warning: expression result unused [-Wunused-value]
pp_hot.c:1624:2: warning: expression result unused [-Wunused-value]
pp_ctl.c:2236:3: warning: expression result unused [-Wunused-value]
pp_ctl.c:2251:6: warning: expression result unused [-Wunused-value]
op.c:9419:9: warning: array index of '2' indexes past the end of an array (that contains 1 elements) [-Warray-bounds]
sv.c:2752:3: warning: expression result unused [-Wunused-value]
op.c:10079:4: warning: expression result unused [-Wunused-value]
pp.c:3360:5: warning: expression result unused [-Wunused-value]
regexec.c:4214:19: warning: expression result unused [-Wunused-value]
pp_hot.c:2325:6: warning: expression result unused [-Wunused-value]
sv.c:3646:6: warning: expression result unused [-Wunused-value]
pp.c:3537:22: warning: implicit conversion from 'int' to 'U8' (aka 'unsigned char') changes value from 65533 to 253 [-Wconstant-conversion]
regexec.c:5478:9: warning: expression result unused [-Wunused-value]
pp.c:3605:2: warning: expression result unused [-Wunused-value]
regcomp.c:11792:11: warning: expression result unused [-Wunused-value]
pp.c:3748:2: warning: expression result unused [-Wunused-value]
pp_sys.c:1722:2: warning: expression result unused [-Wunused-value]
pp.c:3851:12: warning: implicit conversion from 'int' to 'U8' (aka 'unsigned char') changes value from 65533 to 253 [-Wconstant-conversion]
pp.c:3985:2: warning: expression result unused [-Wunused-value]
pp.c:4059:12: warning: implicit conversion from 'int' to 'U8' (aka 'unsigned char') changes value from 65533 to 253 [-Wconstant-conversion]
pp.c:4084:2: warning: expression result unused [-Wunused-value]
toke.c:7637:7: warning: expression result unused [-Wunused-value]
sv.c:4072:6: warning: expression result unused [-Wunused-value]
sv.c:4074:6: warning: expression result unused [-Wunused-value]
sv.c:4479:5: warning: expression result unused [-Wunused-value]
sv.c:4530:5: warning: expression result unused [-Wunused-value]
sv.c:4588:6: warning: expression result unused [-Wunused-value]
pp_ctl.c:4473:5: warning: expression result unused [-Wunused-value]
sv.c:4635:5: warning: expression result unused [-Wunused-value]
sv.c:5194:5: warning: expression result unused [-Wunused-value]
pp_ctl.c:5461:5: warning: expression result unused [-Wunused-value]
sv.c:7564:5: warning: expression result unused [-Wunused-value]
sv.c:9059:6: warning: expression result unused [-Wunused-value]
sv.c:9455:5: warning: expression result unused [-Wunused-value]
Dumper.xs:651:4: warning: expression result unused [-Wunused-value]
Bzip2.xs:326:5: warning: expression result unused [-Wunused-value]
./const-c.inc:47:2: warning: expression result unused [-Wunused-value]
./const-c.inc:81:5: warning: expression result unused [-Wunused-value]
Opcode.xs:268:9: warning: expression result unused [-Wunused-value]
re_exec.c:4214:19: warning: expression result unused [-Wunused-value]
re_exec.c:5478:9: warning: expression result unused [-Wunused-value]
Glob.xs:100:2: warning: expression result unused [-Wunused-value]
Glob.xs:108:6: warning: expression result unused [-Wunused-value]
scalar.xs:48:5: warning: expression result unused [-Wunused-value]
Util.xs:55:9: warning: expression result unused [-Wunused-value]
Call.xs:62:58: warning: conversion specifies type 'int' but the argument has type 'STRLEN' (aka 'unsigned long') [-Wformat]
Call.xs:62:78: warning: conversion specifies type 'int' but the argument has type 'STRLEN' (aka 'unsigned long') [-Wformat]
Call.xs:99:53: warning: conversion specifies type 'int' but the argument has type 'STRLEN' (aka 'unsigned long') [-Wformat]
Call.xs:155:46: warning: conversion specifies type 'int' but the argument has type 'STRLEN' (aka 'unsigned long') [-Wformat]
Call.xs:174:57: warning: conversion specifies type 'int' but the argument has type 'STRLEN' (aka 'unsigned long') [-Wformat]
Socket.xs:252:2: warning: expression result unused [-Wunused-value]
./const-c.inc:38:2: warning: expression result unused [-Wunused-value]
./const-c.inc:72:5: warning: expression result unused [-Wunused-value]
Socket.xs:493:44: warning: conversion specifies type 'int' but the argument has type 'STRLEN' (aka 'unsigned long') [-Wformat]
Socket.xs:493:58: warning: conversion specifies type 'int' but the argument has type 'unsigned long' [-Wformat]
Socket.xs:514:44: warning: conversion specifies type 'int' but the argument has type 'STRLEN' (aka 'unsigned long') [-Wformat]
Socket.xs:514:67: warning: conversion specifies type 'int' but the argument has type 'unsigned long' [-Wformat]
Socket.xs:641:44: warning: conversion specifies type 'int' but the argument has type 'STRLEN' (aka 'unsigned long') [-Wformat]
Socket.xs:641:58: warning: conversion specifies type 'int' but the argument has type 'unsigned long' [-Wformat]
Socket.xs:665:47: warning: conversion specifies type 'int' but the argument has type 'STRLEN' (aka 'unsigned long') [-Wformat]
Socket.xs:665:61: warning: conversion specifies type 'int' but the argument has type 'unsigned long' [-Wformat]
Socket.xs:697:40: warning: conversion specifies type 'int' but the argument has type 'STRLEN' (aka 'unsigned long') [-Wformat]
Socket.xs:697:54: warning: conversion specifies type 'int' but the argument has type 'unsigned long' [-Wformat]
Socket.xs:730:44: warning: conversion specifies type 'int' but the argument has type 'STRLEN' (aka 'unsigned long') [-Wformat]
Socket.xs:730:58: warning: conversion specifies type 'int' but the argument has type 'unsigned long' [-Wformat]
Storable.xs:1793:3: warning: expression result unused [-Wunused-value]
Socket.xs:840:40: warning: conversion specifies type 'int' but the argument has type 'STRLEN' (aka 'unsigned long') [-Wformat]
Socket.xs:840:54: warning: conversion specifies type 'int' but the argument has type 'unsigned long' [-Wformat]
Socket.xs:861:44: warning: conversion specifies type 'int' but the argument has type 'STRLEN' (aka 'unsigned long') [-Wformat]
Socket.xs:861:58: warning: conversion specifies type 'int' but the argument has type 'unsigned long' [-Wformat]
mro.xs:120:7: warning: expression result unused [-Wunused-value]
Zlib.xs:593:5: warning: expression result unused [-Wunused-value]
./const-c.inc:73:5: warning: expression result unused [-Wunused-value]
Typemap.xs:95:3: warning: expression result unused [-Wunused-value]
Typemap.xs:130:3: warning: expression result unused [-Wunused-value]
Typemap.xs:166:3: warning: expression result unused [-Wunused-value]
Typemap.xs:202:3: warning: expression result unused [-Wunused-value]
Typemap.xs:243:3: warning: expression result unused [-Wunused-value]
Storable.xs:4035:2: warning: null passed to a callee which requires a non-null argument [-Wnonnull]
Storable.xs:4468:2: warning: expression result unused [-Wunused-value]
Storable.xs:5353:3: warning: expression result unused [-Wunused-value]
Storable.xs:5400:2: warning: expression result unused [-Wunused-value]
Storable.xs:5440:2: warning: null passed to a callee which requires a non-null argument [-Wnonnull]
Storable.xs:5503:2: warning: null passed to a callee which requires a non-null argument [-Wnonnull]
Storable.xs:5814:4: warning: expression result unused [-Wunused-value]
Storable.xs:5855:3: warning: expression result unused [-Wunused-value]
Storable.xs:6014:5: warning: expression result unused [-Wunused-value]
APItest.xs:112:5: warning: expression result unused [-Wunused-value]
APItest.xs:1452:2: warning: expression result unused [-Wunused-value]
APItest.xs:2156:2: warning: expression result unused [-Wunused-value]
Collate.xs:607:2: warning: expression result unused [-Wunused-value]
Collate.xs:597:2: warning: expression result unused [-Wunused-value]
Unicode.xs:176:6: warning: expression result unused [-Wunused-value]
Unicode.xs:334:6: warning: expression result unused [-Wunused-value]
ExtTest.xs:44:2: warning: expression result unused [-Wunused-value]
ExtTest.xs:78:5: warning: expression result unused [-Wunused-value]
In f:3360:5: warning: regcomp.c:75:
pp.cop.c:10079:4: warning: expression result unused [-Wunused-value]
regexec.c:2620:8: warning: expression result unused [-Wunused-value]
re_exec.c:2620:8: warning: expression result unused [-Wunused-value]
-- 
Report by Test::Smoke v1.44 build 1285 running on perl 5.12.4
(Reporter v0.035 / Smoker v0.045)




nntp.perl.org: Perl Programming lists via nntp and http.
Comments to Ask Bjørn Hansen at ask@perl.org | Group listing | About