develooper Front page | perl.perl5.porters | Postings from October 2011

Smoke [blead] v5.15.4-111-ga91bb7b FAIL(FM) MSWin32 Win2000 SP4 (x86/1 cpu)

From:
George Greer
Date:
October 31, 2011 15:18
Subject:
Smoke [blead] v5.15.4-111-ga91bb7b FAIL(FM) MSWin32 Win2000 SP4 (x86/1 cpu)
Message ID:
201110312218.p9VMI0KQ014207@m-l.org
Smoke logs available at http://m-l.org/~perl/smoke/perl/

Automated smoke report for 5.15.4 patch a91bb7b11867794fd4ec4300551297aa61080ca6 v5.15.4-111-ga91bb7b
perl-win2k: Intel(R) Core(TM) i7 CPU 920 @ 2.67GHz(~2656 MHz) (x86/1 cpu)
    on        MSWin32 - Win2000 SP4
    using     cl version 14.00.50727.762
    smoketime 1 hour 43 minutes (average 25 minutes 54 seconds)

Summary: FAIL(FM)

O = OK  F = Failure(s), extended report at the bottom
X = Failure(s) under TEST but not under harness
? = still running or test results not (yet) available
Build failures during:       - = unknown or N/A
c = Configure, m = make, M = make (after miniperl), t = make test-prep

v5.15.4-111-ga91bb7b  Configuration (common) none
----------- ---------------------------------------------------------
F F         
F M         -Duseithreads
| +--------- -DDEBUGGING
+----------- no debugging


Locally applied patches:
    uncommitted-changes
    SMOKEa91bb7b11867794fd4ec4300551297aa61080ca6

Failures: (common-args) none
[default] 
../cpan/ExtUtils-MakeMaker/t/echo.t.........................FAILED
    3, 6, 9, 12, 15, 18
    Non-zero exit status: 6
../cpan/ExtUtils-MakeMaker/t/MM_Win32.t.....................FAILED
    13-20, 24
    Non-zero exit status: 9
../cpan/IPC-Cmd/t/01_IPC-Cmd.t..............................FAILED
    225-226
    Non-zero exit status: 2

[default] -DDEBUGGING
../cpan/ExtUtils-MakeMaker/t/echo.t.........................FAILED
    3, 6, 9, 12, 15, 18
    Non-zero exit status: 6
../cpan/ExtUtils-MakeMaker/t/MM_Win32.t.....................FAILED
    13-20, 24
    Non-zero exit status: 9
../cpan/Memoize/t/expmod_t.t................................FAILED
    7

[default] -Duseithreads
../cpan/ExtUtils-MakeMaker/t/echo.t.........................FAILED
    3, 6, 9, 12, 15, 18
    Non-zero exit status: 6
../cpan/ExtUtils-MakeMaker/t/MM_Win32.t.....................FAILED
    13-20, 24
    Non-zero exit status: 9

Passed Todo tests: (common-args) none
[default] 
[default] -DDEBUGGING
[default] -Duseithreads
../cpan/CGI/t/tmpdir.t......................................PASSED
    3-9

Compiler messages(MSWin32):
op.c(10372) : warning C4028: formal parameter 1 different from declaration
..\pp.c(5926) : warning C4244: 'function' : conversion from 'U32' to 'const char', possible loss of data
..\pp_hot.c(2669) : warning C4244: 'initializing' : conversion from 'I32' to 'U8', possible loss of data
..\pp_sort.c(1668) : warning C4244: 'initializing' : conversion from 'I32' to 'U8', possible loss of data
..\utf8.c(1358) : warning C4244: '=' : conversion from 'UV' to 'U8', possible loss of data
Glob.xs(336) : warning C4101: 'i' : unreferenced local variable
Glob.xs(337) : warning C4101: 'retval' : unreferenced local variable
Glob.xs(339) : warning C4101: 'tmp' : unreferenced local variable
Glob.xs(335) : warning C4101: 'pglob' : unreferenced local variable
IO.xs(488) : warning C4101: 'ret' : unreferenced local variable
ListUtil.xs(297) : warning C4244: 'initializing' : conversion from 'I32' to 'U8', possible loss of data
ListUtil.xs(335) : warning C4244: 'initializing' : conversion from 'I32' to 'U8', possible loss of data
Base64.xs(394) : warning C4146: unary minus operator applied to unsigned type, result still unsigned
Base64.xs(396) : warning C4146: unary minus operator applied to unsigned type, result still unsigned
POSIX.xs(705) : warning C4101: 'charstring' : unreferenced local variable
POSIX.xs(1760) : warning C4244: 'initializing' : conversion from 'time_t' to 'const long', possible loss of data
Piece.xs(950) : warning C4101: 'ret' : unreferenced local variable
APItest.xs(2985) : warning C4244: 'initializing' : conversion from 'I32' to 'U8', possible loss of data
APItest.xs(3272) : warning C4101: 'tmp' : unreferenced local variable
op.c(10372) : warning C4028: formal parameter 2 different from declaration

-- 
Report by Test::Smoke v1.42 build 1267 running on perl 5.10.0
(Reporter v0.035 / Smoker v0.045)




nntp.perl.org: Perl Programming lists via nntp and http.
Comments to Ask Bjørn Hansen at ask@perl.org | Group listing | About