develooper Front page | perl.perl5.porters | Postings from October 2011

Smoke [5.15.3] v5.15.3-409-g6439ee7 FAIL(F) openvms V8.4 (IA64/2 cpu)

From:
Craig A. Berry
Date:
October 19, 2011 20:37
Subject:
Smoke [5.15.3] v5.15.3-409-g6439ee7 FAIL(F) openvms V8.4 (IA64/2 cpu)
Message ID:
0LTC00DEYI2NAO00@st11b01mm-asmtp203.mac.com
Automated smoke report for 5.15.3 patch 6439ee77e18d6c3844dbd6ff6502eb38f391188c v5.15.3-409-g6439ee7
ALMA: HP rx2600  (1.50GHz/6.0MB) (IA64/2 cpu)
    on        openvms - V8.4
    using     ? CC/DECC version 70390020
    smoketime 3 hours 21 minutes (average 1 hour 40 minutes)

Summary: FAIL(F)

O = OK  F = Failure(s), extended report at the bottom
X = Failure(s) under TEST but not under harness
? = still running or test results not (yet) available
Build failures during:       - = unknown or N/A
c = Configure, m = make, M = make (after miniperl), t = make test-prep

v5.15.3-409-g6439ee7  Configuration (common) none
----------- ---------------------------------------------------------
F -         
F -         -Dusethreads
| +--------- -DDEBUGGING
+----------- no debugging


Locally applied patches:
    uncommitted-changes
    SMOKE6439ee77e18d6c3844dbd6ff6502eb38f391188c

Failures: (common-args) none
[default] 
[default] -Dusethreads
    cpan/Archive-Extract/t/01_Archive-Extract ..................... FAILED at test 193
    cpan/CGI/t/url ................................................ FAILED--no leader found
    cpan/Module-Build/t/PL_files .................................. FAILED at test 3
    cpan/Module-Build/t/properties/dist_suffix .................... FAILED at test 2
    cpan/Module-Build/t/runthrough ................................ FAILED at test 11
    cpan/Module-Build/t/tilde ..................................... FAILED at test 16
    cpan/Pod-Simple/t/search12 .................................... FAILED at test 7
    cpan/Time-HiRes/t/alarm ....................................... FAILED at test 7
    cpan/Time-HiRes/t/ualarm ...................................... FAILED at test 8
    dist/Carp/t/Carp .............................................. FAILED--expected 58 tests, saw 34

Compiler messages(VMS):

		if (invariant_head <= 0) {
....................^
%CC-I-QUESTCOMPARE, In this statement, the unsigned expression "invariant_head" is being compared with a relational operator to a constant whose value is not greater than zero.  This might not be what you intended.
at line number 3355 in file MDA0:[SMOKE.blead]sv.c;1

            if (ulen == -1) {
................^
%CC-I-QUESTCOMPARE1, In this statement, the unsigned expression "ulen" is being compared with an equality operator to a constant whose value is negative.  This might not be what you intended.
at line number 356 in file MDA0:[SMOKE.blead.cpan.Encode]Encode.xs;1

                    if (ulen == -1)
........................^
%CC-I-QUESTCOMPARE1, In this statement, the unsigned expression "ulen" is being compared with an equality operator to a constant whose value is negative.  This might not be what you intended.
at line number 360 in file MDA0:[SMOKE.blead.cpan.Encode]Encode.xs;1

-- 
Report by Test::Smoke v1.39 build 1235 running on perl 5.12.3
(Reporter v0.035 / Smoker v0.044)



nntp.perl.org: Perl Programming lists via nntp and http.
Comments to Ask Bjørn Hansen at ask@perl.org | Group listing | About