develooper Front page | perl.perl5.porters | Postings from October 2011

Smoke [blead] v5.15.3-407-g9171084 FAIL(F) linux 3.0.0-12-generic [debian] (x86_64/8 cpu)

From:
George Greer
Date:
October 19, 2011 11:22
Subject:
Smoke [blead] v5.15.3-407-g9171084 FAIL(F) linux 3.0.0-12-generic [debian] (x86_64/8 cpu)
Message ID:
201110191822.p9JIM6d4016686@m-l.org
Smoke logs available at http://m-l.org/~perl/smoke/perl/

Automated smoke report for 5.15.3 patch 917108461292f3da96a9e21b8050efd032378b56 v5.15.3-407-g9171084
zwei: Intel(R) Core(TM) i7 CPU 920 @ 2.67GHz (GenuineIntel 2668MHz) (x86_64/8 cpu)
    on        linux - 3.0.0-12-generic [debian]
    using     clang version 4.2.1 Compatible Clang Compiler
    smoketime 1 hour 20 minutes (average 20 minutes 10 seconds)

Summary: FAIL(F)

O = OK  F = Failure(s), extended report at the bottom
X = Failure(s) under TEST but not under harness
? = still running or test results not (yet) available
Build failures during:       - = unknown or N/A
c = Configure, m = make, M = make (after miniperl), t = make test-prep

v5.15.3-407-g9171084  Configuration (common) -A -Dcc=clang append:ccflags=" -fcatch-undefined-behavior "
----------- ---------------------------------------------------------
F O F O     
F O F O     -Duseithreads
| +--------- -DDEBUGGING
+----------- no debugging


Locally applied patches:
    uncommitted-changes
    SMOKE917108461292f3da96a9e21b8050efd032378b56

Testsuite was run only with 'harness'

Failures: (common-args) -A -Dcc=clang append:ccflags=" -fcatch-undefined-behavior "
[default] 
[default] -DDEBUGGING
[default] -Duseithreads
[default] -DDEBUGGING -Duseithreads
../t/porting/podcheck.t.....................................FAILED
    179

Passed Todo tests: (common-args) -A -Dcc=clang append:ccflags=" -fcatch-undefined-behavior "
[default] 
[default] -DDEBUGGING
[default] -Duseithreads
[default] -DDEBUGGING -Duseithreads
../cpan/CGI/t/tmpdir.t......................................PASSED
    3-9

Compiler messages(gcc):
try.c:22:14: error: use of undeclared identifier 'KERN_PROC'; did you mean 'KERN_PROF'?
try.c:23:14: error: use of undeclared identifier 'KERN_PROC_PATHNAME'
try.c:5785:17: warning: extra tokens at end of #ifdef directive [-Wextra-tokens]
try.c:5788:18: warning: extra tokens at end of #ifdef directive [-Wextra-tokens]
try.c:5791:19: warning: extra tokens at end of #ifdef directive [-Wextra-tokens]
try.c:5794:19: warning: extra tokens at end of #ifdef directive [-Wextra-tokens]
try.c:5821:17: warning: extra tokens at end of #ifdef directive [-Wextra-tokens]
try.c:5824:18: warning: extra tokens at end of #ifdef directive [-Wextra-tokens]
try.c:5827:19: warning: extra tokens at end of #ifdef directive [-Wextra-tokens]
try.c:5830:19: warning: extra tokens at end of #ifdef directive [-Wextra-tokens]
try.c:5857:17: warning: extra tokens at end of #ifdef directive [-Wextra-tokens]
try.c:5860:18: warning: extra tokens at end of #ifdef directive [-Wextra-tokens]
try.c:5863:19: warning: extra tokens at end of #ifdef directive [-Wextra-tokens]
try.c:5866:19: warning: extra tokens at end of #ifdef directive [-Wextra-tokens]
try.c:5893:16: warning: extra tokens at end of #ifdef directive [-Wextra-tokens]
try.c:5896:17: warning: extra tokens at end of #ifdef directive [-Wextra-tokens]
try.c:5899:18: warning: extra tokens at end of #ifdef directive [-Wextra-tokens]
try.c:5902:18: warning: extra tokens at end of #ifdef directive [-Wextra-tokens]
try.c:5929:18: warning: extra tokens at end of #ifdef directive [-Wextra-tokens]
try.c:5932:19: warning: extra tokens at end of #ifdef directive [-Wextra-tokens]
try.c:5935:20: warning: extra tokens at end of #ifdef directive [-Wextra-tokens]
try.c:5938:20: warning: extra tokens at end of #ifdef directive [-Wextra-tokens]
try.c:6817:18: warning: extra tokens at end of #ifdef directive [-Wextra-tokens]
try.c:6820:19: warning: extra tokens at end of #ifdef directive [-Wextra-tokens]
try.c:6823:20: warning: extra tokens at end of #ifdef directive [-Wextra-tokens]
try.c:6826:20: warning: extra tokens at end of #ifdef directive [-Wextra-tokens]
try.c:6853:18: warning: extra tokens at end of #ifdef directive [-Wextra-tokens]
try.c:6856:19: warning: extra tokens at end of #ifdef directive [-Wextra-tokens]
try.c:6859:20: warning: extra tokens at end of #ifdef directive [-Wextra-tokens]
try.c:6862:20: warning: extra tokens at end of #ifdef directive [-Wextra-tokens]
try.c:6889:18: warning: extra tokens at end of #ifdef directive [-Wextra-tokens]
try.c:6892:19: warning: extra tokens at end of #ifdef directive [-Wextra-tokens]
try.c:6895:20: warning: extra tokens at end of #ifdef directive [-Wextra-tokens]
try.c:6898:20: warning: extra tokens at end of #ifdef directive [-Wextra-tokens]
try.c:6925:17: warning: extra tokens at end of #ifdef directive [-Wextra-tokens]
try.c:6928:18: warning: extra tokens at end of #ifdef directive [-Wextra-tokens]
try.c:6931:19: warning: extra tokens at end of #ifdef directive [-Wextra-tokens]
try.c:6934:19: warning: extra tokens at end of #ifdef directive [-Wextra-tokens]
try.c:6961:19: warning: extra tokens at end of #ifdef directive [-Wextra-tokens]
try.c:6964:20: warning: extra tokens at end of #ifdef directive [-Wextra-tokens]
try.c:6967:21: warning: extra tokens at end of #ifdef directive [-Wextra-tokens]
try.c:6970:21: warning: extra tokens at end of #ifdef directive [-Wextra-tokens]
perl.c:364:6: warning: expression result unused [-Wunused-value]
toke.c:2192:3: warning: expression result unused [-Wunused-value]
toke.c:3845:5: warning: expression result unused [-Wunused-value]
pp_hot.c:144:3: warning: expression result unused [-Wunused-value]
toke.c:7538:7: warning: expression result unused [-Wunused-value]
pp_hot.c:1203:5: warning: expression result unused [-Wunused-value]
pp_hot.c:1625:2: warning: expression result unused [-Wunused-value]
pp_hot.c:2326:6: warning: expression result unused [-Wunused-value]
sv.c:502:5: warning: expression result unused [-Wunused-value]
sv.c:544:5: warning: expression result unused [-Wunused-value]
util.c:571:5: warning: expression result unused [-Wunused-value]
doop.c:696:3: warning: expression result unused [-Wunused-value]
doop.c:691:5: warning: expression result unused [-Wunused-value]
doio.c:637:17: warning: expression result unused [-Wunused-value]
doio.c:641:17: warning: expression result unused [-Wunused-value]
sv.c:2755:3: warning: expression result unused [-Wunused-value]
sv.c:3659:6: warning: expression result unused [-Wunused-value]
util.c:2715:5: warning: expression result unused [-Wunused-value]
sv.c:4098:6: warning: expression result unused [-Wunused-value]
sv.c:4100:6: warning: expression result unused [-Wunused-value]
sv.c:4512:5: warning: expression result unused [-Wunused-value]
util.c:2875:5: warning: expression result unused [-Wunused-value]
doio.c:2285:2: warning: expression result unused [-Wunused-value]
sv.c:4563:5: warning: expression result unused [-Wunused-value]
mro.c:619:21: warning: expression result unused [-Wunused-value]
mro.c:665:2: warning: expression result unused [-Wunused-value]
sv.c:4662:5: warning: expression result unused [-Wunused-value]
scope.c:689:68: warning: conversion specifies type 'long' but the argument has type 'I32' (aka 'int') [-Wformat]
scope.c:689:72: warning: conversion specifies type 'long' but the argument has type 'I32' (aka 'int') [-Wformat]
pp_ctl.c:287:2: warning: expression result unused [-Wunused-value]
pp_sys.c:434:25: warning: expression result unused [-Wunused-value]
pp_sys.c:471:25: warning: expression result unused [-Wunused-value]
regexec.c:4212:19: warning: expression result unused [-Wunused-value]
In file included from ./perl.h:sv.c:5212:5: warning: expression result unused [-Wunused-value]
pp_ctl.c:409:2: warning: expression result unused [-Wunused-value]
pp_ctl.c:421:8: warning: expression result unused [-Wunused-value]
regexec.c:5476:9: warning: expression result unused [-Wunused-value]
op.c:7923:5: warning: expression result unused [-Wunused-value]
pp_ctl.c:980:3: warning: expression result unused [-Wunused-value]
pp_sys.c:1717:2: warning: expression result unused [-Wunused-value]
op.c:9307:9: warning: array index of '2' indexes past the end of an array (that contains 1 elements) [-Warray-bounds]
op.c:9896:4: warning: expression result unused [-Wunused-value]
sv.c:7575:5: warning: expression result unused [-Wunused-value]
pp_ctl.c:2248:3: warning: expression result unused [-Wunused-value]
pp_ctl.c:2263:6: warning: expression result unused [-Wunused-value]
regcomp.c:11770:11: warning: expression result unused [-Wunused-value]
perlio.c:5486:21: warning: comparison of integers of different signs: 'size_t' (aka 'unsigned long') and 'int' [-Wsign-compare]
pp.c:3343:5: warning: expression result unused [-Wunused-value]
sv.c:9058:6: warning: expression result unused [-Wunused-value]
pp.c:3571:14: warning: implicit conversion from 'int' to 'U8' (aka 'unsigned char') changes value from 65533 to 253 [-Wconstant-conversion]
pp.c:3575:14: warning: implicit conversion from 'int' to 'U8' (aka 'unsigned char') changes value from 65533 to 253 [-Wconstant-conversion]
pp.c:3635:22: warning: implicit conversion from 'int' to 'U8' (aka 'unsigned char') changes value from 65533 to 253 [-Wconstant-conversion]
pp.c:3649:16: warning: implicit conversion from 'int' to 'U8' (aka 'unsigned char') changes value from 65533 to 253 [-Wconstant-conversion]
pp.c:3705:2: warning: expression result unused [-Wunused-value]
pp.c:3843:2: warning: expression result unused [-Wunused-value]
pp.c:3890:14: warning: implicit conversion from 'int' to 'U8' (aka 'unsigned char') changes value from 65533 to 253 [-Wconstant-conversion]
sv.c:9452:5: warning: expression result unused [-Wunused-value]
pp.c:3955:12: warning: implicit conversion from 'int' to 'U8' (aka 'unsigned char') changes value from 65533 to 253 [-Wconstant-conversion]
pp.c:4027:15: warning: implicit conversion from 'int' to 'U8' (aka 'unsigned char') changes value from 65533 to 253 [-Wconstant-conversion]
pp.c:4099:2: warning: expression result unused [-Wunused-value]
pp.c:4124:14: warning: implicit conversion from 'int' to 'U8' (aka 'unsigned char') changes value from 65533 to 253 [-Wconstant-conversion]
pp.c:4187:12: warning: implicit conversion from 'int' to 'U8' (aka 'unsigned char') changes value from 65533 to 253 [-Wconstant-conversion]
pp.c:4212:2: warning: expression result unused [-Wunused-value]
pp_ctl.c:4424:5: warning: expression result unused [-Wunused-value]
pp_ctl.c:5410:5: warning: expression result unused [-Wunused-value]
Opcode.xs:268:9: warning: expression result unused [-Wunused-value]
re_exec.c:5476:9: warning: expression result unused [-Wunused-value]
Typemap.xs:95:3: warning: expression result unused [-Wunused-value]
Typemap.xs:130:3: warning: expression result unused [-Wunused-value]
Typemap.xs:166:3: warning: expression result unused [-Wunused-value]
Typemap.xs:202:3: warning: expression result unused [-Wunused-value]
Typemap.xs:243:3: warning: expression result unused [-Wunused-value]
./const-c.inc:38:2: warning: expression result unused [-Wunused-value]
./const-c.inc:72:5: warning: expression result unused [-Wunused-value]
./const-c.inc:47:2: warning: expression result unused [-Wunused-value]
./const-c.inc:81:5: warning: expression result unused [-Wunused-value]
Storable.xs:1793:3: warning: expression result unused [-Wunused-value]
mro.xs:120:7: warning: expression result unused [-Wunused-value]
./const-c.inc:73:5: warning: expression result unused [-Wunused-value]
Zlib.xs:593:5: warning: expression result unused [-Wunused-value]
Socket.xs:223:2: warning: expression result unused [-Wunused-value]
Socket.xs:455:51: warning: conversion specifies type 'int' but the argument has type 'STRLEN' (aka 'unsigned long') [-Wformat]
Socket.xs:455:65: warning: conversion specifies type 'int' but the argument has type 'unsigned long' [-Wformat]
Socket.xs:477:47: warning: conversion specifies type 'int' but the argument has type 'STRLEN' (aka 'unsigned long') [-Wformat]
Socket.xs:477:70: warning: conversion specifies type 'int' but the argument has type 'unsigned long' [-Wformat]
Socket.xs:610:51: warning: conversion specifies type 'int' but the argument has type 'STRLEN' (aka 'unsigned long') [-Wformat]
Socket.xs:610:65: warning: conversion specifies type 'int' but the argument has type 'unsigned long' [-Wformat]
Socket.xs:634:47: warning: conversion specifies type 'int' but the argument has type 'STRLEN' (aka 'unsigned long') [-Wformat]
Socket.xs:634:61: warning: conversion specifies type 'int' but the argument has type 'unsigned long' [-Wformat]
Socket.xs:669:43: warning: conversion specifies type 'int' but the argument has type 'STRLEN' (aka 'unsigned long') [-Wformat]
Socket.xs:669:57: warning: conversion specifies type 'int' but the argument has type 'unsigned long' [-Wformat]
Socket.xs:702:47: warning: conversion specifies type 'int' but the argument has type 'STRLEN' (aka 'unsigned long') [-Wformat]
Socket.xs:702:61: warning: conversion specifies type 'int' but the argument has type 'unsigned long' [-Wformat]
Storable.xs:4035:2: warning: null passed to a callee which requires a non-null argument [-Wnonnull]
Storable.xs:4468:2: warning: expression result unused [-Wunused-value]
Storable.xs:5353:3: warning: expression result unused [-Wunused-value]
Storable.xs:5400:2: warning: expression result unused [-Wunused-value]
Storable.xs:5440:2: warning: null passed to a callee which requires a non-null argument [-Wnonnull]
Storable.xs:5503:2: warning: null passed to a callee which requires a non-null argument [-Wnonnull]
Storable.xs:5814:4: warning: expression result unused [-Wunused-value]
Storable.xs:5855:3: warning: expression result unused [-Wunused-value]
Storable.xs:6014:5: warning: expression result unused [-Wunused-value]
APItest.xs:1452:2: warning: expression result unused [-Wunused-value]
APItest.xs:2151:2: warning: expression result unused [-Wunused-value]
Collate.xs:605:2: warning: expression result unused [-Wunused-value]
Collate.xs:595:2: warning: expression result unused [-Wunused-value]
Unicode.xs:176:6: warning: expression result unused [-Wunused-value]
Unicode.xs:334:6: warning: expression result unused [-Wunused-value]
ExtTest.xs:44:2: warning: expression result unused [-Wunused-value]
ExtTest.xs:78:5: warning: expression result unused [-Wunused-value]
sv.c:5212:5: warning: expression result unused [-Wunused-value]
re_exec.c:4212:19: warning: expression result unused [-Wunused-value]
Call.xs:99:53: warning: conversion specifies type 'int' but the argument has type 'STRLEN' (aka 'unsigned long') [-Wformat]
Call.xs:155:46: warning: conversion specifies type 'int' but the argument has type 'STRLEN' (aka 'unsigned long') [-Wformat]
Call.xs:174:57: warning: conversion specifies type 'int' but the argument has type 'STRLEN' (aka 'unsigned long') [-Wformat]
Bzip2.xs:326:5: warning: expression result unused [-Wunused-value]
APItest.xs:112:5: warning: expression result unused [-Wunused-value]
Dumper.xs:650:4: warning: expression result unused [-Wunused-value]
regexec.c:2618:8: warning: expression result unused [-Wunused-value]
sv.c:4512:5: warning: op.c:9896:4: warning: expression result unused [-Wunused-value]
Util.xs:55:9: warning: expression result unused [-Wunused-value]
Call.xs:62:58: warning: conversion specifies type 'int' but the argument has type 'STRLEN' (aka 'unsigned long') [-Wformat]
Call.xs:62:78: warning: conversion specifies type 'int' but the argument has type 'STRLEN' (aka 'unsigned long') [-Wformat]
scalar.xs:48:5: warning: expression result unused [-Wunused-value]
-- 
Report by Test::Smoke v1.44 build 1285 running on perl 5.12.4
(Reporter v0.035 / Smoker v0.045)




nntp.perl.org: Perl Programming lists via nntp and http.
Comments to Ask Bjørn Hansen at ask@perl.org | Group listing | About