develooper Front page | perl.perl5.porters | Postings from October 2011

Smoke [blead] v5.15.3-356-g120b7a0 FAIL(F) linux 2.6.38-11-generic [debian] (x86_64/8 cpu)

From:
George Greer
Date:
October 11, 2011 19:14
Subject:
Smoke [blead] v5.15.3-356-g120b7a0 FAIL(F) linux 2.6.38-11-generic [debian] (x86_64/8 cpu)
Message ID:
201110120214.p9C2EAt1004860@m-l.org
Smoke logs available at http://m-l.org/~perl/smoke/perl/

Automated smoke report for 5.15.3 patch 120b7a08b6eec7ddfe4a829dd2b2ec5ed8612ec1 v5.15.3-356-g120b7a0
zwei: Intel(R) Core(TM) i7 CPU 920 @ 2.67GHz (GenuineIntel 2668MHz) (x86_64/8 cpu)
    on        linux - 2.6.38-11-generic [debian]
    using     clang version 4.2.1 Compatible Clang Compiler
    smoketime 48 minutes 41 seconds (average 12 minutes 10 seconds)

Summary: FAIL(F)

O = OK  F = Failure(s), extended report at the bottom
X = Failure(s) under TEST but not under harness
? = still running or test results not (yet) available
Build failures during:       - = unknown or N/A
c = Configure, m = make, M = make (after miniperl), t = make test-prep

v5.15.3-356-g120b7a0  Configuration (common) -A -Dcc=clang append:ccflags=" -fcatch-undefined-behavior "
----------- ---------------------------------------------------------
F O F O     
F O F O     -Duseithreads
| +--------- -DDEBUGGING
+----------- no debugging


Locally applied patches:
    uncommitted-changes
    SMOKE120b7a08b6eec7ddfe4a829dd2b2ec5ed8612ec1

Testsuite was run only with 'harness'

Failures: (common-args) -A -Dcc=clang append:ccflags=" -fcatch-undefined-behavior "
[default] 
[default] -DDEBUGGING
[default] -Duseithreads
[default] -DDEBUGGING -Duseithreads
../ext/XS-APItest/t/autoload.t..............................FAILED
    Non-zero exit status: 255
    Bad plan.  You planned 27 tests but ran 26.

Passed Todo tests: (common-args) -A -Dcc=clang append:ccflags=" -fcatch-undefined-behavior "
[default] 
[default] -DDEBUGGING
[default] -Duseithreads
[default] -DDEBUGGING -Duseithreads
../cpan/CGI/t/tmpdir.t......................................PASSED
    3-9

Compiler messages(gcc):
try.c:22:14: error: use of undeclared identifier 'KERN_PROC'; did you mean 'KERN_PROF'?
try.c:23:14: error: use of undeclared identifier 'KERN_PROC_PATHNAME'
try.c:5737:17: warning: extra tokens at end of #ifdef directive [-Wextra-tokens]
try.c:5740:18: warning: extra tokens at end of #ifdef directive [-Wextra-tokens]
try.c:5743:19: warning: extra tokens at end of #ifdef directive [-Wextra-tokens]
try.c:5746:19: warning: extra tokens at end of #ifdef directive [-Wextra-tokens]
try.c:5773:17: warning: extra tokens at end of #ifdef directive [-Wextra-tokens]
try.c:5776:18: warning: extra tokens at end of #ifdef directive [-Wextra-tokens]
try.c:5779:19: warning: extra tokens at end of #ifdef directive [-Wextra-tokens]
try.c:5782:19: warning: extra tokens at end of #ifdef directive [-Wextra-tokens]
try.c:5809:17: warning: extra tokens at end of #ifdef directive [-Wextra-tokens]
try.c:5812:18: warning: extra tokens at end of #ifdef directive [-Wextra-tokens]
try.c:5815:19: warning: extra tokens at end of #ifdef directive [-Wextra-tokens]
try.c:5818:19: warning: extra tokens at end of #ifdef directive [-Wextra-tokens]
try.c:5845:16: warning: extra tokens at end of #ifdef directive [-Wextra-tokens]
try.c:5848:17: warning: extra tokens at end of #ifdef directive [-Wextra-tokens]
try.c:5851:18: warning: extra tokens at end of #ifdef directive [-Wextra-tokens]
try.c:5854:18: warning: extra tokens at end of #ifdef directive [-Wextra-tokens]
try.c:5881:18: warning: extra tokens at end of #ifdef directive [-Wextra-tokens]
try.c:5884:19: warning: extra tokens at end of #ifdef directive [-Wextra-tokens]
try.c:5887:20: warning: extra tokens at end of #ifdef directive [-Wextra-tokens]
try.c:5890:20: warning: extra tokens at end of #ifdef directive [-Wextra-tokens]
try.c:6721:18: warning: extra tokens at end of #ifdef directive [-Wextra-tokens]
try.c:6724:19: warning: extra tokens at end of #ifdef directive [-Wextra-tokens]
try.c:6727:20: warning: extra tokens at end of #ifdef directive [-Wextra-tokens]
try.c:6730:20: warning: extra tokens at end of #ifdef directive [-Wextra-tokens]
try.c:6757:18: warning: extra tokens at end of #ifdef directive [-Wextra-tokens]
try.c:6760:19: warning: extra tokens at end of #ifdef directive [-Wextra-tokens]
try.c:6763:20: warning: extra tokens at end of #ifdef directive [-Wextra-tokens]
try.c:6766:20: warning: extra tokens at end of #ifdef directive [-Wextra-tokens]
try.c:6793:18: warning: extra tokens at end of #ifdef directive [-Wextra-tokens]
try.c:6796:19: warning: extra tokens at end of #ifdef directive [-Wextra-tokens]
try.c:6799:20: warning: extra tokens at end of #ifdef directive [-Wextra-tokens]
try.c:6802:20: warning: extra tokens at end of #ifdef directive [-Wextra-tokens]
try.c:6829:17: warning: extra tokens at end of #ifdef directive [-Wextra-tokens]
try.c:6832:18: warning: extra tokens at end of #ifdef directive [-Wextra-tokens]
try.c:6835:19: warning: extra tokens at end of #ifdef directive [-Wextra-tokens]
try.c:6838:19: warning: extra tokens at end of #ifdef directive [-Wextra-tokens]
try.c:6865:19: warning: extra tokens at end of #ifdef directive [-Wextra-tokens]
try.c:6868:20: warning: extra tokens at end of #ifdef directive [-Wextra-tokens]
try.c:6871:21: warning: extra tokens at end of #ifdef directive [-Wextra-tokens]
try.c:6874:21: warning: extra tokens at end of #ifdef directive [-Wextra-tokens]
pp_hot.c:144:3: warning: expression result unused [-Wunused-value]
util.c:571:5: warning: expression result unused [-Wunused-value]
mro.c:619:21: warning: expression result unused [-Wunused-value]
mro.c:665:2: warning: expression result unused [-Wunused-value]
pp_ctl.c:287:2: warning: expression result unused [-Wunused-value]
pp_hot.c:1203:5: warning: expression result unused [-Wunused-value]
pp_ctl.c:409:2: warning: expression result unused [-Wunused-value]
pp_ctl.c:421:8: warning: expression result unused [-Wunused-value]
util.c:2715:5: warning: expression result unused [-Wunused-value]
pp_hot.c:1618:3: warning: expression result unused [-Wunused-value]
pp_hot.c:1623:6: warning: expression result unused [-Wunused-value]
pp_hot.c:1636:3: warning: expression result unused [-Wunused-value]
pp_hot.c:1625:2: warning: expression result unused [-Wunused-value]
pp_ctl.c:906:7: warning: expression result unused [-Wunused-value]
pp_ctl.c:980:3: warning: expression result unused [-Wunused-value]
util.c:2875:5: warning: expression result unused [-Wunused-value]
pp_ctl.c:583:5: warning: expression result unused [-Wunused-value]
regcomp.c:3639:5: warning: expression result unused [-Wunused-value]
sv.c:502:5: warning: expression result unused [-Wunused-value]
sv.c:544:5: warning: expression result unused [-Wunused-value]
pp_ctl.c:1338:6: warning: expression result unused [-Wunused-value]
pp_hot.c:2326:6: warning: expression result unused [-Wunused-value]
sv.c:898:39: warning: comparison of 0 <= unsigned expression is always true [-Wsign-compare]
sv.c:919:17: warning: comparison of 0 <= unsigned expression is always true [-Wsign-compare]
sv.c:925:7: warning: comparison of 0 <= unsigned expression is always true [-Wsign-compare]
sv.c:929:17: warning: comparison of 0 <= unsigned expression is always true [-Wsign-compare]
sv.c:932:17: warning: comparison of 0 <= unsigned expression is always true [-Wsign-compare]
sv.c:938:7: warning: comparison of 0 <= unsigned expression is always true [-Wsign-compare]
sv.c:944:7: warning: comparison of 0 <= unsigned expression is always true [-Wsign-compare]
sv.c:950:7: warning: comparison of 0 <= unsigned expression is always true [-Wsign-compare]
perl.c:364:6: warning: expression result unused [-Wunused-value]
perl.c:257:5: warning: expression result unused [-Wunused-value]
perl.c:258:5: warning: expression result unused [-Wunused-value]
perl.c:265:5: warning: expression result unused [-Wunused-value]
perl.c:266:5: warning: expression result unused [-Wunused-value]
doio.c:637:17: warning: expression result unused [-Wunused-value]
doio.c:641:17: warning: expression result unused [-Wunused-value]
toke.c:2192:3: warning: expression result unused [-Wunused-value]
toke.c:2718:3: warning: expression result unused [-Wunused-value]
pp_ctl.c:2248:3: warning: expression result unused [-Wunused-value]
pp_ctl.c:2263:6: warning: expression result unused [-Wunused-value]
toke.c:3845:5: warning: expression result unused [-Wunused-value]
toke.c:3919:6: warning: expression result unused [-Wunused-value]
sv.c:2757:3: warning: expression result unused [-Wunused-value]
regcomp.c:6037:5: warning: expression result unused [-Wunused-value]
doop.c:696:3: warning: expression result unused [-Wunused-value]
doop.c:701:2: warning: expression result unused [-Wunused-value]
doop.c:691:5: warning: expression result unused [-Wunused-value]
pp_sys.c:434:25: warning: expression result unused [-Wunused-value]
pp_sys.c:471:25: warning: expression result unused [-Wunused-value]
perl.c:1802:5: warning: expression result unused [-Wunused-value]
pp_pack.c:2409:5: warning: expression result unused [-Wunused-value]
sv.c:3213:14: warning: expression result unused [-Wunused-value]
sv.c:3222:13: warning: expression result unused [-Wunused-value]
sv.c:3232:13: warning: expression result unused [-Wunused-value]
sv.c:3237:13: warning: expression result unused [-Wunused-value]
sv.c:3267:13: warning: expression result unused [-Wunused-value]
op.c:3086:5: warning: expression result unused [-Wunused-value]
doop.c:1024:2: warning: expression result unused [-Wunused-value]
sv.c:3661:6: warning: expression result unused [-Wunused-value]
op.c:4261:6: warning: expression result unused [-Wunused-value]
toke.c:7538:7: warning: expression result unused [-Wunused-value]
op.c:5084:6: warning: expression result unused [-Wunused-value]
perl.c:3048:8: warning: expression result unused [-Wunused-value]
sv.c:4100:6: warning: expression result unused [-Wunused-value]
sv.c:4102:6: warning: expression result unused [-Wunused-value]
sv.c:4116:13: warning: expression result unused [-Wunused-value]
op.c:5464:5: warning: expression result unused [-Wunused-value]
op.c:5538:5: warning: expression result unused [-Wunused-value]
op.c:5619:2: warning: expression result unused [-Wunused-value]
op.c:5597:5: warning: expression result unused [-Wunused-value]
doio.c:2071:6: warning: expression result unused [-Wunused-value]
pp_sys.c:1074:6: warning: .c:27:
sv.c:4274:13: warning: expression result unused [-Wunused-value]
op.c:6102:5: warning: expression result unused [-Wunused-value]
doio.c:2177:5: warning: expression result unused [-Wunused-value]
sv.c:4514:5: warning: expression result unused [-Wunused-value]
sv.c:4565:5: warning: expression result unused [-Wunused-value]
sv.c:4567:5: warning: expression result unused [-Wunused-value]
pp.c:1748:3: warning: expression result unused [-Wunused-value]
pp.c:1738:2: warning: expression result unused [-Wunused-value]
sv.c:4830:6: warning: expression result unused [-Wunused-value]
doio.c:2285:2: warning: expression result unused [-Wunused-value]
sv.c:4934:6: warning: expression result unused [-Wunused-value]
sv.c:5015:12: warning: expression result unused [-Wunused-value]
sv.c:5031:2: warning: expression result unused [-Wunused-value]
sv.c:5112:5: warning: expression result unused [-Wunused-value]
sv.c:5182:2: warning: expression result unused [-Wunused-value]
pp_sys.c:1283:6: warning: expression result unused [-Wunused-value]
sv.c:5214:5: warning: expression result unused [-Wunused-value]
pp_ctl.c:4424:5: warning: expression result unused [-Wunused-value]
regcomp.c:11763:11: warning: expression result unused [-Wunused-value]
sv.c:5766:2: warning: expression result unused [-Wunused-value]
sv.c:5763:5: warning: expression result unused [-Wunused-value]
op.c:7812:7: warning: expression result unused [-Wunused-value]
perlio.c:5486:21: warning: comparison of integers of different signs: 'size_t' (aka 'unsigned long') and 'int' [-Wsign-compare]
op.c:7923:5: warning: expression result unused [-Wunused-value]
pp_ctl.c:5410:5: warning: expression result unused [-Wunused-value]
toke.c:9360:5: warning: expression result unused [-Wunused-value]
sv.c:7703:6: warning: expression result unused [-Wunused-value]
sv.c:7741:6: warning: expression result unused [-Wunused-value]
sv.c:7777:2: warning: expression result unused [-Wunused-value]
sv.c:7577:5: warning: expression result unused [-Wunused-value]
toke.c:9856:2: warning: expression result unused [-Wunused-value]
toke.c:9770:5: warning: expression result unused [-Wunused-value]
sv.c:8053:5: warning: expression result unused [-Wunused-value]
op.c:8652:6: warning: expression result unused [-Wunused-value]
toke.c:10879:2: warning: expression result unused [-Wunused-value]
pp_sys.c:1717:2: warning: expression result unused [-Wunused-value]
op.c:9896:4: warning: expression result unused [-Wunused-value]
pp.c:3079:7: warning: expression result unused [-Wunused-value]
pp.c:3084:7: warning: expression result unused [-Wunused-value]
regexec.c:4180:19: warning: expression result unused [-Wunused-value]
sv.c:9060:6: warning: expression result unused [-Wunused-value]
sv.c:9061:6: warning: expression result unused [-Wunused-value]
regexec.c:5444:9: warning: expression result unused [-Wunused-value]
pp.c:3346:2: warning: expression result unused [-Wunused-value]
pp.c:3368:6: warning: expression result unused [-Wunused-value]
pp.c:3343:5: warning: expression result unused [-Wunused-value]
pp.c:3356:5: warning: expression result unused [-Wunused-value]
sv.c:9454:5: warning: expression result unused [-Wunused-value]
pp.c:3705:2: warning: expression result unused [-Wunused-value]
sv.c:11031:6: warning: expression result unused [-Wunused-value]
sv.c:11069:2: warning: expression result unused [-Wunused-value]
pp.c:3843:2: warning: expression result unused [-Wunused-value]
pp.c:3919:4: warning: expression result unused [-Wunused-value]
pp.c:3970:8: warning: expression result unused [-Wunused-value]
pp.c:4099:2: warning: expression result unused [-Wunused-value]
pp.c:4218:4: warning: expression result unused [-Wunused-value]
pp.c:4279:2: warning: expression result unused [-Wunused-value]
pp.c:4280:2: warning: expression result unused [-Wunused-value]
sv.c:13644:6: warning: expression result unused [-Wunused-value]
Expect:364:6: warning: expression result unused [-Wunused-value]
./const-c.inc:47:2: warning: expression result unused [-Wunused-value]
./const-c.inc:81:5: warning: expression result unused [-Wunused-value]
Dumper.xs:650:4: warning: expression result unused [-Wunused-value]
Opcode.xs:268:9: warning: expression result unused [-Wunused-value]
Bzip2.xs:326:5: warning: expression result unused [-Wunused-value]
Call.xs:62:58: warning: conversion specifies type 'int' but the argument has type 'STRLEN' (aka 'unsigned long') [-Wformat]
Call.xs:62:78: warning: conversion specifies type 'int' but the argument has type 'STRLEN' (aka 'unsigned long') [-Wformat]
Call.xs:99:53: warning: conversion specifies type 'int' but the argument has type 'STRLEN' (aka 'unsigned long') [-Wformat]
Call.xs:155:46: warning: conversion specifies type 'int' but the argument has type 'STRLEN' (aka 'unsigned long') [-Wformat]
Call.xs:174:57: warning: conversion specifies type 'int' but the argument has type 'STRLEN' (aka 'unsigned long') [-Wformat]
Util.xs:55:9: warning: expression result unused [-Wunused-value]
mro.xs:120:7: warning: expression result unused [-Wunused-value]
Base64.xs:421:8: warning: expression result unused [-Wunused-value]
./const-c.inc:38:2: warning: expression result unused [-Wunused-value]
SysV.xs:364:5: warning: expression result unused [-Wunused-value]
./const-c.inc:73:5: warning: expression result unused [-Wunused-value]
re_comp.c:3639:5: warning: expression result unused [-Wunused-value]
Storable.xs:1793:3: warning: expression result unused [-Wunused-value]
re_exec.c:4180:19: warning: expression result unused [-Wunused-value]
./const-c.inc:72:5: warning: expression result unused [-Wunused-value]
Typemap.xs:95:3: warning: expression result unused [-Wunused-value]
re_exec.c:5444:9: warning: expression result unused [-Wunused-value]
Socket.xs:223:2: warning: expression result unused [-Wunused-value]
scalar.xs:48:5: warning: expression result unused [-Wunused-value]
Zlib.xs:593:5: warning: expression result unused [-Wunused-value]
re_comp.c:6037:5: warning: expression result unused [-Wunused-value]
Storable.xs:4035:2: warning: null passed to a callee which requires a non-null argument [-Wnonnull]
Storable.xs:4468:2: warning: expression result unused [-Wunused-value]
Storable.xs:4771:3: warning: expression result unused [-Wunused-value]
Storable.xs:5353:3: warning: expression result unused [-Wunused-value]
Storable.xs:5400:2: warning: expression result unused [-Wunused-value]
Storable.xs:5440:2: warning: null passed to a callee which requires a non-null argument [-Wnonnull]
Storable.xs:5503:2: warning: null passed to a callee which requires a non-null argument [-Wnonnull]
Storable.xs:5814:4: warning: expression result unused [-Wunused-value]
Storable.xs:5855:3: warning: expression result unused [-Wunused-value]
Storable.xs:6014:5: warning: expression result unused [-Wunused-value]
POSIX.xs:1563:2: warning: expression result unused [-Wunused-value]
POSIX.xs:1682:15: warning: expression result unused [-Wunused-value]
APItest.xs:112:5: warning: expression result unused [-Wunused-value]
APItest.xs:1458:2: warning: expression result unused [-Wunused-value]
APItest.xs:1486:9: warning: expression result unused [-Wunused-value]
APItest.xs:2149:2: warning: expression result unused [-Wunused-value]
APItest.xs:2915:9: warning: expression result unused [-Wunused-value]
FastCalc.xs:337:5: warning: expression result unused [-Wunused-value]
FastCalc.xs:377:5: warning: expression result unused [-Wunused-value]
FastCalc.xs:378:5: warning: expression result unused [-Wunused-value]
Collate.xs:605:2: warning: expression result unused [-Wunused-value]
Collate.xs:595:2: warning: expression result unused [-Wunused-value]
Unicode.xs:176:6: warning: expression result unused [-Wunused-value]
Unicode.xs:334:6: warning: expression result unused [-Wunused-value]
Unicode.xs:326:5: warning: expression result unused [-Wunused-value]
ExtTest.xs:44:2: warning: expression result unused [-Wunused-value]
ExtTest.xs:78:5: warning: expression result unused [-Wunused-value]
pp_sys.c:323:6: warning: result of comparison against a string literal is unspecified (use strncmp instead)
pp_sys.c:403:5: warning: result of comparison against a string literal is unspecified (use strncmp instead)
pp_sys.c:562:5: warning: result of comparison against a string literal is unspecified (use strncmp instead)
pp_sys.c:915:5: warning: result of comparison against a string literal is unspecified (use strncmp instead)
pp_sys.c:944:9: warning: result of comparison against a string literal is unspecified (use strncmp instead)
pp_sys.c:1074:6: warning: expression result unused [-Wunused-value]
pp_hot.c:173:3: warning: result of comparison against a string literal is unspecified (use strncmp instead)
pp_ctl.c:1190:5: warning: result of comparison against a string literal is unspecified (use strncmp instead)
pp_ctl.c:1196:2: warning: result of comparison against a string literal is unspecified (use strncmp instead)
op.c:4654:6: warning: result of comparison against a string literal is unspecified (use strncmp instead)
op.c:5597:5:pp_hot.c:1623:6: warning: expression result unused [-Wunused-value]
pp_ctl.c:2156:5: warning: result of comparison against a string literal is unspecified (use strncmp instead)
pp_ctl.c:2320:5: warning: result of comparison against a string literal is unspecified (use strncmp instead)
pp_ctl.c:2321:5: warning: result of comparison against a string literal is unspecified (use strncmp instead)
pp_hot.c:2430:5: warning: result of comparison against a string literal is unspecified (use strncmp instead)
pp_hot.c:2437:2: warning: result of comparison against a string literal is unspecified (use strncmp instead)
pp_ctl.c:3376:5: warning: result of comparison against a string literal is unspecified (use strncmp instead)
pp_ctl.c:3563:6: warning: result of comparison against a string literal is unspecified (use strncmp instead)
pp_ctl.c:3912:7: warning: result of comparison against a string literal is unspecified (use strncmp instead)
pp.c:5190:2: warning: result of comparison against a string literal is unspecified (use strncmp instead)
pp.c:5240:2: warning: result of comparison against a string literal is unspecified (use strncmp instead)
pp.c:5800:6: warning: result of comparison against a string literal is unspecified (use strncmp instead)
pp_ctl.c:4292:2: warning: result of comparison against a string literal is unspecified (use strncmp instead)
pp_ctl.c:4315:5: warning: result of comparison against a string literal is unspecified (use strncmp instead)
sv.c:4664:5: warning: expression result unused [-Wunused-value]
pp_ctl.c:4372:5: warning: result of comparison against a string literal is unspecified (use strncmp instead)
pp_ctl.c:4411:5: warning: result of comparison against a string literal is unspecified (use strncmp instead)
pp_ctl.c:4457:5: warning: result of comparison against a string literal is unspecified (use strncmp instead)
pp_ctl.c:4557:3: warning: result of comparison against a string literal is unspecified (use strncmp instead)
pp_ctl.c:4589:3: warning: result of comparison against a string literal is unspecified (use strncmp instead)
pp_ctl.c:4611:6: warning: result of comparison against a string literal is unspecified (use strncmp instead)
pp_ctl.c:4987:5: warning: result of comparison against a string literal is unspecified (use strncmp instead)
pp_ctl.c:5033:5: warning: result of comparison against a string literal is unspecified (use strncmp instead)
pp_ctl.c:5447:2: warning: result of comparison against a string literal is unspecified (use strncmp instead)
Dumper.xs:243:2: warning: expression result unused [-Wunused-value]
Typemap.xs:130:3: warning: expression result unused [-Wunused-value]
Typemap.xs:166:3: warning: expression result unused [-Wunused-value]
Typemap.xs:202:3: warning: expression result unused [-Wunused-value]
Typemap.xs:243:3: warning: expression result unused [-Wunused-value]
In file included from ./perl.h:3452sv.c:502:5: warning: expression result unused [-Wunused-value]
doio.c:584:11: warning: passing 'int *' to parameter of type 'socklen_t *' (aka 'unsigned int *') converts between pointers to integer types with different sign [-Wpointer-sign]
regexec.c:2586:8: warning: expression result unused [-Wunused-value]
sv.c 3661:6: warning: expression result unused [-Wunused-value]
toke.c:pp_sys.c:434:25: warning: expression result unused [-Wunused-value]
7538:7: warning: expression result unused [-Wunused-value]
op.c:5597:5: warning: sv.c:4514:5:     LINKLexpression
pp_sys.c:1652:10: warning: passing 'int *' to parameter of type 'socklen_t *' (aka 'unsigned int *') converts between pointers to integer types with different sign [-Wpointer-sign]
pp_sys.c:2530:10: warning: passing 'int *' to parameter of type 'socklen_t *' (aka 'unsigned int *') converts between pointers to integer types with different sign [-Wpointer-sign]
pp_sys.c:2621:6: warning: passing 'int *' to parameter of type 'socklen_t *' (aka 'unsigned int *') converts between pointers to integer types with different sign [-Wpointer-sign]
pp_sys.c:2691:6: warning: passing 'int *' to parameter of type 'socklen_t *' (aka 'unsigned int *') converts between pointers to integer types with different sign [-Wpointer-sign]
pp_sys.c:2695:6: warning: passing 'int *' to parameter of type 'socklen_t *' (aka 'unsigned int *') converts between pointers to integer types with different sign [-Wpointer-sign]
re_exec.c:2586:8: warning: expression result unused [-Wunused-value]
Storable.xs:998Typemap.xs:95:3: warning: expression result unused [-Wunused-value]
./scope.h:154:4:op.c:4654:6: warning: result of comparison against a string literal is unspecified (use strncmp instead)
-- 
Report by Test::Smoke v1.44 build 1285 running on perl 5.10.1
(Reporter v0.035 / Smoker v0.045)




nntp.perl.org: Perl Programming lists via nntp and http.
Comments to Ask Bjørn Hansen at ask@perl.org | Group listing | About