develooper Front page | perl.perl5.porters | Postings from September 2011

Smoke [maint-5.14] v5.14.2-1-g1b28bbf FAIL(XF) linux 2.6.38-11-generic [debian] (x86_64/8 cpu)

From:
George Greer
Date:
September 27, 2011 23:04
Subject:
Smoke [maint-5.14] v5.14.2-1-g1b28bbf FAIL(XF) linux 2.6.38-11-generic [debian] (x86_64/8 cpu)
Message ID:
201109280604.p8S641Zf013861@m-l.org
Smoke logs available at http://m-l.org/~perl/smoke/perl/

Automated smoke report for 5.14.2 patch 1b28bbf144f8c7623a64cf185770d02c50039be9 v5.14.2-1-g1b28bbf
zwei: Intel(R) Core(TM) i7 CPU 920 @ 2.67GHz (GenuineIntel 1600MHz) (x86_64/8 cpu)
    on        linux - 2.6.38-11-generic [debian]
    using     clang version 4.2.1 Compatible Clang Compiler
    smoketime 21 hours 55 minutes (average 1 hour 5 minutes)

Summary: FAIL(XF)

O = OK  F = Failure(s), extended report at the bottom
X = Failure(s) under TEST but not under harness
? = still running or test results not (yet) available
Build failures during:       - = unknown or N/A
c = Configure, m = make, M = make (after miniperl), t = make test-prep

v5.14.2-1-g1b28bbf  Configuration (common) -A -Dcc=clang append:ccflags=" -fcatch-undefined-behavior "
----------- ---------------------------------------------------------
X O O O X X F X 
O O O O X X F X -Accflags=-DPERL_POISON
O O O O X X F X -Duse64bitall
O O O O X X F X -Dusemorebits
O O O O X X F X -Dmad
O O O X X X F X -Duseithreads
O O O O X X F X -Duseithreads -Accflags=-DPERL_POISON
O O O O X X F X -Duseithreads -Duse64bitall
O O O O X X F X -Duseithreads -Dusemorebits
O O O O X X F X -Duseithreads -Dmad
| | | | | +- LC_ALL = en_US.utf8 -DDEBUGGING
| | | | +--- PERLIO = perlio -DDEBUGGING
| | | +----- PERLIO = stdio  -DDEBUGGING
| | +------- LC_ALL = en_US.utf8
| +--------- PERLIO = perlio
+----------- PERLIO = stdio 

Locally applied patches:
    uncommitted-changes
    SMOKE1b28bbf144f8c7623a64cf185770d02c50039be9

Failures: (common-args) -A -Dcc=clang append:ccflags=" -fcatch-undefined-behavior "
[stdio] 
[en_US.utf8] -Duseithreads
Inconsistent test results (between TEST and harness):
    ../lib/Benchmark.t......................FAILED at test 15

[stdio] -DDEBUGGING
Inconsistent test results (between TEST and harness):
    ../t/re/regexp.t........................FAILED--expected 1525 tests, saw 1409
    ../t/re/pat_re_eval.t...................FAILED--expected 123 tests, saw 16
    ../lib/Benchmark.t......................FAILED at test 15
    ../t/uni/fold.t.........................FAILED--no leader found
    ../t/re/fold_grind.t....................FAILED--no leader found
    ../t/re/regexp_qr_embed.t...............FAILED--expected 1525 tests, saw 1409
    ../t/re/regexp_qr.t.....................FAILED--expected 1525 tests, saw 1409
    ../t/cpan/Archive-Tar/t/02_methods.t....FAILED--no leader found
    ../t/re/pat_advanced.t..................FAILED--no leader found
    ../t/re/regexp_noamp.t..................FAILED--expected 1525 tests, saw 1409
    ../t/re/regexp_trielist.t...............FAILED--expected 1525 tests, saw 1409
    ../t/dist/IO/t/io_file.t................FAILED--no leader found
    ../t/re/regexp_notrie.t.................FAILED--expected 1525 tests, saw 1409

[perlio/en_US.utf8] -DDEBUGGING
[stdio/perlio/en_US.utf8] -DDEBUGGING -Accflags=-DPERL_POISON
[stdio/perlio/en_US.utf8] -DDEBUGGING -Duse64bitall
[stdio/perlio/en_US.utf8] -DDEBUGGING -Dusemorebits
[stdio/perlio] -DDEBUGGING -Dmad
Inconsistent test results (between TEST and harness):
    ../t/re/regexp.t........................FAILED--expected 1525 tests, saw 1409
    ../t/re/pat_re_eval.t...................FAILED--expected 123 tests, saw 16
    ../t/uni/fold.t.........................FAILED--no leader found
    ../t/re/fold_grind.t....................FAILED--no leader found
    ../t/re/regexp_qr_embed.t...............FAILED--expected 1525 tests, saw 1409
    ../t/re/pat_advanced.t..................FAILED--no leader found
    ../t/re/regexp_qr.t.....................FAILED--expected 1525 tests, saw 1409
    ../t/cpan/Archive-Tar/t/02_methods.t....FAILED--no leader found
    ../t/re/regexp_noamp.t..................FAILED--expected 1525 tests, saw 1409
    ../t/re/regexp_trielist.t...............FAILED--expected 1525 tests, saw 1409
    ../t/dist/IO/t/io_file.t................FAILED--no leader found
    ../t/re/regexp_notrie.t.................FAILED--expected 1525 tests, saw 1409

[minitest] -DDEBUGGING
[minitest] -DDEBUGGING -Accflags=-DPERL_POISON
[minitest] -DDEBUGGING -Duse64bitall
[minitest] -DDEBUGGING -Dusemorebits
[minitest] -DDEBUGGING -Dmad
[minitest] -DDEBUGGING -Duseithreads
[minitest] -DDEBUGGING -Duseithreads -Accflags=-DPERL_POISON
[minitest] -DDEBUGGING -Duseithreads -Duse64bitall
[minitest] -DDEBUGGING -Duseithreads -Dusemorebits
[minitest] -DDEBUGGING -Duseithreads -Dmad
    t/re/regexp.....................FAILED--expected 1525 tests, saw 1409
    t/re/regexp_noamp...............FAILED--expected 1525 tests, saw 1409
    t/re/regexp_notrie..............FAILED--expected 1525 tests, saw 1409
    t/re/regexp_qr..................FAILED--expected 1525 tests, saw 1409
    t/re/regexp_qr_embed............FAILED--expected 1525 tests, saw 1409
    t/re/regexp_trielist............FAILED--expected 1525 tests, saw 1409
    t/uni/fold......................FAILED--no leader found

[en_US.utf8] -DDEBUGGING -Dmad
Inconsistent test results (between TEST and harness):
    ../t/re/regexp.t........................FAILED--expected 1525 tests, saw 1409
    ../t/re/pat_re_eval.t...................FAILED--expected 123 tests, saw 16
    ../t/uni/fold.t.........................FAILED--no leader found
    ../t/re/fold_grind.t....................FAILED--no leader found
    ../t/re/regexp_qr_embed.t...............FAILED--expected 1525 tests, saw 1409
    ../lib/warnings.t.......................FAILED at test 245
    ../t/re/pat_advanced.t..................FAILED--no leader found
    ../t/re/regexp_qr.t.....................FAILED--expected 1525 tests, saw 1409
    ../t/cpan/Archive-Tar/t/02_methods.t....FAILED--no leader found
    ../t/re/regexp_noamp.t..................FAILED--expected 1525 tests, saw 1409
    ../t/op/runlevel.t......................FAILED at test 9
    ../t/re/regexp_trielist.t...............FAILED--expected 1525 tests, saw 1409
    ../t/dist/IO/t/io_file.t................FAILED--no leader found
    ../t/re/regexp_notrie.t.................FAILED--expected 1525 tests, saw 1409

[stdio/perlio/en_US.utf8] -DDEBUGGING -Duseithreads
[stdio/perlio/en_US.utf8] -DDEBUGGING -Duseithreads -Accflags=-DPERL_POISON
[stdio/perlio/en_US.utf8] -DDEBUGGING -Duseithreads -Duse64bitall
[stdio/perlio/en_US.utf8] -DDEBUGGING -Duseithreads -Dusemorebits
[stdio/perlio/en_US.utf8] -DDEBUGGING -Duseithreads -Dmad
Inconsistent test results (between TEST and harness):
    ../t/re/regexp.t........................FAILED--expected 1525 tests, saw 1409
    ../t/re/pat_re_eval.t...................FAILED--expected 123 tests, saw 16
    ../t/uni/fold.t.........................FAILED--no leader found
    ../t/re/fold_grind.t....................FAILED--no leader found
    ../t/re/regexp_qr_embed.t...............FAILED--expected 1525 tests, saw 1409
    ../t/re/pat_advanced.t..................FAILED--no leader found
    ../t/re/regexp_qr.t.....................FAILED--expected 1525 tests, saw 1409
    ../t/cpan/Archive-Tar/t/02_methods.t....FAILED--no leader found
    ../t/re/pat_advanced_thr.t..............FAILED--no leader found
    ../t/re/regexp_noamp.t..................FAILED--expected 1525 tests, saw 1409
    ../t/re/regexp_trielist.t...............FAILED--expected 1525 tests, saw 1409
    ../t/dist/IO/t/io_file.t................FAILED--no leader found
    ../t/re/regexp_notrie.t.................FAILED--expected 1525 tests, saw 1409
    ../t/re/pat_re_eval_thr.t...............FAILED--expected 123 tests, saw 16
    ../t/re/regexp_qr_embed_thr.t...........FAILED--expected 1525 tests, saw 1409

Compiler messages(gcc):
try.c:5737:17: warning: extra tokens at end of #ifdef directive [-Wextra-tokens]
try.c:5740:18: warning: extra tokens at end of #ifdef directive [-Wextra-tokens]
try.c:5743:19: warning: extra tokens at end of #ifdef directive [-Wextra-tokens]
try.c:5746:19: warning: extra tokens at end of #ifdef directive [-Wextra-tokens]
try.c:5773:17: warning: extra tokens at end of #ifdef directive [-Wextra-tokens]
try.c:5776:18: warning: extra tokens at end of #ifdef directive [-Wextra-tokens]
try.c:5779:19: warning: extra tokens at end of #ifdef directive [-Wextra-tokens]
try.c:5782:19: warning: extra tokens at end of #ifdef directive [-Wextra-tokens]
try.c:5809:17: warning: extra tokens at end of #ifdef directive [-Wextra-tokens]
try.c:5812:18: warning: extra tokens at end of #ifdef directive [-Wextra-tokens]
try.c:5815:19: warning: extra tokens at end of #ifdef directive [-Wextra-tokens]
try.c:5818:19: warning: extra tokens at end of #ifdef directive [-Wextra-tokens]
try.c:5845:16: warning: extra tokens at end of #ifdef directive [-Wextra-tokens]
try.c:5848:17: warning: extra tokens at end of #ifdef directive [-Wextra-tokens]
try.c:5851:18: warning: extra tokens at end of #ifdef directive [-Wextra-tokens]
try.c:5854:18: warning: extra tokens at end of #ifdef directive [-Wextra-tokens]
try.c:5881:18: warning: extra tokens at end of #ifdef directive [-Wextra-tokens]
try.c:5884:19: warning: extra tokens at end of #ifdef directive [-Wextra-tokens]
try.c:5887:20: warning: extra tokens at end of #ifdef directive [-Wextra-tokens]
try.c:5890:20: warning: extra tokens at end of #ifdef directive [-Wextra-tokens]
try.c:6721:18: warning: extra tokens at end of #ifdef directive [-Wextra-tokens]
try.c:6724:19: warning: extra tokens at end of #ifdef directive [-Wextra-tokens]
try.c:6727:20: warning: extra tokens at end of #ifdef directive [-Wextra-tokens]
try.c:6730:20: warning: extra tokens at end of #ifdef directive [-Wextra-tokens]
try.c:6757:18: warning: extra tokens at end of #ifdef directive [-Wextra-tokens]
try.c:6760:19: warning: extra tokens at end of #ifdef directive [-Wextra-tokens]
try.c:6763:20: warning: extra tokens at end of #ifdef directive [-Wextra-tokens]
try.c:6766:20: warning: extra tokens at end of #ifdef directive [-Wextra-tokens]
try.c:6793:18: warning: extra tokens at end of #ifdef directive [-Wextra-tokens]
try.c:6796:19: warning: extra tokens at end of #ifdef directive [-Wextra-tokens]
try.c:6799:20: warning: extra tokens at end of #ifdef directive [-Wextra-tokens]
try.c:6802:20: warning: extra tokens at end of #ifdef directive [-Wextra-tokens]
try.c:6829:17: warning: extra tokens at end of #ifdef directive [-Wextra-tokens]
try.c:6832:18: warning: extra tokens at end of #ifdef directive [-Wextra-tokens]
try.c:6835:19: warning: extra tokens at end of #ifdef directive [-Wextra-tokens]
try.c:6838:19: warning: extra tokens at end of #ifdef directive [-Wextra-tokens]
try.c:6865:19: warning: extra tokens at end of #ifdef directive [-Wextra-tokens]
try.c:6868:20: warning: extra tokens at end of #ifdef directive [-Wextra-tokens]
try.c:6871:21: warning: extra tokens at end of #ifdef directive [-Wextra-tokens]
try.c:6874:21: warning: extra tokens at end of #ifdef directive [-Wextra-tokens]
util.c:559:5: warning: expression result unused [-Wunused-value]
util.c:2619:5: warning: expression result unused [-Wunused-value]
util.c:2786:5: warning: expression result unused [-Wunused-value]
doop.c:696:3: warning: expression result unused [-Wunused-value]
doop.c:701:2: warning: expression result unused [-Wunused-value]
doop.c:691:5: warning: expression result unused [-Wunused-value]
doop.c:1024:2: warning: expression result unused [-Wunused-value]
pp_ctl.c:280:2: warning: expression result unused [-Wunused-value]
mro.c:589:21: warning: expression result unused [-Wunused-value]
mro.c:634:2: warning: expression result unused [-Wunused-value]
toke.c:2185:3: warning: expression result unused [-Wunused-value]
toke.c:2711:3: warning: expression result unused [-Wunused-value]
pp_hot.c:143:3: warning: expression result unused [-Wunused-value]
pp_ctl.c:389:2: warning: expression result unused [-Wunused-value]
pp_ctl.c:401:8: warning: expression result unused [-Wunused-value]
sv.c:502:5: warning: expression result unused [-Wunused-value]
sv.c:544:5: warning: expression result unused [-Wunused-value]
sv.c:903:39: warning: comparison of 0 <= unsigned expression is always true [-Wsign-compare]
sv.c:928:17: warning: comparison of 0 <= unsigned expression is always true [-Wsign-compare]
sv.c:935:7: warning: comparison of 0 <= unsigned expression is always true [-Wsign-compare]
sv.c:940:17: warning: comparison of 0 <= unsigned expression is always true [-Wsign-compare]
sv.c:944:17: warning: comparison of 0 <= unsigned expression is always true [-Wsign-compare]
sv.c:950:7: warning: comparison of 0 <= unsigned expression is always true [-Wsign-compare]
sv.c:868:25pp_ctl.c:932:7: warning: expression result unused [-Wunused-value]
pp_ctl.c:998:3: warning: expression result unused [-Wunused-value]
pp_ctl.c:568:5: warning: expression result unused [-Wunused-value]
pp_sys.c:1079:6: warning: expression result unused [-Wunused-value]
regcomp.c:3639:5: warning: expression result unused [-Wunused-value]
toke.c:4796:17: warning: comparison of integers of different signs: 'IV' (aka 'long') and 'STRLEN' (aka 'unsigned long') [-Wsign-compare]
pp_hot.c:1233:5: warning: expression result unused [-Wunused-value]
pp_ctl.c:1357:6: warning: expression result unused [-Wunused-value]
doio.c:634:17: warning: expression result unused [-Wunused-value]
doio.c:638:17: warning: expression result unused [-Wunused-value]
pp_sys.c:1287:6: warning: expression result unused [-Wunused-value]
perl.c:364:6: warning: expression result unused [-Wunused-value]
perl.c:257:5: warning: expression result unused [-Wunused-value]
perl.c:258:5: warning: expression result unused [-Wunused-value]
perl.c:265:5: warning: expression result unused [-Wunused-value]
perl.c:266:5: warning: expression result unused [-Wunused-value]
regcomp.c:5934:5: warning: expression result unused [-Wunused-value]
sv.c:2769:3: warning: expression result unused [-Wunused-value]
pp_hot.c:1652:3: warning: expression result unused [-Wunused-value]
pp_hot.c:1657:6: warning: expression result unused [-Wunused-value]
pp_hot.c:1670:3: warning: expression result unused [-Wunused-value]
pp_hot.c:1659:2: warning: expression result unused [-Wunused-value]
pp_sys.c:1723:2: warning: expression result unused [-Wunused-value]
sv.c:3224:14: warning: expression result unused [-Wunused-value]
sv.c:3233:13: warning: expression result unused [-Wunused-value]
sv.c:3243:13: warning: expression result unused [-Wunused-value]
regcomp.c:11372:11: warning: expression result unused [-Wunused-value]
sv.c:3248:13: warning: expression result unused [-Wunused-value]
pp.c:1812:3: warning: expression result unused [-Wunused-value]
pp.c:1802:2: warning: expression result unused [-Wunused-value]
sv.c:3671:6: warning: expression result unused [-Wunused-value]
pp_ctl.c:2163:3: warning: expression result unused [-Wunused-value]
pp_ctl.c:2178:6: warning: expression result unused [-Wunused-value]
toke.c:7534:7: warning: expression result unused [-Wunused-value]
perl.c:1775:5: warning: expression result unused [-Wunused-value]
pp_hot.c:2434:6: warning: expression result unused [-Wunused-value]
doio.c:2093:6: warning: expression result unused [-Wunused-value]
doio.c:2199:5: warning: expression result unused [-Wunused-value]
sv.c:4106:6: warning: expression result unused [-Wunused-value]
sv.c:4108:6: warning: expression result unused [-Wunused-value]
sv.c:4122:13: warning: expression result unused [-Wunused-value]
pp_pack.c:2409:5: warning: expression result unused [-Wunused-value]
perl.c:3015:8: warning: expression result unused [-Wunused-value]
regexec.c:4151:19: warning: expression result unused [-Wunused-value]
doio.c:2307:2: warning: expression result unused [-Wunused-value]
sv.c:4279:13: warning: expression result unused [-Wunused-value]
perlio.c:5509:21: warning: comparison of integers of different signs: 'size_t' (aka 'unsigned long') and 'int' [-Wsign-compare]
sv.c:4519:5: warning: expression result unused [-Wunused-value]
sv.c:4569:5: warning: expression result unused [-Wunused-value]
sv.c:4571:5: warning: expression result unused [-Wunused-value]
sv.c:4624:5: warning: expression result unused [-Wunused-value]
regexec.c:5408:9: warning: expression result unused [-Wunused-value]
sv.c:4790:6: warning: expression result unused [-Wunused-value]
sv.c:4893:6: warning: expression result unused [-Wunused-value]
sv.c:4962:5: warning: expression result unused [-Wunused-value]
sv.c:5057:5: warning: expression result unused [-Wunused-value]
sv.c:5127:2: warning: expression result unused [-Wunused-value]
sv.c:5159:5: warning: expression result unused [-Wunused-value]
op.c:2768:5: warning: expression result unused [-Wunused-value]
sv.c:5836:2: warning: expression result unused [-Wunused-value]
sv.c:5833:5: warning: expression result unused [-Wunused-value]
pp.c:3496:7: warning: expression result unused [-Wunused-value]
pp.c:3501:7: warning: expression result unused [-Wunused-value]
pp_ctl.c:4302:5: warning: expression result unused [-Wunused-value]
pp.c:3762:2: warning: expression result unused [-Wunused-value]
pp.c:3784:6: warning: expression result unused [-Wunused-value]
pp.c:3772:5: warning: expression result unused [-Wunused-value]
pp.c:4132:2: warning: expression result unused [-Wunused-value]
pp.c:4270:2: warning: expression result unused [-Wunused-value]
pp.c:4353:4: warning: expression result unused [-Wunused-value]
pp.c:4404:8: warning: expression result unused [-Wunused-value]
sv.c:7717:6: warning: expression result unused [-Wunused-value]
sv.c:7755:6: warning: expression result unused [-Wunused-value]
sv.c:7791:2: warning: expression result unused [-Wunused-value]
pp.c:4533:2: warning: expression result unused [-Wunused-value]
pp.c:4661:4: warning: expression result unused [-Wunused-value]
pp_ctl.c:5244:5: warning: expression result unused [-Wunused-value]
pp.c:4724:2: warning: expression result unused [-Wunused-value]
pp.c:4725:2: warning: expression result unused [-Wunused-value]
sv.c:7591:5: warning: expression result unused [-Wunused-value]
sv.c:8067:5: warning: expression result unused [-Wunused-value]
op.c:3937:6: warning: expression result unused [-Wunused-value]
toke.c:9332:5: warning: expression result unused [-Wunused-value]
op.c:5148:5: warning: expression result unused [-Wunused-value]
toke.c:9828:2: warning: expression result unused [-Wunused-value]
op.c:5222:5: warning: expression result unused [-Wunused-value]
op.c:5297:2: warning: expression result unused [-Wunused-value]
op.c:5281:5: warning: expression result unused [-Wunused-value]
toke.c:9742:5: warning: expression result unused [-Wunused-value]
op.c:5778:5: warning: expression result unused [-Wunused-value]
toke.c:10851:2: warning: expression result unused [-Wunused-value]
sv.c:9083:6: warning: expression result unused [-Wunused-value]
sv.c:9084:6: warning: expression result unused [-Wunused-value]
sv.c:9453:5: warning: expression result unused [-Wunused-value]
sv.c:11017:6: warning: expression result unused [-Wunused-value]
sv.c:11055:2: warning: expression result unused [-Wunused-value]
sv.c:13606:6: warning: expression result unused [-Wunused-value]
op.c:7474:7: warning: expression result unused [-Wunused-value]
op.c:7581:5: warning: expression result unused [-Wunused-value]
op.c:8320:6: warning: expression result unused [-Wunused-value]
op.c:9486:4: warning: expression result unused [-Wunused-value]
./const-c.inc:47:2: warning: expression result unused [-Wunused-value]
./const-c.inc:81:5: warning: expression result unused [-Wunused-value]
Bzip2.xs:326:5: warning: expression result unused [-Wunused-value]
Dumper.xs:817:37: warning: conversion specifies type 'long' but the argument has type 'U32' (aka 'unsigned int') [-Wformat]
SysV.xs:364:5: warning: expression result unused [-Wunused-value]
Zlib.xs:593:5: warning: expression result unused [-Wunused-value]
Util.xs:55:9: warning: expression result unused [-Wunused-value]
Base64.xs:421:8: warning: expression result unused [-Wunused-value]
Socket.xs:227:2: warning: expression result unused [-Wunused-value]
scalar.xs:48:5: warning: expression result unused [-Wunused-value]
Typemap.xs:88:3: warning: expression result unused [-Wunused-value]
Storable.xs:1852:3: warning: expression result unused [-Wunused-value]
mro.xs:120:7: warning: expression result unused [-Wunused-value]
./const-c.inc:38:2: warning: expression result unused [-Wunused-value]
./const-c.inc:72:5: warning: expression result unused [-Wunused-value]
Storable.xs:4098:2: warning: null passed to a callee which requires a non-null argument [-Wnonnull]
re_comp.c:3639:5: warning: expression result unused [-Wunused-value]
Storable.xs:4531:2: warning: expression result unused [-Wunused-value]
Storable.xs:4834:3: warning: expression result unused [-Wunused-value]
Storable.xs:5416:3: warning: expression result unused [-Wunused-value]
Storable.xs:5463:2: warning: expression result unused [-Wunused-value]
Storable.xs:5503:2: warning: null passed to a callee which requires a non-null argument [-Wnonnull]
APItest.xs:112:5: warning: expression result unused [-Wunused-value]
Storable.xs:5566:2: warning: null passed to a callee which requires a non-null argument [-Wnonnull]
Storable.xs:5877:4: warning: expression result unused [-Wunused-value]
Storable.xs:5918:3: warning: expression result unused [-Wunused-value]
Storable.xs:6077:5: warning: expression result unused [-Wunused-value]
POSIX.xs:1696:2: warning: expression result unused [-Wunused-value]
re_exec.c:4151:19: warning: expression result unused [-Wunused-value]
POSIX.xs:1815:15: warning: expression result unused [-Wunused-value]
APItest.xs:1392:2: warning: expression result unused [-Wunused-value]
APItest.xs:1420:9: warning: expression result unused [-Wunused-value]
re_exec.c:5408:9: warning: expression result unused [-Wunused-value]
APItest.xs:1877:2: warning: expression result unused [-Wunused-value]
re_comp.c:5934:5: warning: expression result unused [-Wunused-value]
APItest.xs:2606:9: warning: expression result unused [-Wunused-value]
FastCalc.xs:335:5: warning: expression result unused [-Wunused-value]
FastCalc.xs:375:5: warning: expression result unused [-Wunused-value]
FastCalc.xs:376:5: warning: expression result unused [-Wunused-value]
Collate.xs:587:2: warning: expression result unused [-Wunused-value]
Collate.xs:578:2: warning: expression result unused [-Wunused-value]
HiRes.xs:768:5: warning: expression result unused [-Wunused-value]
HiRes.xs:769:5: warning: expression result unused [-Wunused-value]
Unicode.xs:176:6: warning: expression result unused [-Wunused-value]
Unicode.xs:334:6: warning: expression result unused [-Wunused-value]
Unicode.xs:326:5: warning: expression result unused [-Wunused-value]
ExtTest.xs:44:2: warning: expression result unused [-Wunused-value]
ExtTest.xs:78:5: warning: expression result unused [-Wunused-value]
sv.c:956:7: warning: comparison of 0 <= unsigned expression is always true [-Wsign-compare]
sv.c:963:7: warning: comparison of 0 <= unsigned expression is always true [-Wsign-compare]
pp_hot.c:172:3: warning: result of comparison against a string literal is unspecified (use strncmp instead)
pp_sys.c:327:6: warning: result of comparison against a string literal is unspecified (use strncmp instead)
toke.c:3836:5: warning: expression result unused [-Wunused-value]
    SvIV(&PL_sv_no);toke.c:3910:6: warning: expression result unused [-Wunused-value]
pp_sys.c:550:5: warning: result of comparison against a string literal is unspecified (use strncmp instead)
pp_ctl.c:932:7: warning: expression result unused [-Wunused-value]
pp_sys.c:908:5: warning: result of comparison against a string literal is unspecified (use strncmp instead)
pp_sys.c:943:9: warning: result of comparison against a string literal is unspecified (use strncmp instead)
pp_ctl.c:1209:5: warning: result of comparison against a string literal is unspecified (use strncmp instead)
pp_ctl.c:1215:2: warning: result of comparison against a string literal is unspecified (use strncmp instead)
pp_hot.c:1929:5: warning: result of comparison against a string literal is unspecified (use strncmp instead)
op.c:4330:6: warning: result of comparison against a string literal is unspecified (use strncmp instead)
pp_hot.c:2530:5: warning: result of comparison against a string literal is unspecified (use strncmp instead)
pp_hot.c:2537:2: warning: result of comparison against a string literal is unspecified (use strncmp instead)
pp_ctl.c:2249:5: warning: result of comparison against a string literal is unspecified (use strncmp instead)
pp_ctl.c:2250:5: warning: result of comparison against a string literal is unspecified (use strncmp instead)
pp_ctl.c:3176:5: warning: result of comparison against a string literal is unspecified (use strncmp instead)
pp_ctl.c:3362:6: warning: result of comparison against a string literal is unspecified (use strncmp instead)
pp_ctl.c:3716:7: warning: result of comparison against a string literal is unspecified (use strncmp instead)
pp.c:3759:5: warning: expression result unused [-Wunused-value]
pp_ctl.c:4119:2: warning: result of comparison against a string literal is unspecified (use strncmp instead)
pp_ctl.c:4142:5: warning: result of comparison against a string literal is unspecified (use strncmp instead)
pp_ctl.c:4225:5: warning: resu:4533:2: warning: expression result unused [-Wunused
pp_ctl.c:4289:5: warning: result of comparison against a string literal is unspecified (use strncmp instead)
pp_ctl.c:4335:5: warning: result of comparison against a string literal is unspecified (use strncmp instead)
pp_ctl.c:4435:3: warning: result of comparison against a string literal is unspecified (use strncmp instead)
pp_ctl.c:4467:3: warning: result of comparison against a string literal is unspecified (use strncmp instead)
pp_ctl.c:4489:6: warning: result of comparison against a string literal is unspecified (use strncmp instead)
pp.c:5644:2: warning: result of comparison against a string literal is unspecified (use strncmp instead)
pp.c:5694:2: warning: result of comparison against a string literal is unspecified (use strncmp instead)
pp.c:6254:6: warning: result of comparison against a string literal is unspecified (use strncmp instead)
pp_ctl.c:4861:5: warning: result of comparison against a string literal is unspecified (use strncmp instead)
pp_ctl.c:5281:2: warning: result of comparison against a string literal is unspecified (use strncmp instead)
DProf.xs:362:2: warning: expression result unused [-Wunused-value]
Dumper.xs:650:4: warning: expression result unused [-Wunused-value]
Call.xs:62:58: warning: conversion specifies type 'int' but the argument has type 'STRLEN' (aka 'unsigned long') [-Wformat]
Call.xs:62:78: warning: conversion specifies type 'int' but the argument has type 'STRLEN' (aka 'unsigned long') [-Wformat]
Call.xs:99:53: warning: conversion specifies type 'int' but the argument has type 'STRLEN' (aka 'unsigned long') [-Wformat]
Call.xs:155:46: warning: conversion specifies type 'int' but the argument has type 'STRLEN' (aka 'unsigned long') [-Wformat]
Call.xs:174:57: warning: conversion specifies type 'int' but the argument has type 'STRLEN' (aka 'unsigned long') [-Wformat]
Opcode.xs:268:9: warning: expression result unused [-Wunused-value]
./const-c.inc:73:5: warning: expression result unused [-Wunused-value]
In file included from toke.c:2185:3: warning: expression result unused [-Wunused-value]
toke.c:3910:6: warning: expression result unused [-Wunused-value]
Dumper.xs:243:2: warning: expression result unused [-Wunused-value]
pp_sys.c:407:5: warning: result of comparison against a string literal is unspecified (use strncmp instead)
./scope.h:pp_hot.c:1929:5: warning: result of comparison against a string literal is unspecified (use strncmp instead)
pp_ctl.c:4225:5: warning: result of comparison against a string literal is unspecified (use strncmp instead)
In file included from ../../perl.h:3442In../../sv.h::90:12: ./const-c.inc:#d:2: warning: expression result unused [-Wunused-value]
pp_sys.c:op.c:2768:5: warning: expression result unused [-Wunused-value]
perl.c:258:5: warning: expression result unused [-Wunused-value]#define SvUPGRADE(sv, mt) (SvTYPE(sv) >= (mt) || (sv_upgrade(sv, mt), 1))
#    define SvPVX(sv) ((sv)->sv_u.svu_pv)op.c:5778:5: warning: expression result unused [-Wunused-value]
./sv.hsv.c:2769:3: warning: expression result unused [-Wunused-value]
In file included from pp_ctl.c:2163:3: warning: expression result unused [-Wunused-value]
1PItest.xs:1392:2: warning: expression result unused [-Wunused-value]
#    define SvPVX(sv) ((sv)->sv_u.svu_pv)toke.c:3836:5: warning: expression result unused [-Wunused-value]
In file :1723:2: warning: .c:41:
./sv.h:1571op.c:9486:4: warning: expression result unused [-Wunused-value]
re_exec.cStorable.xs:4098:2: warning: null passed to a callee which requires a non-null argument [-Wnonnull]
5408:9: warning: expression result unused [-Wunused-value]
doio.c:581:11: warning: passing 'int *' to parameter of type 'socklen_t *' (aka 'unsigned int *') converts between pointers to integer types with different sign [-Wpointer-sign]
regexec.c:2558:8: warning: expression result unused [-Wunused-value]
pp_sys.c:1658:10: warning: passing 'int *' to parameter of type 'socklen_t *' (aka 'unsigned int *') converts between pointers to integer types with different sign [-Wpointer-sign]
pp_sys.c:2547:10: warning: passing 'int *' to parameter of type 'socklen_t *' (aka 'unsigned int *') converts between pointers to integer types with different sign [-Wpointer-sign]
pp_sys.c:2638:6: warning: passing 'int *' to parameter of type 'socklen_t *' (aka 'unsigned int *') converts between pointers to integer types with different sign [-Wpointer-sign]
pp_sys.c:2708:6: warning: passing 'int *' to parameter of type 'socklen_t *' (aka 'unsigned int *') converts between pointers to integer types with different sign [-Wpointer-sign]
pp_sys.c:2712:6: warning: passing 'int *' to parameter of type 'socklen_t *' (aka 'unsigned int *') converts between pointers to integer types with different sign [-Wpointer-sign]
/usr/include/sys/socket.h:134:26op.c:8320:6: warning: expression result unused [-Wunused-value]
re_exec.c:2558:8: warning: expression result unused [-Wunused-value]
./sv.h:1996:63:pp_sys.c:1658:10: warning: passing 'int *' to parameter of type 'socklen_t *' (aka 'unsigned int *') converts between pointers to integer types with different sign [-Wpointer-sign]
pp_ctl.cop.c:2768:5: warning: expression result unused [-Wunused-value]
#define SvGROW(sv,len) (SvLEN(sv) < (len) ? sv_grow(sv,len) : SvPVX(sv))op.c:9486:4: warning: expression result unused [-Wunused-value]
    SvUPGRADE(sv,SVt_IV);toke.c:7534:7: warning: expression result unused [-Wunused-value]
pp.c:op.c:8320:6: warning: expression result unused [-Wunused-value]
    SvUPGRADE(*ref, SVt_RV);Call.xs:174:57: warning: conversion specifies type 'int' but the argument has type 'STRLEN' (aka 'unsigned long') [-Wformat]
./sv.h:1571:30pp_sys.c:1287:6: warning: expression result unused [-Wunused-value]
pp_sys.c:2547:10: warning: #      define my_vsnprintf(buffer, len, ...) ({ int __len__ = vsnprintf(buffer, len, __VA_ARGS__); if ((len) > 0 && (Size_t)__len__ >= (len)) Perl_croak_nocontext("panic: vsnprintf buffer overflow"); __len__; })
pp_sys.c:pp_op.c:2768:5: warning: expression result unused [-Wunused-value]
perlregcomp.c:5934:5: warning: expression result unused [-Wunused-value]
./sv.h:1582:7: pp_ctl.c:4302:5: warning: expression result unused [-Wunused-value]
sv.c:7791:2: warning: expression result unused [-Wunused-value]pp.c:4404:8: warning: expression result unused [-Wunused-value]
pp.c:4661:4: warning: op.c:5297:2: warning: expression result unused [-Wunused-value]                        SvGROW(dest, min);
op.c#5281:5: warning: expression result unused [-Wunused-value]
#    def:769:5: warning: expression result unused [-Wunused-value]
./sv.h:1582:7: toke.c:2185:3: warning: expression result unused [-Wunused-value]
pp.c:4533:2: warning: perlio.c:5509:21: warning: comparison of integers of different signs: 'size_t' (aka 'unsigned long') and 'int' [-Wsign-compare]
op.c:pp.c:4270:2: warning: expression result unused [-Wunused-value]
-- 
Report by Test::Smoke v1.44 build 1285 running on perl 5.10.1
(Reporter v0.035 / Smoker v0.045)




nntp.perl.org: Perl Programming lists via nntp and http.
Comments to Ask Bjørn Hansen at ask@perl.org | Group listing | About