develooper Front page | perl.perl5.porters | Postings from September 2011

Smoke [blead] v5.15.3-61-g83083fe FAIL(F) MSWin32 Win2000 SP4 (x86/1 cpu)

From:
George Greer
Date:
September 26, 2011 14:57
Subject:
Smoke [blead] v5.15.3-61-g83083fe FAIL(F) MSWin32 Win2000 SP4 (x86/1 cpu)
Message ID:
201109262157.p8QLvLaM014714@m-l.org
Smoke logs available at http://m-l.org/~perl/smoke/perl/

Automated smoke report for 5.15.3 patch 83083feaedd84cf12545b4f5b0a7b037c12236ee v5.15.3-61-g83083fe
perl-win2k: Intel(R) Core(TM) i7 CPU 920 @ 2.67GHz(~2672 MHz) (x86/1 cpu)
    on        MSWin32 - Win2000 SP4
    using     cl version 14.00.50727.762
    smoketime 2 hours 29 minutes (average 37 minutes 30 seconds)

Summary: FAIL(F)

O = OK  F = Failure(s), extended report at the bottom
X = Failure(s) under TEST but not under harness
? = still running or test results not (yet) available
Build failures during:       - = unknown or N/A
c = Configure, m = make, M = make (after miniperl), t = make test-prep

v5.15.3-61-g83083fe  Configuration (common) none
----------- ---------------------------------------------------------
F F         
F F         -Duseithreads
| +--------- -DDEBUGGING
+----------- no debugging


Locally applied patches:
    uncommitted-changes
    SMOKE83083feaedd84cf12545b4f5b0a7b037c12236ee

Failures: (common-args) none
[default] 
[default] -DDEBUGGING
[default] -Duseithreads
[default] -DDEBUGGING -Duseithreads
../cpan/ExtUtils-MakeMaker/t/basic.t........................FAILED
    19, 62, 67, 72, 82
    Non-zero exit status: 2
    Bad plan.  You planned 171 tests but ran 84.
../cpan/ExtUtils-MakeMaker/t/oneliner.t.....................FAILED
    4, 7-11
    Non-zero exit status: 6

Passed Todo tests: (common-args) none
[default] 
[default] -DDEBUGGING
[default] -Duseithreads
[default] -DDEBUGGING -Duseithreads
../cpan/CGI/t/tmpdir.t......................................PASSED
    3-9

Compiler messages(MSWin32):
op.c(10316) : warning C4028: formal parameter 1 different from declaration
..\pp.c(5985) : warning C4244: 'function' : conversion from 'U32' to 'const char', possible loss of data
..\pp_hot.c(2669) : warning C4244: 'initializing' : conversion from 'I32' to 'U8', possible loss of data
..\pp_sort.c(1650) : warning C4244: 'initializing' : conversion from 'I32' to 'U8', possible loss of data
IO.xs(488) : warning C4101: 'ret' : unreferenced local variable
ListUtil.xs(297) : warning C4244: 'initializing' : conversion from 'I32' to 'U8', possible loss of data
ListUtil.xs(335) : warning C4244: 'initializing' : conversion from 'I32' to 'U8', possible loss of data
Base64.xs(394) : warning C4146: unary minus operator applied to unsigned type, result still unsigned
Base64.xs(396) : warning C4146: unary minus operator applied to unsigned type, result still unsigned
POSIX.xs(705) : warning C4101: 'charstring' : unreferenced local variable
POSIX.xs(1760) : warning C4244: 'initializing' : conversion from 'time_t' to 'const long', possible loss of data
Piece.xs(950) : warning C4101: 'ret' : unreferenced local variable
APItest.xs(2744) : warning C4244: 'initializing' : conversion from 'I32' to 'U8', possible loss of data
# NMAKE : fatal error U1077: 'D:\smoke\perl\blead\build\t\perl.exe' : return code '0xff'
op.c(10316) : warning C4028: formal parameter 2 different from declaration

-- 
Report by Test::Smoke v1.42 build 1267 running on perl 5.10.0
(Reporter v0.035 / Smoker v0.045)




nntp.perl.org: Perl Programming lists via nntp and http.
Comments to Ask Bjørn Hansen at ask@perl.org | Group listing | About