develooper Front page | perl.perl5.porters | Postings from September 2011

Smoke [blead] v5.15.3-43-g6692294 FAIL(XF) linux 2.6.38-11-generic [debian] (x86_64/8 cpu)

From:
George Greer
Date:
September 25, 2011 00:58
Subject:
Smoke [blead] v5.15.3-43-g6692294 FAIL(XF) linux 2.6.38-11-generic [debian] (x86_64/8 cpu)
Message ID:
201109250758.p8P7wGbk024017@m-l.org
Smoke logs available at http://m-l.org/~perl/smoke/perl/

Automated smoke report for 5.15.3 patch 6692294e17e0b71a5e4a776313e0c3ac739a3d06 v5.15.3-43-g6692294
zwei: Intel(R) Core(TM) i7 CPU 920 @ 2.67GHz (GenuineIntel 2668MHz) (x86_64/8 cpu)
    on        linux - 2.6.38-11-generic [debian]
    using     clang version 4.2.1 Compatible Clang Compiler
    smoketime 22 hours 8 minutes (average 1 hour 6 minutes)

Summary: FAIL(XF)

O = OK  F = Failure(s), extended report at the bottom
X = Failure(s) under TEST but not under harness
? = still running or test results not (yet) available
Build failures during:       - = unknown or N/A
c = Configure, m = make, M = make (after miniperl), t = make test-prep

v5.15.3-43-g6692294  Configuration (common) -A -Dcc=clang append:ccflags=" -fcatch-undefined-behavior "
----------- ---------------------------------------------------------
X X F X X X F X 
X X F X X X F X -Accflags=-DPERL_POISON
X X F X X X F X -Duse64bitall
X X F X X X F X -Dusemorebits
X X F X X X F X -Dmad
X X F X X X F X -Duseithreads
X X F X X X F X -Duseithreads -Accflags=-DPERL_POISON
X X F X X X F X -Duseithreads -Duse64bitall
X X F X X X F X -Duseithreads -Dusemorebits
X X F X X X F X -Duseithreads -Dmad
| | | | | +- LC_ALL = en_US.utf8 -DDEBUGGING
| | | | +--- PERLIO = perlio -DDEBUGGING
| | | +----- PERLIO = stdio  -DDEBUGGING
| | +------- LC_ALL = en_US.utf8
| +--------- PERLIO = perlio
+----------- PERLIO = stdio 

Locally applied patches:
    uncommitted-changes
    SMOKE6692294e17e0b71a5e4a776313e0c3ac739a3d06

Failures: (common-args) -A -Dcc=clang append:ccflags=" -fcatch-undefined-behavior "
[stdio/perlio/en_US.utf8] 
[stdio/en_US.utf8] -DDEBUGGING
[stdio/perlio/en_US.utf8] -Accflags=-DPERL_POISON
[stdio/perlio/en_US.utf8] -DDEBUGGING -Accflags=-DPERL_POISON
[stdio/en_US.utf8] -Duse64bitall
[stdio/perlio/en_US.utf8] -DDEBUGGING -Duse64bitall
[stdio/perlio/en_US.utf8] -Dusemorebits
[stdio/perlio/en_US.utf8] -DDEBUGGING -Dusemorebits
[stdio/perlio/en_US.utf8] -Dmad
[stdio/perlio/en_US.utf8] -DDEBUGGING -Dmad
Inconsistent test results (between TEST and harness):
    ../t/re/regexp_trielist.t............... ......................................... FAILED--unexpected output at test 1539
    ../t/re/regexp.t........................ .................................................. FAILED--unexpected output at test 1539
    ../t/re/regexp_qr_embed.t............... ......................................... FAILED--unexpected output at test 1539
    ../t/re/regexp_notrie.t................. ........................................... FAILED--unexpected output at test 1539
    ../t/re/regexp_noamp.t.................. ............................................ FAILED--unexpected output at test 1539
    ../t/re/regexp_qr.t..................... ............................................... FAILED--unexpected output at test 1539

[minitest] 
[minitest] -DDEBUGGING
[minitest] -Accflags=-DPERL_POISON
[minitest] -DDEBUGGING -Accflags=-DPERL_POISON
[minitest] -Duse64bitall
[minitest] -DDEBUGGING -Duse64bitall
[minitest] -Dusemorebits
[minitest] -DDEBUGGING -Dusemorebits
[minitest] -Dmad
[minitest] -DDEBUGGING -Dmad
[minitest] -Duseithreads
[minitest] -DDEBUGGING -Duseithreads
[minitest] -Duseithreads -Accflags=-DPERL_POISON
[minitest] -DDEBUGGING -Duseithreads -Accflags=-DPERL_POISON
[minitest] -Duseithreads -Duse64bitall
[minitest] -DDEBUGGING -Duseithreads -Duse64bitall
[minitest] -Duseithreads -Dusemorebits
[minitest] -DDEBUGGING -Duseithreads -Dusemorebits
[minitest] -Duseithreads -Dmad
[minitest] -DDEBUGGING -Duseithreads -Dmad
    t/re/regexp .................... FAILED--unexpected output at test 1539
    t/re/regexp_noamp .............. FAILED--unexpected output at test 1539
    t/re/regexp_notrie ............. FAILED--unexpected output at test 1539
    t/re/regexp_qr ................. FAILED--unexpected output at test 1539
    t/re/regexp_qr_embed ........... FAILED--unexpected output at test 1539
    t/re/regexp_trielist ........... FAILED--unexpected output at test 1539

[perlio] -DDEBUGGING
Inconsistent test results (between TEST and harness):
    ../t/re/regexp_trielist.t............... ......................................... FAILED--unexpected output at test 1539
    ../t/re/regexp.t........................ .................................................. FAILED--unexpected output at test 1539
    ../t/re/regexp_qr_embed.t............... ......................................... FAILED--unexpected output at test 1539
    ../t/re/regexp_notrie.t................. ........................................... FAILED--unexpected output at test 1539
    ../lib/Benchmark.t...................... ................................................ FAILED at test 15
    ../t/re/regexp_noamp.t.................. ............................................ FAILED--unexpected output at test 1539
    ../t/re/regexp_qr.t..................... ............................................... FAILED--unexpected output at test 1539

[perlio] -Duse64bitall
Inconsistent test results (between TEST and harness):
    ../t/re/regexp_trielist.t............... ......................................... FAILED--unexpected output at test 1539
    ../t/re/regexp.t........................ .................................................. FAILED--unexpected output at test 1539
    ../t/re/regexp_qr_embed.t............... ......................................... FAILED--unexpected output at test 1539
    ../t/comp/require.t..................... ............................................... FAILED at test 46
    ../t/re/regexp_notrie.t................. ........................................... FAILED--unexpected output at test 1539
    ../t/re/regexp_noamp.t.................. ............................................ FAILED--unexpected output at test 1539
    ../t/re/regexp_qr.t..................... ............................................... FAILED--unexpected output at test 1539

[stdio/perlio/en_US.utf8] -Duseithreads
[stdio/perlio/en_US.utf8] -DDEBUGGING -Duseithreads
[stdio/perlio/en_US.utf8] -Duseithreads -Accflags=-DPERL_POISON
[stdio/perlio/en_US.utf8] -DDEBUGGING -Duseithreads -Accflags=-DPERL_POISON
[stdio/perlio/en_US.utf8] -Duseithreads -Duse64bitall
[stdio/en_US.utf8] -DDEBUGGING -Duseithreads -Duse64bitall
[stdio/perlio/en_US.utf8] -Duseithreads -Dusemorebits
[stdio/en_US.utf8] -DDEBUGGING -Duseithreads -Dusemorebits
[stdio/perlio/en_US.utf8] -Duseithreads -Dmad
[stdio] -DDEBUGGING -Duseithreads -Dmad
Inconsistent test results (between TEST and harness):
    ../t/re/regexp_trielist.t............... ......................................... FAILED--unexpected output at test 1539
    ../t/re/regexp.t........................ .................................................. FAILED--unexpected output at test 1539
    ../t/re/regexp_qr_embed.t............... ......................................... FAILED--unexpected output at test 1539
    ../t/re/regexp_notrie.t................. ........................................... FAILED--unexpected output at test 1539
    ../t/re/regexp_noamp.t.................. ............................................ FAILED--unexpected output at test 1539
    ../t/re/regexp_qr.t..................... ............................................... FAILED--unexpected output at test 1539
    ../t/re/regexp_qr_embed_thr.t........... ..................................... FAILED--unexpected output at test 1539

[perlio] -DDEBUGGING -Duseithreads -Duse64bitall
[perlio] -DDEBUGGING -Duseithreads -Dusemorebits
[perlio/en_US.utf8] -DDEBUGGING -Duseithreads -Dmad
Inconsistent test results (between TEST and harness):
    ../t/re/regexp_trielist.t............... ......................................... FAILED--unexpected output at test 1539
    ../t/re/regexp.t........................ .................................................. FAILED--unexpected output at test 1539
    ../t/re/regexp_qr_embed.t............... ......................................... FAILED--unexpected output at test 1539
    ../t/comp/require.t..................... ............................................... FAILED at test 46
    ../t/re/regexp_notrie.t................. ........................................... FAILED--unexpected output at test 1539
    ../t/re/regexp_noamp.t.................. ............................................ FAILED--unexpected output at test 1539
    ../t/re/regexp_qr.t..................... ............................................... FAILED--unexpected output at test 1539
    ../t/re/regexp_qr_embed_thr.t........... ..................................... FAILED--unexpected output at test 1539

Compiler messages(gcc):
try.c:5737:17: warning: extra tokens at end of #ifdef directive [-Wextra-tokens]
try.c:5740:18: warning: extra tokens at end of #ifdef directive [-Wextra-tokens]
try.c:5743:19: warning: extra tokens at end of #ifdef directive [-Wextra-tokens]
try.c:5746:19: warning: extra tokens at end of #ifdef directive [-Wextra-tokens]
try.c:5773:17: warning: extra tokens at end of #ifdef directive [-Wextra-tokens]
try.c:5776:18: warning: extra tokens at end of #ifdef directive [-Wextra-tokens]
try.c:5779:19: warning: extra tokens at end of #ifdef directive [-Wextra-tokens]
try.c:5782:19: warning: extra tokens at end of #ifdef directive [-Wextra-tokens]
try.c:5809:17: warning: extra tokens at end of #ifdef directive [-Wextra-tokens]
try.c:5812:18: warning: extra tokens at end of #ifdef directive [-Wextra-tokens]
try.c:5815:19: warning: extra tokens at end of #ifdef directive [-Wextra-tokens]
try.c:5818:19: warning: extra tokens at end of #ifdef directive [-Wextra-tokens]
try.c:5845:16: warning: extra tokens at end of #ifdef directive [-Wextra-tokens]
try.c:5848:17: warning: extra tokens at end of #ifdef directive [-Wextra-tokens]
try.c:5851:18: warning: extra tokens at end of #ifdef directive [-Wextra-tokens]
try.c:5854:18: warning: extra tokens at end of #ifdef directive [-Wextra-tokens]
try.c:5881:18: warning: extra tokens at end of #ifdef directive [-Wextra-tokens]
try.c:5884:19: warning: extra tokens at end of #ifdef directive [-Wextra-tokens]
try.c:5887:20: warning: extra tokens at end of #ifdef directive [-Wextra-tokens]
try.c:5890:20: warning: extra tokens at end of #ifdef directive [-Wextra-tokens]
try.c:6721:18: warning: extra tokens at end of #ifdef directive [-Wextra-tokens]
try.c:6724:19: warning: extra tokens at end of #ifdef directive [-Wextra-tokens]
try.c:6727:20: warning: extra tokens at end of #ifdef directive [-Wextra-tokens]
try.c:6730:20: warning: extra tokens at end of #ifdef directive [-Wextra-tokens]
try.c:6757:18: warning: extra tokens at end of #ifdef directive [-Wextra-tokens]
try.c:6760:19: warning: extra tokens at end of #ifdef directive [-Wextra-tokens]
try.c:6763:20: warning: extra tokens at end of #ifdef directive [-Wextra-tokens]
try.c:6766:20: warning: extra tokens at end of #ifdef directive [-Wextra-tokens]
try.c:6793:18: warning: extra tokens at end of #ifdef directive [-Wextra-tokens]
try.c:6796:19: warning: extra tokens at end of #ifdef directive [-Wextra-tokens]
try.c:6799:20: warning: extra tokens at end of #ifdef directive [-Wextra-tokens]
try.c:6802:20: warning: extra tokens at end of #ifdef directive [-Wextra-tokens]
try.c:6829:17: warning: extra tokens at end of #ifdef directive [-Wextra-tokens]
try.c:6832:18: warning: extra tokens at end of #ifdef directive [-Wextra-tokens]
try.c:6835:19: warning: extra tokens at end of #ifdef directive [-Wextra-tokens]
try.c:6838:19: warning: extra tokens at end of #ifdef directive [-Wextra-tokens]
try.c:6865:19: warning: extra tokens at end of #ifdef directive [-Wextra-tokens]
try.c:6868:20: warning: extra tokens at end of #ifdef directive [-Wextra-tokens]
try.c:6871:21: warning: extra tokens at end of #ifdef directive [-Wextra-tokens]
try.c:6874:21: warning: extra tokens at end of #ifdef directive [-Wextra-tokens]
util.c:571:5: warning: expression result unused [-Wunused-value]
perl.c:356:6: warning: expression result unused [-Wunused-value]
perl.c:249:5: warning: expression result unused [-Wunused-value]
perl.c:250:5: warning: expression result unused [-Wunused-value]
perl.c:257:5: warning: expression result unused [-Wunused-value]
perl.c:258:5: warning: expression result unused [-Wunused-value]
util.c:2713:5: warning: expression result unused [-Wunused-value]
util.c:2873:5: warning: expression result unused [-Wunused-value]
perl.c:1759:5: warning: expression result unused [-Wunused-value]
perl.c:3005:8: warning: expression result unused [-Wunused-value]
pp_ctl.c:287:2: warning: expression result unused [-Wunused-value]
mro.c:588:21: warning: expression result unused [-Wunused-value]
mro.c:633:2: warning: expression result unused [-Wunused-value]
pp_ctl.c:409:2: warning: expression result unused [-Wunused-value]
pp_ctl.c:421:8: warning: expression result unused [-Wunused-value]
pp_ctl.c:906:7: warning: expression result unused [-Wunused-value]
pp_ctl.c:980:3: warning: expression result unused [-Wunused-value]
pp_ctl.c:583:5: warning: expression result unused [-Wunused-value]
regcomp.c:3639:5: warning: expression result unused [-Wunused-value]
pp.c:1745:3: warning: expression result unused [-Wunused-value]
pp.c:1735:2: warning: expression result unused [-Wunused-value]
pp_ctl.c:1338:6: warning: expression result unused [-Wunused-value]
op.c:3082:5: warning: expression result unused [-Wunused-value]
pp_pack.c:2409:5: warning: expression result unused [-Wunused-value]
pp_ctl.c:2238:3: warning: expression result unused [-Wunused-value]
pp_ctl.c:2253:6: warning: expression result unused [-Wunused-value]
op.c:4257:6: warning: expression result unused [-Wunused-value]
regcomp.c:6035:5: warning: expression result unused [-Wunused-value]
op.c:5080:6: warning: expression result unused [-Wunused-value]
op.c:5460:5: warning: expression result unused [-Wunused-value]
op.c:5534:5: warning: expression result unused [-Wunused-value]
op.c:5615:2: warning: expression result unused [-Wunused-value]
op.c:5593:5: warning: expression result unused [-Wunused-value]
op.c:6098:5: warning: expression result unused [-Wunused-value]
pp.c:3075:7: warning: expression result unused [-Wunused-value]
pp.c:3080:7: warning: expression result unused [-Wunused-value]
doop.c:696:3: warning: expression result unused [-Wunused-value]
doop.c:701:2: warning: expression result unused [-Wunused-value]
doop.c:691:5: warning: expression result unused [-Wunused-value]
pp_hot.c:144:3: warning: expression result unused [-Wunused-value]
op.c:7770:7: warning: expression result unused [-Wunused-value]
op.c:7877:5: warning: expression result unused [-Wunused-value]
regexec.c:4174:19: warning: expression result unused [-Wunused-value]
pp.c:3338:2: warning: expression result unused [-Wunused-value]
pp.c:3360:6: warning: expression result unused [-Wunused-value]
pp.c:3335:5: warning: expression result unused [-Wunused-value]
pp.c:3348:5: warning: expression result unused [-Wunused-value]
pp.c:3697:2: warning: expression result unused [-Wunused-value]
op.c:8605:6: warning: expression result unused [-Wunused-value]
doop.c:1024:2: warning: expression result unused [-Wunused-value]
perlio.c:5483:21: warning: comparison of integers of different signs: 'size_t' (aka 'unsigned long') and 'int' [-Wsign-compare]
pp.c:3835:2: warning: expression result unused [-Wunused-value]
pp.c:3911:4: warning: expression result unused [-Wunused-value]
pp.c:3962:8: warning: expression result unused [-Wunused-value]
sv.c:502:5: warning: expression result unused [-Wunused-value]
In file included from regexec.c:5438:9: warning: expression result unused [-Wunused-value]
sv.c:544:5: warning: expression result unused [-Wunused-value]
pp.c:4091:2: warning: expression result unused [-Wunused-value]
pp.c:4210:4: warning: expression result unused [-Wunused-value]
pp_sys.c:434:25doio.c:634:17: warning: expression result unused [-Wunused-value]
doio.c:638:17: warning: expression result unused [-Wunused-value]
sv.c:898:39: warning: comparison of 0 <= unsigned expression is always true [-Wsign-compare]
sv.c:919:17: warning: comparison of 0 <= unsigned expression is always true [-Wsign-compare]
sv.c:925:7: warning: comparison of 0 <= unsigned expression is always true [-Wsign-compare]
sv.c:929:17: warning: comparison of 0 <= unsigned expression is always true [-Wsign-compare]
pp_sys.c:471:25: warning: expression result unused [-Wunused-value]
op.c:9844:4: warning: expression result unused [-Wunused-value]
sv.c:932:17: warning: comparison of 0 <= unsigned expression is always true [-Wsign-compare]
sv.c:938:7: warning: comparison of 0 <= unsigned expression is always true [-Wsign-compare]
sv.c:944:7: warning: comparison of 0 <= unsigned expression is always true [-Wsign-compare]
sv.c:950:7: warning: comparison of 0 <= unsigned expression is always true [-Wsign-compare]
pp.c:4271:2: warning: expression result unused [-Wunused-value]
pp.c:4272:2: warning: expression result unused [-Wunused-value]
pp_hot.c:1203:5: warning: expression result unused [-Wunused-value]
pp_sys.c:1076:6: warning: expression result unused [-Wunused-value]
regcomp.c:11723:11: warning: expression result unused [-Wunused-value]
pp_ctl.c:4408:5: warning: expression result unused [-Wunused-value]
sv.c:2757:3: warning: expression result unused [-Wunused-value]
pp_hot.c:1618:3: warning: expression result unused [-Wunused-value]
pp_hot.c:1623:6: warning: expression result unused [-Wunused-value]
pp_hot.c:1636:3: warning: expression result unused [-Wunused-value]
pp_hot.c:1625:2: warning: expression result unused [-Wunused-value]
pp_sys.c:1285:6: warning: expression result unused [-Wunused-value]
toke.c:2191:3: warning: expression result unused [-Wunused-value]
sv.c:3212:14: warning: expression result unused [-Wunused-value]
sv.c:3221:13: warning: expression result unused [-Wunused-value]
sv.c:3231:13: warning: expression result unused [-Wunused-value]
sv.c:3236:13: warning: expression result unused [-Wunused-value]
pp_sys.c:1721:2: warning: expression result unused [-Wunused-value]
toke.c:2717:3: warning: expression result unused [-Wunused-value]
doio.c:2064:6: warning: expression result unused [-Wunused-value]
pp_ctl.c:5394:5: warning: expression result unused [-Wunused-value]
doio.c:2170:5: warning: expression result unused [-Wunused-value]
sv.c:3659:6: warning: expression result unused [-Wunused-value]
doio.c:2278:2: warning: expression result unused [-Wunused-value]
toke.c:3842:5: warning: expression result unused [-Wunused-value]
toke.c:3916:6: warning: expression result unused [-Wunused-value]
pp_hot.c:2326:6: warning: expression result unused [-Wunused-value]
sv.c:4092:6: warning: expression result unused [-Wunused-value]
sv.c:4094:6: warning: expression result unused [-Wunused-value]
sv.c:4108:13: warning: expression result unused [-Wunused-value]
sv.c:4265:13: warning: expression result unused [-Wunused-value]
sv.c:4505:5: warning: expression result unused [-Wunused-value]
sv.c:4555:5: warning: expression result unused [-Wunused-value]
sv.c:4557:5: warning: expression result unused [-Wunused-value]
sv.c:4610:5: warning: expression result unused [-Wunused-value]
sv.c:4776:6: warning: expression result unused [-Wunused-value]
sv.c:4879:6: warning: expression result unused [-Wunused-value]
sv.c:4948:5: warning: expression result unused [-Wunused-value]
sv.c:5043:5: warning: expression result unused [-Wunused-value]
sv.c:5113:2: warning: expression result unused [-Wunused-value]
sv.c:5145:5: warning: expression result unused [-Wunused-value]
sv.c:5697:2: warning: expression result unused [-Wunused-value]
sv.c:5694:5: warning: expression result unused [-Wunused-value]
sv.c:7635:6: warning: expression result unused [-Wunused-value]
sv.c:7673:6: warning: expression result unused [-Wunused-value]
sv.c:7709:2: warning: expression result unused [-Wunused-value]
sv.c:7509:5: warning: expression result unused [-Wunused-value]
toke.c:7520:7: warning: expression result unused [-Wunused-value]
sv.c:7985:5: warning: expression result unused [-Wunused-value]
sv.c:8991:6: warning: expression result unused [-Wunused-value]
sv.c:8992:6: warning: expression result unused [-Wunused-value]
sv.c:9361:5: warning: expression result unused [-Wunused-value]
sv.c:10927:6: warning: expression result unused [-Wunused-value]
sv.c:10965:2: warning: expression result unused [-Wunused-value]
sv.c:13540:6: warning: expression result unused [-Wunused-value]
toke.c:9321:5: warning: expression result unused [-Wunused-value]
toke.c:9817:2: warning: expression result unused [-Wunused-value]
toke.c:9731:5: warning: expression result unused [-Wunused-value]
toke.c:10840:2: warning: expression result unused [-Wunused-value]
./const-c.inc:47:2: warning: expression result unused [-Wunused-value]
./const-c.inc:81:5: warning: expression result unused [-Wunused-value]
Util.xs:55:9: warning: expression result unused [-Wunused-value]
Bzip2.xs:326:5: warning: expression result unused [-Wunused-value]
Opcode.xs:268:9: warning: expression result unused [-Wunused-value]
Dumper.xs:243:2: warning: expression result unused [-Wunused-value]
Dumper.xs:650:4: warning: expression result unused [-Wunused-value]
Call.xs:62:58: warning: conversion specifies type 'int' but the argument has type 'STRLEN' (aka 'unsigned long') [-Wformat]
Call.xs:62:78: warning: conversion specifies type 'int' but the argument has type 'STRLEN' (aka 'unsigned long') [-Wformat]
Call.xs:99:53: warning: conversion specifies type 'int' but the argument has type 'STRLEN' (aka 'unsigned long') [-Wformat]
Call.xs:155:46: warning: conversion specifies type 'int' but the argument has type 'STRLEN' (aka 'unsigned long') [-Wformat]
Call.xs:174:57: warning: conversion specifies type 'int' but the argument has type 'STRLEN' (aka 'unsigned long') [-Wformat]
./const-c.inc:38:2: warning: expression result unused [-Wunused-value]
./const-c.inc:73:5: warning: expression result unused [-Wunused-value]
Base64.xs:421:8: warning: expression result unused [-Wunused-value]
scalar.xs:48:5: warning: expression result unused [-Wunused-value]
Zlib.xs:593:5: warning: expression result unused [-Wunused-value]
Storable.xs:1793:3: warning: expression result unused [-Wunused-value]
mro.xs:120:7: warning: expression result unused [-Wunused-value]
Typemap.xs:88:3: warning: expression result unused [-Wunused-value]
Socket.xs:223:2: warning: expression result unused [-Wunused-value]
SysV.xs:364:5: warning: expression result unused [-Wunused-value]
re_comp.c:3639:5: warning: expression result unused [-Wunused-value]
re_exec.c:4174:19: warning: expression result unused [-Wunused-value]
re_exec.c:5438:9: warning: expression result unused [-Wunused-value]
Storable.xs:4035:2: warning: null passed to a callee which requires a non-null argument [-Wnonnull]
Storable.xs:4468:2: warning: expression result unused [-Wunused-value]
Storable.xs:4771:3: warning: expression result unused [-Wunused-value]
Storable.xs:5353:3: warning: expression result unused [-Wunused-value]
Storable.xs:5400:2: warning: expression result unused [-Wunused-value]
Storable.xs:5440:2: warning: null passed to a callee which requires a non-null argument [-Wnonnull]
Storable.xs:5503:2: warning: null passed to a callee which requires a non-null argument [-Wnonnull]
Storable.xs:5814:4: warning: expression result unused [-Wunused-value]
Storable.xs:5855:3: warning: expression result unused [-Wunused-value]
Storable.xs:6014:5: warning: expression result unused [-Wunused-value]
re_comp.c:6035:5: warning: expression result unused [-Wunused-value]
./const-c.inc:72:5: warning: expression result unused [-Wunused-value]
POSIX.xs:1563:2: warning: expression result unused [-Wunused-value]
POSIX.xs:1682:15: warning: expression result unused [-Wunused-value]
APItest.xs:1440:2: warning: expression result unused [-Wunused-value]
APItest.xs:1468:9: warning: expression result unused [-Wunused-value]
APItest.xs:1925:2: warning: expression result unused [-Wunused-value]
FastCalc.xs:337:5: warning: expression result unused [-Wunused-value]
FastCalc.xs:377:5: warning: expression result unused [-Wunused-value]
FastCalc.xs:378:5: warning: expression result unused [-Wunused-value]
Collate.xs:605:2: warning: expression result unused [-Wunused-value]
Collate.xs:595:2: warning: expression result unused [-Wunused-value]
Unicode.xs:176:6: warning: expression result unused [-Wunused-value]
Unicode.xs:334:6: warning: expression result unused [-Wunused-value]
Unicode.xs:326:5: warning: expression result unused [-Wunused-value]
ExtTest.xs:44:2: warning: expression result unused [-Wunused-value]
ExtTest.xs:78:5: warning: expression result unused [-Wunused-value]
pp_ctl.c:1190:5: warning: result of comparison against a string literal is unspecified (use strncmp instead)
pp_ctl.c:1196:2: warning: result of comparison against a string literal is unspecified (use strncmp instead)
pp_ctl.c:2146:5: warning: result of comparison against a string literal is unspecified (use strncmp instead)
pp_sys.c:323:6: warning: result of comparison against a string literal is unspecified (use strncmp instead)
pp_hot.c:173:3: warning: result of comparison against a string literal is unspecified (use strncmp instead)
pp_ctl.c:2310:5: warning: doio.c:634:17: warning: expression result unused [-Wunused-value]
pp_sys.c:403:5: warning: result of comparison against a string literal is unspecified (use strncmp instead)
pp_ctl.c:2311:5: warning: result of comparison against a string literal is unspecified (use strncmp instead)
pp_sys.c:434:25: warning: expression result unused [-Wunused-value]
op.c:4257:6: warning: expression result unused [-Wunused-value]pp_sys.c:471:25: warning: expression result unused [-Wunused-value]
pp_sys.c:562:5: warning: result of comparison against a string literal is unspecified (use strncmp instead)
pp_ctl.c:3364:5: warning: result of comparison against a string literal is unspecified (use strncmp instead)
pp_ctl.c:3552:6: warning: result of comparison against a string literal is unspecified (use strncmp instead)
op.cpp_sys.c:917:5: warning: result of comparison against a string literal is unspecified (use strncmp instead)
pp_sys.c:946:9: warning: result of comparison against a string literal is unspecified (use strncmp instead)
pp_ctl.c:4276:2: warning: result of comparison against a string literal is unspecified (use strncmp instead)
pp_ctl.c:4299:5: warning: result of comparison against a string literal is unspecified (use strncmp instead)
pp_ctl.c:4356:5: warning: result of comparison against a string literal is unspecified (use strncmp instead)
pp_ctl.c:4395:5: warning: result of comparison against a string literal is unspecified (use strncmp instead)
pp_ctl.c:4441:5: warning: result of comparison against a string literal is unspecified (use strncmp instead)
pp_ctl.c:4541:3: warning: result of comparison against a string literal is unspecified (use strncmp instead)
pp_ctl.c:4573:3: warning: result of comparison against a string literal is unspecified (use strncmp instead)
pp_ctl.c:4595:6: warning: result of comparison against a string literal is unspecified (use strncmp instead)
pp_ctl.c:4971:5: warning: result of comparison against a string literal is unspecified (use strncmp instead)
pp_ctl.c:5017:5: warning: result of comparison against a string literal is unspecified (use strncmp instead)
op.c:4650:6: warning: result of comparison against a string literal is unspecified (use strncmp instead)
pp_ctl.c:5431:2: warning: result of comparison against a string literal is unspecified (use strncmp instead)
pp_hot.c:2430:5: warning: result of comparison against a string literal is unspecified (use strncmp instead)
pp_hot.c:2437:2: warning: result of comparison against a string literal is unspecified (use strncmp instead)
pp.c:5182:2: warning: result of comparison against a string literal is unspecified (use strncmp instead)
pp.c:5232:2: warning: result of comparison against a string literal is unspecified (use strncmp instead)
pp.c:5792:6: warning: result of comparison against a string literal is unspecified (use strncmp instead)
APItest.xs:2676:9: warning: expression result unused [-Wunused-value]
doio.c:634:17: warning: expression result unused [-Wunused-value]
regexec.c:5438:9: warning: expression result unused [-Wunused-value]
In f:3082:5: warning: pp.c:28:
In file included from Opcode.xs:268:9: warning: expression result unused [-Wunused-value]
APItest.xs:112:5: warning: expression result unused [-Wunused-value]
pp_sys.c:917:5: warning: result of comparison against a string literal is unspecified (use strncmp instead)
pp_ctl.c:2310:5: warning: result of comparison against a string literal is unspecified (use strncmp instead)
pp_ctl.c:3897:7: warning: result of comparison against a string literal is unspecified (use strncmp instead)
./sv.h:1074:3: doop.c:691:5: warning: expression result unused [-Wunused-value]
In file included from ./perl.hsv.c:7635:6: warning: expression result unused [-Wunused-value]
:2278:2: warning: expression result unused [-Wunused-value]
../../sv.h:295:47: In file included from Glore_comp.c:6035:5: warning: expression result unused [-Wunused-value]
perlio.cpp_hot.c:1618:3: warning: expression result unused [-Wunused-value]
In file included from pp_ctl.c:35doop.c:696:3: warning: expression result unused [-Wunused-value]
                                 ^            ~~~~~~~~~~~~~~~~~~~~~~~util.c:2713:5: warning: expression result unused [-Wunused-value]
./const-c.inc:47:2: warning: expremysterious name [PL_parser-E<gt>bufend] in parts/apidoc.fnc, line 347
~~~~~~~~~~~~~~~~~~~~~~~~~~~~~~~~~~~~~~Base64.xs:421:8: warning: expression result unused [-Wunused-value]
sv.c:898:39: warning: comparis:403:5: warning: result of comparison against a string literal is unspecified (use strncmp instead)      SVt_NV, FALSE, HADNV, HASARENA, FIT_ARENA(0, sizeof(NV)) },
In file included from ./perl.hs345:91.:17: warning: :cnote: instantiated from:
op.cdoio.c:2278:2: warning: expression result unused [-Wunused-value]
op.c:4650:6: pp_ctl.c:4276:2: warning: result of comparison against a string literal is unspecified (use strncmp instead)
toke.c:    :2: warning: expression result unuspp.c:28:
doio.c:581:11: warning: passing 'int *' to parameter of type 'socklen_t *' (aka 'unsigned int *') converts between pointers to integer types with different sign [-Wpointer-sign]
regexec.c:2580:8: warning: expression result unused [-Wunused-value]
In file included from ./perl.hsv.c:4948:5: warning: expression result unused [-Wunused-value]
pp_sys.c:1656:10: warning: passing 'int *' to parameter of type 'socklen_t *' (aka 'unsigned int *') converts between pointers to integer types with different sign [-Wpointer-sign]
pp_sys.c:2533:10: warning: passing 'int *' to parameter of type 'socklen_t *' (aka 'unsigned int *') converts between pointers to integer types with different sign [-Wpointer-sign]
pp_sys.c:2624:6: warning: passing 'int *' to parameter of type 'socklen_t *' (aka 'unsigned int *') converts between pointers to integer types with different sign [-Wpointer-sign]
pp_sys.c:2694:6: warning: passing 'int *' to parameter of type 'socklen_t *' (aka 'unsigned int *') converts between pointers to integer types with different sign [-Wpointer-sign]
pp_sys.c:2698:6: warning: passing 'int *' to parameter of type 'socklen_t *' (aka 'unsigned int *') converts between pointers to integer types with different sign [-Wpointer-sign]
re_exec.c:2580:8: warning: expression result unused [-Wunused-value]
perlio.c:5483:21dowarn:701:2: warning: expression result unused [-Wunused-value]
./op.h:654:42: pp_sys.c#403:5: warning: result of comparison against a string literal is unspecified (use strncmp instead)
util.c:toke.c:3842:5: warning: expression result unused [-Wunused-value]
571:5: warning: expression result unused [-Wunused-value]
./sv.h:233:2:sv.c:4092:6: warning: expression result unused [-Wunused-value]
            ^~~~~~~~~~~~~~~~~~~~~dIn fi:2278:2: warning: expression result unused [-Wunused-value]
sv.c:869pp_ctl.c:287:2: warning: expression result unused [-Wunused-value]
Call.xsDumper.xs:243:2: warning: expression result unused [-Wunused-value]
:62:78: warning: conversion specifies type 'int' but the argument has type 'STRLEN' (aka 'unsigned long') [-Wformat]
pp_sys.cdoio.c:2064:6: warning: expression result unused [-Wunused-value]
./sv.h:1567:7: pp_sys.c:471:25: warning:    ? SvPVX(sv) : sv_pvn_force_flags(sv, 0, flags))
pp_sys.c:1656:10: warning: pp_ctl.c:4408:5: warning: expression result unused [-Wunused-value]
Dumper.xs:243:2: warning: expression scalar.xs:48:5: warning: expression result unused [-Wunused-value]
       Base64.xs:421:8: warning: expression result unused [-Wunused-value]
In file inSCollate.xs:605:2: warning: expression result unused [-Wunused-value]
POSIX.xs:1563:2: warning: expression result unused 
./sv.h:1152util.c:2713:5: warning: expression result unused [-Wunused-value]
./sv.h:1981:63:op.c:4257:6: warning: expression result unused [-Wunused-value]
util.cperl.c:1759:5: warning: expression result unused [-Wunused-value]
./sv.h:1136:35:pp_ctl.c:4408:5: warning: expression result unused [-Wunused-value]
sv.c:pp.c:5792:6: warning: result of comparison against a string literal is unspecified (use strncmp instead)
#    define SvPVX(sv) ((sv)->sv_u.svu_pv)o   :8605:6: warning: expression result unused [-Wunused-value]
In file included from ./perl.h:3440op.c:7770:7: warning: expression result unused [-Wunused-value]
pp.c:5792sv.c:4610:5: warning: expression result unused [-Wunused-value]
                        == (char*)name)                                 \sv.c:4879:6: warning: expression result unused [-Wunused-value]
sv.c:toke.c:9321:5: warning: expression result unused [-Wunused-value]
Dumper.xs:650:4: warning: expression result unused [-Wunused-value]In file included from Langinfo.xs:12:
-- 
Report by Test::Smoke v1.44 build 1285 running on perl 5.10.1
(Reporter v0.035 / Smoker v0.045)




nntp.perl.org: Perl Programming lists via nntp and http.
Comments to Ask Bjørn Hansen at ask@perl.org | Group listing | About