develooper Front page | perl.perl5.porters | Postings from September 2011

Smoke [5.15.3] v5.15.3-45-g73c02f1 FAIL(FM) openvms V8.4 (IA64/2 cpu)

From:
Craig A. Berry
Date:
September 24, 2011 23:07
Subject:
Smoke [5.15.3] v5.15.3-45-g73c02f1 FAIL(FM) openvms V8.4 (IA64/2 cpu)
Message ID:
0LS20083XEC9SO90@asmtp012.mac.com
Automated smoke report for 5.15.3 patch 73c02f1564c743dc981bd8ea1ce2b967131cbd83 v5.15.3-45-g73c02f1
ALMA: HP rx2600  (1.50GHz/6.0MB) (IA64/2 cpu)
    on        openvms - V8.4
    using     ? CC/DECC version 70390020
    smoketime 2 hours 15 minutes (average 1 hour 7 minutes)

Summary: FAIL(FM)

O = OK  F = Failure(s), extended report at the bottom
X = Failure(s) under TEST but not under harness
? = still running or test results not (yet) available
Build failures during:       - = unknown or N/A
c = Configure, m = make, M = make (after miniperl), t = make test-prep

v5.15.3-45-g73c02f1  Configuration (common) none
----------- ---------------------------------------------------------
F -         
M -         -Dusethreads
| +--------- -DDEBUGGING
+----------- no debugging


Locally applied patches:
    uncommitted-changes
    SMOKE73c02f1564c743dc981bd8ea1ce2b967131cbd83

Failures: (common-args) none
[default] 
    cpan/Archive-Extract/t/01_Archive-Extract ..................... FAILED at test 193
    cpan/CGI/t/url ................................................ FAILED--no leader found
    cpan/Module-Build/t/PL_files .................................. FAILED at test 3
    cpan/Module-Build/t/properties/dist_suffix .................... FAILED at test 2
    cpan/Module-Build/t/runthrough ................................ FAILED at test 11
    cpan/Module-Build/t/tilde ..................................... FAILED at test 16
    cpan/Pod-Simple/t/search12 .................................... FAILED at test 7
    cpan/Time-HiRes/t/alarm ....................................... FAILED at test 9
    cpan/Time-HiRes/t/ualarm ...................................... FAILED at test 8
    dist/Carp/t/Carp .............................................. FAILED--expected 58 tests, saw 34
    t/porting/podcheck ............................................ FAILED at test 1

Compiler messages(VMS):

		if (invariant_head <= 0) {
....................^
%CC-I-QUESTCOMPARE, In this statement, the unsigned expression "invariant_head" is being compared with a relational operator to a constant whose value is not greater than zero.  This might not be what you intended.
at line number 3355 in file MDA0:[SMOKE.blead]sv.c;1

-- 
Report by Test::Smoke v1.39 build 1235 running on perl 5.12.3
(Reporter v0.035 / Smoker v0.044)



nntp.perl.org: Perl Programming lists via nntp and http.
Comments to Ask Bjørn Hansen at ask@perl.org | Group listing | About