develooper Front page | perl.perl5.porters | Postings from September 2011

Smoke [blead] v5.15.3-43-g6692294 FAIL(XF) linux 2.6.38-11-generic [debian] (x86_64/8 cpu)

From:
George Greer
Date:
September 24, 2011 20:13
Subject:
Smoke [blead] v5.15.3-43-g6692294 FAIL(XF) linux 2.6.38-11-generic [debian] (x86_64/8 cpu)
Message ID:
201109250313.p8P3DXuT001299@m-l.org
Smoke logs available at http://m-l.org/~perl/smoke/perl/

Automated smoke report for 5.15.3 patch 6692294e17e0b71a5e4a776313e0c3ac739a3d06 v5.15.3-43-g6692294
zwei: Intel(R) Core(TM) i7 CPU 920 @ 2.67GHz (GenuineIntel 1600MHz) (x86_64/8 cpu)
    on        linux - 2.6.38-11-generic [debian]
    using     g++ version 4.5.2
    smoketime 18 hours 47 minutes (average 56 minutes 23 seconds)

Summary: FAIL(XF)

O = OK  F = Failure(s), extended report at the bottom
X = Failure(s) under TEST but not under harness
? = still running or test results not (yet) available
Build failures during:       - = unknown or N/A
c = Configure, m = make, M = make (after miniperl), t = make test-prep

v5.15.3-43-g6692294  Configuration (common) -Dcc=g++ -O
----------- ---------------------------------------------------------
X X F X X X F X -Uusenm
X X F X X X F X -Uusenm -Accflags=-DPERL_POISON
X X F X X X F X -Uusenm -Duse64bitall
X X F X X X F X -Uusenm -Dusemorebits
X X F X X X F X -Uusenm -Dmad
X X F X X X F X -Uusenm -Duseithreads
X X F X X X F X -Uusenm -Duseithreads -Accflags=-DPERL_POISON
X X F X X X F X -Uusenm -Duseithreads -Duse64bitall
X X F X X X F X -Uusenm -Duseithreads -Dusemorebits
X X F X X X F X -Uusenm -Duseithreads -Dmad
| | | | | +- LC_ALL = en_US.utf8 -DDEBUGGING
| | | | +--- PERLIO = perlio -DDEBUGGING
| | | +----- PERLIO = stdio  -DDEBUGGING
| | +------- LC_ALL = en_US.utf8
| +--------- PERLIO = perlio
+----------- PERLIO = stdio 

Locally applied patches:
    uncommitted-changes
    SMOKE6692294e17e0b71a5e4a776313e0c3ac739a3d06

Failures: (common-args) -Dcc=g++ -O
[stdio/perlio/en_US.utf8] -Uusenm
[stdio/perlio/en_US.utf8] -DDEBUGGING -Uusenm
[stdio/perlio/en_US.utf8] -Uusenm -Accflags=-DPERL_POISON
[stdio/perlio] -DDEBUGGING -Uusenm -Accflags=-DPERL_POISON
[stdio/en_US.utf8] -Uusenm -Duse64bitall
[stdio] -DDEBUGGING -Uusenm -Duse64bitall
[stdio/perlio] -Uusenm -Dusemorebits
[stdio/perlio/en_US.utf8] -DDEBUGGING -Uusenm -Dusemorebits
[stdio/perlio/en_US.utf8] -Uusenm -Dmad
[stdio] -DDEBUGGING -Uusenm -Dmad
Inconsistent test results (between TEST and harness):
    ../t/re/regexp_trielist.t............... ......................................... FAILED--unexpected output at test 1539
    ../t/re/regexp.t........................ .................................................. FAILED--unexpected output at test 1539
    ../t/re/regexp_qr_embed.t............... ......................................... FAILED--unexpected output at test 1539
    ../t/re/regexp_notrie.t................. ........................................... FAILED--unexpected output at test 1539
    ../t/re/regexp_noamp.t.................. ............................................ FAILED--unexpected output at test 1539
    ../t/re/regexp_qr.t..................... ............................................... FAILED--unexpected output at test 1539

[minitest] -Uusenm
[minitest] -DDEBUGGING -Uusenm
[minitest] -Uusenm -Accflags=-DPERL_POISON
[minitest] -DDEBUGGING -Uusenm -Accflags=-DPERL_POISON
[minitest] -Uusenm -Duse64bitall
[minitest] -DDEBUGGING -Uusenm -Duse64bitall
[minitest] -Uusenm -Dusemorebits
[minitest] -DDEBUGGING -Uusenm -Dusemorebits
[minitest] -Uusenm -Dmad
[minitest] -DDEBUGGING -Uusenm -Dmad
[minitest] -Uusenm -Duseithreads
[minitest] -DDEBUGGING -Uusenm -Duseithreads
[minitest] -Uusenm -Duseithreads -Accflags=-DPERL_POISON
[minitest] -DDEBUGGING -Uusenm -Duseithreads -Accflags=-DPERL_POISON
[minitest] -Uusenm -Duseithreads -Duse64bitall
[minitest] -DDEBUGGING -Uusenm -Duseithreads -Duse64bitall
[minitest] -Uusenm -Duseithreads -Dusemorebits
[minitest] -DDEBUGGING -Uusenm -Duseithreads -Dusemorebits
[minitest] -Uusenm -Duseithreads -Dmad
[minitest] -DDEBUGGING -Uusenm -Duseithreads -Dmad
    t/re/regexp .................... FAILED--unexpected output at test 1539
    t/re/regexp_noamp .............. FAILED--unexpected output at test 1539
    t/re/regexp_notrie ............. FAILED--unexpected output at test 1539
    t/re/regexp_qr ................. FAILED--unexpected output at test 1539
    t/re/regexp_qr_embed ........... FAILED--unexpected output at test 1539
    t/re/regexp_trielist ........... FAILED--unexpected output at test 1539

[en_US.utf8] -DDEBUGGING -Uusenm -Accflags=-DPERL_POISON
Inconsistent test results (between TEST and harness):
    ../t/re/regexp_trielist.t............... ......................................... FAILED--unexpected output at test 1539
    ../t/re/regexp.t........................ .................................................. FAILED--unexpected output at test 1539
    ../t/re/regexp_qr_embed.t............... ......................................... FAILED--unexpected output at test 1539
    ../t/comp/require.t..................... ............................................... FAILED at test 21
    ../t/re/regexp_notrie.t................. ........................................... FAILED--unexpected output at test 1539
    ../t/re/regexp_noamp.t.................. ............................................ FAILED--unexpected output at test 1539
    ../t/re/regexp_qr.t..................... ............................................... FAILED--unexpected output at test 1539

[perlio] -Uusenm -Duse64bitall
[en_US.utf8] -DDEBUGGING -Uusenm -Duse64bitall
[en_US.utf8] -Uusenm -Dusemorebits
[perlio/en_US.utf8] -DDEBUGGING -Uusenm -Dmad
Inconsistent test results (between TEST and harness):
    ../t/re/regexp_trielist.t............... ......................................... FAILED--unexpected output at test 1539
    ../t/re/regexp.t........................ .................................................. FAILED--unexpected output at test 1539
    ../t/re/regexp_qr_embed.t............... ......................................... FAILED--unexpected output at test 1539
    ../t/comp/require.t..................... ............................................... FAILED at test 46
    ../t/re/regexp_notrie.t................. ........................................... FAILED--unexpected output at test 1539
    ../t/re/regexp_noamp.t.................. ............................................ FAILED--unexpected output at test 1539
    ../t/re/regexp_qr.t..................... ............................................... FAILED--unexpected output at test 1539

[perlio] -DDEBUGGING -Uusenm -Duse64bitall
Inconsistent test results (between TEST and harness):
    ../t/re/regexp_trielist.t............... ......................................... FAILED--unexpected output at test 1539
    ../t/re/regexp.t........................ .................................................. FAILED--unexpected output at test 1539
    ../t/re/regexp_qr_embed.t............... ......................................... FAILED--unexpected output at test 1539
    ../t/comp/require.t..................... ............................................... FAILED--expected 52 tests, saw 15
    ../t/re/regexp_notrie.t................. ........................................... FAILED--unexpected output at test 1539
    ../t/re/regexp_noamp.t.................. ............................................ FAILED--unexpected output at test 1539
    ../t/re/regexp_qr.t..................... ............................................... FAILED--unexpected output at test 1539

[stdio/perlio/en_US.utf8] -Uusenm -Duseithreads
[stdio/en_US.utf8] -DDEBUGGING -Uusenm -Duseithreads
[stdio/perlio] -Uusenm -Duseithreads -Accflags=-DPERL_POISON
[stdio/perlio] -DDEBUGGING -Uusenm -Duseithreads -Accflags=-DPERL_POISON
Inconsistent test results (between TEST and harness):
    ../t/re/regexp_trielist.t............... ......................................... FAILED--unexpected output at test 1539
    ../t/re/regexp.t........................ .................................................. FAILED--unexpected output at test 1539
    ../t/re/regexp_qr_embed.t............... ......................................... FAILED--unexpected output at test 1539
    ../t/re/regexp_notrie.t................. ........................................... FAILED--unexpected output at test 1539
    ../t/re/regexp_noamp.t.................. ............................................ FAILED--unexpected output at test 1539
    ../t/re/regexp_qr.t..................... ............................................... FAILED--unexpected output at test 1539
    ../t/re/regexp_qr_embed_thr.t........... ..................................... FAILED--unexpected output at test 1539

[perlio] -DDEBUGGING -Uusenm -Duseithreads
[en_US.utf8] -Uusenm -Duseithreads -Accflags=-DPERL_POISON
Inconsistent test results (between TEST and harness):
    ../t/re/regexp_trielist.t............... ......................................... FAILED--unexpected output at test 1539
    ../t/re/regexp.t........................ .................................................. FAILED--unexpected output at test 1539
    ../t/re/regexp_qr_embed.t............... ......................................... FAILED--unexpected output at test 1539
    ../t/comp/require.t..................... ............................................... FAILED at test 46
    ../t/re/regexp_notrie.t................. ........................................... FAILED--unexpected output at test 1539
    ../t/re/regexp_noamp.t.................. ............................................ FAILED--unexpected output at test 1539
    ../t/re/regexp_qr.t..................... ............................................... FAILED--unexpected output at test 1539
    ../t/re/regexp_qr_embed_thr.t........... ..................................... FAILED--unexpected output at test 1539

[en_US.utf8] -DDEBUGGING -Uusenm -Duseithreads -Accflags=-DPERL_POISON
[stdio/perlio/en_US.utf8] -Uusenm -Duseithreads -Duse64bitall
[stdio/perlio/en_US.utf8] -DDEBUGGING -Uusenm -Duseithreads -Duse64bitall
[stdio/perlio] -Uusenm -Duseithreads -Dusemorebits
[perlio/en_US.utf8] -DDEBUGGING -Uusenm -Duseithreads -Dusemorebits
[stdio/perlio/en_US.utf8] -Uusenm -Duseithreads -Dmad
[stdio/perlio/en_US.utf8] -DDEBUGGING -Uusenm -Duseithreads -Dmad
Inconsistent test results (between TEST and harness):
    ../t/re/regexp_trielist.t............... ......................................... FAILED--unexpected output at test 1539
    ../t/re/regexp.t........................ .................................................. FAILED--unexpected output at test 1539
    ../t/re/regexp_qr_embed.t............... ......................................... FAILED--unexpected output at test 1539
    ../lib/File/Find/t/taint.t.............. ........................................ FAILED at test 3
    ../t/re/regexp_notrie.t................. ........................................... FAILED--unexpected output at test 1539
    ../lib/File/Find/t/find.t............... ......................................... FAILED at test 3
    ../t/re/regexp_noamp.t.................. ............................................ FAILED--unexpected output at test 1539
    ../t/re/regexp_qr.t..................... ............................................... FAILED--unexpected output at test 1539
    ../t/re/regexp_qr_embed_thr.t........... ..................................... FAILED--unexpected output at test 1539

[en_US.utf8] -Uusenm -Duseithreads -Dusemorebits
Inconsistent test results (between TEST and harness):
    ../t/re/regexp_trielist.t............... ......................................... FAILED--unexpected output at test 1539
    ../t/re/regexp.t........................ .................................................. FAILED--unexpected output at test 1539
    ../t/re/regexp_qr_embed.t............... ......................................... FAILED--unexpected output at test 1539
    ../t/comp/require.t..................... ............................................... FAILED at test 46
    ../lib/File/Find/t/taint.t.............. ........................................ FAILED at test 3
    ../t/re/regexp_notrie.t................. ........................................... FAILED--unexpected output at test 1539
    ../lib/File/Find/t/find.t............... ......................................... FAILED at test 3
    ../t/re/regexp_noamp.t.................. ............................................ FAILED--unexpected output at test 1539
    ../t/re/regexp_qr.t..................... ............................................... FAILED--unexpected output at test 1539
    ../t/re/regexp_qr_embed_thr.t........... ..................................... FAILED--unexpected output at test 1539

[stdio] -DDEBUGGING -Uusenm -Duseithreads -Dusemorebits
Inconsistent test results (between TEST and harness):
    ../t/re/regexp_trielist.t............... ......................................... FAILED--unexpected output at test 1539
    ../t/re/regexp.t........................ .................................................. FAILED--unexpected output at test 1539
    ../t/re/regexp_qr_embed.t............... ......................................... FAILED--unexpected output at test 1539
    ../lib/File/Find/t/taint.t.............. ........................................ FAILED at test 3
    ../t/re/regexp_notrie.t................. ........................................... FAILED--unexpected output at test 1539
    ../lib/Benchmark.t...................... ................................................ FAILED at test 15
    ../lib/File/Find/t/find.t............... ......................................... FAILED at test 3
    ../t/re/regexp_noamp.t.................. ............................................ FAILED--unexpected output at test 1539
    ../t/re/regexp_qr.t..................... ............................................... FAILED--unexpected output at test 1539
    ../t/re/regexp_qr_embed_thr.t........... ..................................... FAILED--unexpected output at test 1539

Compiler messages(gcc):
try.c: In function ‘int main()’:
try.c:36:10: warning: ignoring return value of ‘int pipe(int*)’, declared with attribute warn_unused_result
try.c:37:10: warning: ignoring return value of ‘int pipe(int*)’, declared with attribute warn_unused_result
try.c:53:35: warning: ignoring return value of ‘ssize_t write(int, const void*, size_t)’, declared with attribute warn_unused_result
try.c:66:23: warning: ignoring return value of ‘ssize_t write(int, const void*, size_t)’, declared with attribute warn_unused_result
try.c:72:35: warning: ignoring return value of ‘ssize_t write(int, const void*, size_t)’, declared with attribute warn_unused_result
try.c:78:21: warning: ignoring return value of ‘ssize_t read(int, void*, size_t)’, declared with attribute warn_unused_result
try.c:5737:17: warning: extra tokens at end of #ifdef directive
try.c:5740:18: warning: extra tokens at end of #ifdef directive
try.c:5743:19: warning: extra tokens at end of #ifdef directive
try.c:5746:19: warning: extra tokens at end of #ifdef directive
try.c:5773:17: warning: extra tokens at end of #ifdef directive
try.c:5776:18: warning: extra tokens at end of #ifdef directive
try.c:5779:19: warning: extra tokens at end of #ifdef directive
try.c:5782:19: warning: extra tokens at end of #ifdef directive
try.c:5809:17: warning: extra tokens at end of #ifdef directive
try.c:5812:18: warning: extra tokens at end of #ifdef directive
try.c:5815:19: warning: extra tokens at end of #ifdef directive
try.c:5818:19: warning: extra tokens at end of #ifdef directive
try.c:5845:16: warning: extra tokens at end of #ifdef directive
try.c:5848:17: warning: extra tokens at end of #ifdef directive
try.c:5851:18: warning: extra tokens at end of #ifdef directive
try.c:5854:18: warning: extra tokens at end of #ifdef directive
try.c:5881:18: warning: extra tokens at end of #ifdef directive
try.c:5884:19: warning: extra tokens at end of #ifdef directive
try.c:5887:20: warning: extra tokens at end of #ifdef directive
try.c:5890:20: warning: extra tokens at end of #ifdef directive
try.c:6721:18: warning: extra tokens at end of #ifdef directive
try.c:6724:19: warning: extra tokens at end of #ifdef directive
try.c:6727:20: warning: extra tokens at end of #ifdef directive
try.c:6730:20: warning: extra tokens at end of #ifdef directive
try.c:6757:18: warning: extra tokens at end of #ifdef directive
try.c:6760:19: warning: extra tokens at end of #ifdef directive
try.c:6763:20: warning: extra tokens at end of #ifdef directive
try.c:6766:20: warning: extra tokens at end of #ifdef directive
try.c:6793:18: warning: extra tokens at end of #ifdef directive
try.c:6796:19: warning: extra tokens at end of #ifdef directive
try.c:6799:20: warning: extra tokens at end of #ifdef directive
try.c:6802:20: warning: extra tokens at end of #ifdef directive
try.c:6829:17: warning: extra tokens at end of #ifdef directive
try.c:6832:18: warning: extra tokens at end of #ifdef directive
try.c:6835:19: warning: extra tokens at end of #ifdef directive
try.c:6838:19: warning: extra tokens at end of #ifdef directive
try.c:6865:19: warning: extra tokens at end of #ifdef directive
try.c:6868:20: warning: extra tokens at end of #ifdef directive
try.c:6871:21: warning: extra tokens at end of #ifdef directive
try.c:6874:21: warning: extra tokens at end of #ifdef directive
util.c: In function ‘char* S_write_no_mem()’:
util.c:68:34: warning: ignoring return value of ‘ssize_t write(int, const void*, size_t)’, declared with attribute warn_unused_result
doio.c: In function ‘void S_exec_failed(const char*, int, int)’:
doio.c:1372:43: warning: ignoring return value of ‘ssize_t write(int, const void*, size_t)’, declared with attribute warn_unused_result
doio.c: In function ‘PerlIOl** Perl_nextargv(GV*)’:
doio.c:868:46: warning: ignoring return value of ‘int fchown(int, __uid_t, __gid_t)’, declared with attribute warn_unused_result
sv.c: In function ‘void Perl_sv_vcatpvfn(SV*, const char*, STRLEN, __va_list_tag (*)[1], SV**, I32, bool*)’:
sv.c:9962:41: warning: ignoring return value of ‘char* gcvt(double, int, char*)’, declared with attribute warn_unused_result
sv.c:10800:53: warning: ignoring return value of ‘char* gcvt(double, int, char*)’, declared with attribute warn_unused_result
sv.c: In function ‘char* Perl_sv_2pv_flags(SV*, STRLEN*, I32)’:
sv.c:2750:39: warning: ignoring return value of ‘char* gcvt(double, int, char*)’, declared with attribute warn_unused_result
sv.c:2939:39: warning: ignoring return value of ‘char* gcvt(double, int, char*)’, declared with attribute warn_unused_result
mg_vtable.h:97:54: warning: ‘PL_magic_vtable_names’ initialized and declared ‘extern’
perlio.c: In function ‘void S_more_refcounted_fds(int)’:
perlio.c:2354:38: warning: ignoring return value of ‘ssize_t write(int, const void*, size_t)’, declared with attribute warn_unused_result
perlio.c: In function ‘void PerlIO_debug(const char*, ...)’:
perlio.c:495:43: warning: ignoring return value of ‘ssize_t write(int, const void*, size_t)’, declared with attribute warn_unused_result
gv.c: In function ‘GV* S_maybe_add_coresub(HV*, GV*, const char*, STRLEN, const char*, STRLEN)’:
gv.c:386:14: warning: ‘oldcompcv’ may be used uninitialized in this function
gv.c:390:10: warning: ‘oldcurcop’ may be used uninitialized in this function
gv.c:391:16: warning: ‘oldparser’ may be used uninitialized in this function
gv.c:392:9: warning: ‘oldsavestack_ix’ may be used uninitialized in this function
sdbm.c: In function ‘int makroom(DBM*, long int, int)’:
sdbm.c:371:70: warning: ignoring return value of ‘ssize_t write(int, const void*, size_t)’, declared with attribute warn_unused_result
Call.xs: In function ‘I32 filter_call(int, SV*, int)’:
Call.xs:63:58: warning: format ‘%d’ expects type ‘int’, but argument 3 has type ‘STRLEN’
Call.xs:63:58: warning: format ‘%d’ expects type ‘int’, but argument 5 has type ‘STRLEN’
Call.xs:100:41: warning: format ‘%d’ expects type ‘int’, but argument 4 has type ‘STRLEN’
Call.xs:156:38: warning: format ‘%d’ expects type ‘int’, but argument 3 has type ‘STRLEN’
Call.xs:175:51: warning: format ‘%d’ expects type ‘int’, but argument 4 has type ‘long unsigned int’
sv.c:10800:53: warning: ignoring return value of ‘char* qgcvt(long double, int, char*)’, declared with attribute warn_unused_result
sv.c:2750:39: warning: ignoring return value of ‘char* qgcvt(long double, int, char*)’, declared with attribute warn_unused_result
sv.c:2939:39: warning: ignoring return value of ‘char* qgcvt(long double, int, char*)’, declared with attribute warn_unused_result
doio.c: In function ‘void S_exec_failed(PerlInterpreter*, const char*, int, int)’:
doio.c: In function ‘PerlIOl** Perl_nextargv(PerlInterpreter*, GV*)’:
util.c: In function ‘char* S_write_no_mem(PerlInterpreter*)’:
perl.c: In function ‘void S_init_tls_and_interp(PerlInterpreter*)’:
perl.c:97:2: warning: ignoring return value of ‘ssize_t write(int, const void*, size_t)’, declared with attribute warn_unused_result
sv.c: In function ‘DIR* Perl_dirp_dup(PerlInterpreter*, DIR*, CLONE_PARAMS*)’:
sv.c:11247:26: warning: ignoring return value of ‘int fchdir(int)’, declared with attribute warn_unused_result
sv.c: In function ‘void Perl_sv_vcatpvfn(PerlInterpreter*, SV*, const char*, STRLEN, __va_list_tag (*)[1], SV**, I32, bool*)’:
perlio.c: In function ‘void S_more_refcounted_fds(PerlInterpreter*, int)’:
perlio.c:486:56: warning: ignoring return value of ‘ssize_t write(int, const void*, size_t)’, declared with attribute warn_unused_result
sv.c: In function ‘char* Perl_sv_2pv_flags(PerlInterpreter*, SV*, STRLEN*, I32)’:
gv.c: In function ‘GV* S_maybe_add_coresub(PerlInterpreter*, HV*, GV*, const char*, STRLEN, const char*, STRLEN)’:
Call.xs: In function ‘I32 filter_call(PerlInterpreter*, int, SV*, int)’:
threads.xs: In function ‘ithread* S_ithread_create(PerlInterpreter*, SV*, IV, int, int, int, int)’:
threads.xs:711:83: warning: ignoring return value of ‘ssize_t write(int, const void*, size_t)’, declared with attribute warn_unused_result
shared.xs: In function ‘user_lock* S_get_userlock(PerlInterpreter*, SV*, bool)’:
shared.xs:348:5: warning: deprecated conversion from string constant to ‘char*’
shared.xs: In function ‘void S_sharedsv_dec(PerlInterpreter*, SV*)’:
shared.xs:521:5: warning: deprecated conversion from string constant to ‘char*’
shared.xs: In function ‘void Perl_sharedsv_share(PerlInterpreter*, SV*)’:
shared.xs:550:9: warning: deprecated conversion from string constant to ‘char*’
shared.xs: In function ‘int sharedsv_scalar_mg_get(PerlInterpreter*, SV*, MAGIC*)’:
shared.xs:725:5: warning: deprecated conversion from string constant to ‘char*’
shared.xs: In function ‘int sharedsv_scalar_mg_set(PerlInterpreter*, SV*, MAGIC*)’:
shared.xs:803:5: warning: deprecated conversion from string constant to ‘char*’
shared.xs: In function ‘int sharedsv_scalar_mg_free(PerlInterpreter*, SV*, MAGIC*)’:
shared.xs:821:5: warning: deprecated conversion from string constant to ‘char*’
shared.xs: In function ‘int sharedsv_scalar_mg_local(PerlInterpreter*, SV*, MAGIC*)’:
shared.xs:854:9: warning: deprecated conversion from string constant to ‘char*’
shared.xs: In function ‘int sharedsv_elem_mg_FETCH(PerlInterpreter*, SV*, MAGIC*)’:
shared.xs:891:5: warning: deprecated conversion from string constant to ‘char*’
shared.xs: In function ‘int sharedsv_elem_mg_STORE(PerlInterpreter*, SV*, MAGIC*)’:
shared.xs:944:5: warning: deprecated conversion from string constant to ‘char*’
shared.xs: In function ‘int sharedsv_elem_mg_DELETE(PerlInterpreter*, SV*, MAGIC*)’:
shared.xs:986:5: warning: deprecated conversion from string constant to ‘char*’
shared.xs: In function ‘U32 sharedsv_array_mg_FETCHSIZE(PerlInterpreter*, SV*, MAGIC*)’:
shared.xs:1049:5: warning: deprecated conversion from string constant to ‘char*’
shared.xs: In function ‘int sharedsv_array_mg_CLEAR(PerlInterpreter*, SV*, MAGIC*)’:
shared.xs:1069:5: warning: deprecated conversion from string constant to ‘char*’
shared.xs: In function ‘void Perl_sharedsv_lock(PerlInterpreter*, SV*)’:
shared.xs:1173:63: warning: deprecated conversion from string constant to ‘char*’
shared.xs: In function ‘void XS_threads__shared__tie_PUSH(PerlInterpreter*, CV*)’:
shared.xs:1269:13: warning: deprecated conversion from string constant to ‘char*’
shared.xs: In function ‘void XS_threads__shared__tie_UNSHIFT(PerlInterpreter*, CV*)’:
shared.xs:1286:9: warning: deprecated conversion from string constant to ‘char*’
shared.xs: In function ‘void XS_threads__shared__tie_POP(PerlInterpreter*, CV*)’:
shared.xs:1309:9: warning: deprecated conversion from string constant to ‘char*’
shared.xs: In function ‘void XS_threads__shared__tie_SHIFT(PerlInterpreter*, CV*)’:
shared.xs:1326:9: warning: deprecated conversion from string constant to ‘char*’
shared.xs: In function ‘void XS_threads__shared__tie_EXTEND(PerlInterpreter*, CV*)’:
shared.xs:1342:9: warning: deprecated conversion from string constant to ‘char*’
shared.xs: In function ‘void XS_threads__shared__tie_STORESIZE(PerlInterpreter*, CV*)’:
shared.xs:1352:9: warning: deprecated conversion from string constant to ‘char*’
shared.xs: In function ‘void XS_threads__shared__tie_EXISTS(PerlInterpreter*, CV*)’:
shared.xs:1364:13: warning: deprecated conversion from string constant to ‘char*’
shared.xs:1374:13: warning: deprecated conversion from string constant to ‘char*’
shared.xs: In function ‘void XS_threads__shared__tie_FIRSTKEY(PerlInterpreter*, CV*)’:
shared.xs:1390:9: warning: deprecated conversion from string constant to ‘char*’
shared.xs: In function ‘void XS_threads__shared__tie_NEXTKEY(PerlInterpreter*, CV*)’:
shared.xs:1418:9: warning: deprecated conversion from string constant to ‘char*’
shared.xs: In function ‘void XS_threads__shared_bless(PerlInterpreter*, CV*)’:
shared.xs:1678:13: warning: deprecated conversion from string constant to ‘char*’
-- 
Report by Test::Smoke v1.44 build 1285 running on perl 5.10.1
(Reporter v0.035 / Smoker v0.045)




nntp.perl.org: Perl Programming lists via nntp and http.
Comments to Ask Bjørn Hansen at ask@perl.org | Group listing | About