develooper Front page | perl.perl5.porters | Postings from September 2011

Smoke [maint-5.12] v5.12.4-43-g9600546 FAIL(XF) linux 2.6.38-11-generic [debian] (x86_64/8 cpu)

Thread Previous
From:
George Greer
Date:
September 10, 2011 23:12
Subject:
Smoke [maint-5.12] v5.12.4-43-g9600546 FAIL(XF) linux 2.6.38-11-generic [debian] (x86_64/8 cpu)
Message ID:
201109110612.p8B6CV5t024840@m-l.org
Smoke logs available at http://m-l.org/~perl/smoke/perl/

Automated smoke report for 5.12.4 patch 96005461cc6b31cd5136cc15be8fb5b49a0c2feb v5.12.4-43-g9600546
zwei: Intel(R) Core(TM) i7 CPU 920 @ 2.67GHz (GenuineIntel 1600MHz) (x86_64/8 cpu)
    on        linux - 2.6.38-11-generic [debian]
    using     clang version 4.2.1 Compatible Clang Compiler
    smoketime 15 hours 59 minutes (average 47 minutes 58 seconds)

Summary: FAIL(XF)

O = OK  F = Failure(s), extended report at the bottom
X = Failure(s) under TEST but not under harness
? = still running or test results not (yet) available
Build failures during:       - = unknown or N/A
c = Configure, m = make, M = make (after miniperl), t = make test-prep

v5.12.4-43-g9600546  Configuration (common) -A -Dcc=clang append:ccflags=" -fcatch-undefined-behavior "
----------- ---------------------------------------------------------
X X F X X X F X 
X X F X X X F X -Accflags=-DPERL_POISON
X X F X X X F X -Duse64bitall
X X F X X X F X -Dusemorebits
X X F X X X F X -Dmad
X X F X X X F X -Duseithreads
X X F X X X F X -Duseithreads -Accflags=-DPERL_POISON
X X F X X X F X -Duseithreads -Duse64bitall
X X F X X X F X -Duseithreads -Dusemorebits
X X F X X X F X -Duseithreads -Dmad
| | | | | +- LC_ALL = en_US.utf8 -DDEBUGGING
| | | | +--- PERLIO = perlio -DDEBUGGING
| | | +----- PERLIO = stdio  -DDEBUGGING
| | +------- LC_ALL = en_US.utf8
| +--------- PERLIO = perlio
+----------- PERLIO = stdio 

Locally applied patches:
    uncommitted-changes
    SMOKE96005461cc6b31cd5136cc15be8fb5b49a0c2feb

Failures: (common-args) -A -Dcc=clang append:ccflags=" -fcatch-undefined-behavior "
[stdio/perlio/en_US.utf8] 
[stdio/perlio/en_US.utf8] -Duseithreads -Duse64bitall
[stdio/perlio/en_US.utf8] -Duseithreads -Dusemorebits
[stdio/perlio/en_US.utf8] -Duseithreads -Dmad
Inconsistent test results (between TEST and harness):
    ../t/cpan/Memoize/t/errors.t............FAILED--expected 11 tests, saw 6
    ../lib/DBM_Filter/t/01error.t...........FAILED--expected 21 tests, saw 3
    ../ext/ODBM_File/t/odbm.t...............FAILED--no leader found

[minitest] 
[minitest] -Accflags=-DPERL_POISON
[minitest] -Duse64bitall
[minitest] -Dusemorebits
[minitest] -Dmad
[minitest] -Duseithreads
[minitest] -Duseithreads -Accflags=-DPERL_POISON
[minitest] -Duseithreads -Duse64bitall
[minitest] -Duseithreads -Dusemorebits
[minitest] -Duseithreads -Dmad
    t/op/filehandle.................FAILED--no leader found
    t/op/groups.....................FAILED--no leader found

[stdio] -DDEBUGGING
Inconsistent test results (between TEST and harness):
    ../t/re/regexp.t........................FAILED--expected 1452 tests, saw 1403
    ../t/re/pat_re_eval.t...................FAILED--expected 123 tests, saw 16
    ../t/re/regexp_qr_embed.t...............FAILED--expected 1452 tests, saw 1403
    ../ext/ODBM_File/t/odbm.t...............FAILED--no leader found
    ../t/re/pat_advanced.t..................FAILED--no leader found
    ../t/re/regexp_qr.t.....................FAILED--expected 1452 tests, saw 1403
    ../t/cpan/Archive-Tar/t/02_methods.t....FAILED--no leader found
    ../t/cpan/Memoize/t/errors.t............FAILED--expected 11 tests, saw 6
    ../t/re/regexp_noamp.t..................FAILED--expected 1452 tests, saw 1403
    ../lib/DBM_Filter/t/01error.t...........FAILED--expected 21 tests, saw 3
    ../t/re/regexp_trielist.t...............FAILED--expected 1452 tests, saw 1403
    ../t/dist/IO/t/io_file.t................FAILED--no leader found
    ../t/re/regexp_notrie.t.................FAILED--expected 1452 tests, saw 1403

[perlio/en_US.utf8] -DDEBUGGING
[stdio/en_US.utf8] -DDEBUGGING -Duse64bitall
[stdio/perlio/en_US.utf8] -DDEBUGGING -Dusemorebits
[stdio/perlio] -DDEBUGGING -Dmad
Inconsistent test results (between TEST and harness):
    ../t/re/regexp.t........................FAILED--expected 1452 tests, saw 1403
    ../t/re/pat_re_eval.t...................FAILED--expected 123 tests, saw 16
    ../t/re/regexp_qr_embed.t...............FAILED--expected 1452 tests, saw 1403
    ../ext/ODBM_File/t/odbm.t...............FAILED--no leader found
    ../t/re/pat_advanced.t..................FAILED--no leader found
    ../t/re/regexp_qr.t.....................FAILED--expected 1452 tests, saw 1403
    ../t/cpan/Archive-Tar/t/02_methods.t....FAILED--no leader found
    ../t/re/regexp_noamp.t..................FAILED--expected 1452 tests, saw 1403
    ../t/cpan/Memoize/t/errors.t............FAILED--expected 11 tests, saw 6
    ../lib/DBM_Filter/t/01error.t...........FAILED--expected 21 tests, saw 3
    ../t/re/regexp_trielist.t...............FAILED--expected 1452 tests, saw 1403
    ../t/dist/IO/t/io_file.t................FAILED--no leader found
    ../t/re/regexp_notrie.t.................FAILED--expected 1452 tests, saw 1403

[minitest] -DDEBUGGING
[minitest] -DDEBUGGING -Duse64bitall
[minitest] -DDEBUGGING -Dusemorebits
[minitest] -DDEBUGGING -Dmad
[minitest] -DDEBUGGING -Duseithreads
[minitest] -DDEBUGGING -Duseithreads -Duse64bitall
[minitest] -DDEBUGGING -Duseithreads -Dusemorebits
[minitest] -DDEBUGGING -Duseithreads -Dmad
    t/re/pat_advanced...............FAILED--no leader found
    t/re/pat_re_eval................FAILED--expected 123 tests, saw 16
    t/re/regexp.....................FAILED--expected 1452 tests, saw 1403
    t/re/regexp_noamp...............FAILED--expected 1452 tests, saw 1403
    t/re/regexp_notrie..............FAILED--expected 1452 tests, saw 1403
    t/re/regexp_qr..................FAILED--expected 1452 tests, saw 1403
    t/re/regexp_qr_embed............FAILED--expected 1452 tests, saw 1403
    t/re/regexp_trielist............FAILED--expected 1452 tests, saw 1403
    t/op/filehandle.................FAILED--no leader found
    t/op/groups.....................FAILED--no leader found

[stdio/perlio/en_US.utf8] -Accflags=-DPERL_POISON
[stdio/perlio/en_US.utf8] -Duse64bitall
[stdio/perlio/en_US.utf8] -Dusemorebits
[stdio/perlio/en_US.utf8] -Dmad
[perlio/en_US.utf8] -Duseithreads
Inconsistent test results (between TEST and harness):
    ../ext/ODBM_File/t/odbm.t...............FAILED--no leader found
    ../t/cpan/Memoize/t/errors.t............FAILED--expected 11 tests, saw 6
    ../lib/DBM_Filter/t/01error.t...........FAILED--expected 21 tests, saw 3

[stdio/perlio/en_US.utf8] -DDEBUGGING -Accflags=-DPERL_POISON
[stdio/perlio/en_US.utf8] -DDEBUGGING -Duseithreads -Accflags=-DPERL_POISON
Inconsistent test results (between TEST and harness):
    ../t/base/cond.t........................FAILED--non-zero wait status: 11

[minitest] -DDEBUGGING -Accflags=-DPERL_POISON
    t/base/lex......................FAILED--non-zero wait status: 11

[perlio] -DDEBUGGING -Duse64bitall
Inconsistent test results (between TEST and harness):
    ../t/re/regexp.t........................FAILED--expected 1452 tests, saw 1403
    ../t/re/pat_re_eval.t...................FAILED--expected 123 tests, saw 16
    ../lib/Benchmark.t......................FAILED at test 13
    ../t/re/regexp_qr_embed.t...............FAILED--expected 1452 tests, saw 1403
    ../ext/ODBM_File/t/odbm.t...............FAILED--no leader found
    ../t/re/pat_advanced.t..................FAILED--no leader found
    ../t/re/regexp_qr.t.....................FAILED--expected 1452 tests, saw 1403
    ../t/cpan/Archive-Tar/t/02_methods.t....FAILED--no leader found
    ../t/re/regexp_noamp.t..................FAILED--expected 1452 tests, saw 1403
    ../t/cpan/Memoize/t/errors.t............FAILED--expected 11 tests, saw 6
    ../lib/DBM_Filter/t/01error.t...........FAILED--expected 21 tests, saw 3
    ../t/re/regexp_trielist.t...............FAILED--expected 1452 tests, saw 1403
    ../t/dist/IO/t/io_file.t................FAILED--no leader found
    ../t/re/regexp_notrie.t.................FAILED--expected 1452 tests, saw 1403

[en_US.utf8] -DDEBUGGING -Dmad
Inconsistent test results (between TEST and harness):
    ../t/re/regexp.t........................FAILED--expected 1452 tests, saw 1403
    ../t/re/pat_re_eval.t...................FAILED--expected 123 tests, saw 16
    ../t/re/regexp_qr_embed.t...............FAILED--expected 1452 tests, saw 1403
    ../ext/ODBM_File/t/odbm.t...............FAILED--no leader found
    ../lib/warnings.t.......................FAILED at test 244
    ../t/re/pat_advanced.t..................FAILED--no leader found
    ../t/re/regexp_qr.t.....................FAILED--expected 1452 tests, saw 1403
    ../t/cpan/Archive-Tar/t/02_methods.t....FAILED--no leader found
    ../t/re/regexp_noamp.t..................FAILED--expected 1452 tests, saw 1403
    ../t/cpan/Memoize/t/errors.t............FAILED--expected 11 tests, saw 6
    ../t/op/runlevel.t......................FAILED at test 9
    ../lib/DBM_Filter/t/01error.t...........FAILED--expected 21 tests, saw 3
    ../t/re/regexp_trielist.t...............FAILED--expected 1452 tests, saw 1403
    ../t/dist/IO/t/io_file.t................FAILED--no leader found
    ../t/re/regexp_notrie.t.................FAILED--expected 1452 tests, saw 1403

[stdio] -Duseithreads
Inconsistent test results (between TEST and harness):
    ../lib/Benchmark.t......................FAILED at test 13
    ../ext/ODBM_File/t/odbm.t...............FAILED--no leader found
    ../t/cpan/Memoize/t/errors.t............FAILED--expected 11 tests, saw 6
    ../lib/DBM_Filter/t/01error.t...........FAILED--expected 21 tests, saw 3

[stdio] -DDEBUGGING -Duseithreads
Inconsistent test results (between TEST and harness):
    ../t/re/regexp_qr.t.....................FAILED--expected 1452 tests, saw 1403
    ../t/re/regexp_noamp.t..................FAILED--expected 1452 tests, saw 1403
    ../t/re/regexp_notrie.t.................FAILED--expected 1452 tests, saw 1403
    ../t/re/pat_re_eval_thr.t...............FAILED--expected 123 tests, saw 16
    ../t/re/regexp.t........................FAILED--expected 1452 tests, saw 1403
    ../t/re/pat_re_eval.t...................FAILED--expected 123 tests, saw 16
    ../ext/ODBM_File/t/odbm.t...............FAILED--no leader found
    ../t/re/regexp_qr_embed.t...............FAILED--expected 1452 tests, saw 1403
    ../t/cpan/Archive-Tar/t/02_methods.t....FAILED--no leader found
    ../t/re/pat_advanced.t..................FAILED--no leader found
    ../t/re/pat_advanced_thr.t..............FAILED--no leader found
    ../t/cpan/Memoize/t/errors.t............FAILED--expected 11 tests, saw 6
    ../lib/DBM_Filter/t/01error.t...........FAILED--expected 21 tests, saw 3
    ../t/dist/IO/t/io_file.t................FAILED--no leader found
    ../t/re/regexp_trielist.t...............FAILED--expected 1452 tests, saw 1403
    ../t/re/regexp_qr_embed_thr.t...........FAILED--expected 1452 tests, saw 1403

[perlio/en_US.utf8] -DDEBUGGING -Duseithreads
Inconsistent test results (between TEST and harness):
    ../t/re/regexp_qr.t.....................FAILED--expected 1452 tests, saw 1403
    ../t/re/regexp_noamp.t..................FAILED--expected 1452 tests, saw 1403
    ../t/re/regexp_notrie.t.................FAILED--expected 1452 tests, saw 1403
    ../t/re/pat_re_eval_thr.t...............FAILED--expected 123 tests, saw 16
    ../t/re/regexp.t........................FAILED--expected 1452 tests, saw 1403
    ../t/re/pat_re_eval.t...................FAILED--expected 123 tests, saw 16
    ../t/re/regexp_qr_embed.t...............FAILED--expected 1452 tests, saw 1403
    ../ext/ODBM_File/t/odbm.t...............FAILED--no leader found
    ../t/re/pat_advanced.t..................FAILED--no leader found
    ../t/cpan/Archive-Tar/t/02_methods.t....FAILED--no leader found
    ../t/re/pat_advanced_thr.t..............FAILED--no leader found
    ../t/cpan/Memoize/t/errors.t............FAILED--expected 11 tests, saw 6
    ../lib/DBM_Filter/t/01error.t...........FAILED--expected 21 tests, saw 3
    ../t/re/regexp_trielist.t...............FAILED--expected 1452 tests, saw 1403
    ../t/dist/IO/t/io_file.t................FAILED--no leader found
    ../t/re/regexp_qr_embed_thr.t...........FAILED--expected 1452 tests, saw 1403

[stdio] -Duseithreads -Accflags=-DPERL_POISON
Inconsistent test results (between TEST and harness):
    ../t/dist/threads/t/stack_env.t.........FAILED--non-zero wait status: 11
    ../t/dist/Thread-Queue/t/03_peek.t......FAILED--expected 19 tests, saw 13
    ../t/dist/threads-shared/t/clone.t......FAILED--expected 34 tests, saw 4
    ../t/re/regexp_unicode_prop_thr.t.......FAILED--non-zero wait status: 11
    ../t/dist/threads/t/stack.t.............FAILED--expected 18 tests, saw 9
    ../t/dist/threads-shared/t/hv_simple.t..FAILED--expected 16 tests, saw 2
    ../t/dist/threads-shared/t/sv_refs.t....FAILED--expected 21 tests, saw 6
    ../t/cpan/Test-Simple/t/threads.t.......FAILED--expected 6 tests, saw 1
    ../t/op/threads.t.......................FAILED at test 1
    ../t/re/pat_thr.t.......................FAILED--non-zero wait status: 11
    ../t/dist/threads-shared/t/av_refs.t....FAILED--expected 14 tests, saw 3
    ../ext/Hash-Util-FieldHash/t/04_thread.tFAILED--expected 30 tests, saw 18
    ../t/dist/threads/t/join.t..............FAILED--expected 20 tests, saw 1
    ../t/dist/threads-shared/t/utf8.t.......FAILED--non-zero wait status: 11
    ../ext/Hash-Util-FieldHash/t/03_class.t.FAILED--expected 7 tests, saw 2
    ../t/dist/Thread-Queue/t/06_insert.t....FAILED--expected 16 tests, saw 1
    ../t/op/getpid.t........................FAILED--expected 3 tests, saw 1
    ../t/re/pat_psycho_thr.t................FAILED--non-zero wait status: 11
    ../t/dist/threads/t/stress_string.t.....FAILED--expected 61 tests, saw 31
    ../t/dist/threads-shared/t/sv_simple.t..FAILED--expected 11 tests, saw 5
    ../t/dist/threads/t/free2.t.............FAILED--expected 78 tests, saw 10
    ../t/dist/threads/t/thread.t............FAILED--expected 34 tests, saw 2
    ../t/dist/threads-shared/t/shared_attr.tFAILED--expected 101 tests, saw 2
    ../t/cpan/Test-Simple/t/is_deeply_with_threads.tFAILED--non-zero wait status: 11
    ../t/re/substr_thr.t....................FAILED--non-zero wait status: 11
    ../t/cpan/Memoize/t/errors.t............FAILED--expected 11 tests, saw 6
    ../lib/DBM_Filter/t/01error.t...........FAILED--expected 21 tests, saw 3
    ../t/dist/threads/t/libc.t..............FAILED--expected 11 tests, saw 1
    ../t/dist/threads/t/basic.t.............FAILED--expected 33 tests, saw 3
    ../t/re/regexp_qr_embed_thr.t...........FAILED--expected 1452 tests, saw 3
    ../t/dist/Thread-Queue/t/01_basic.t.....FAILED--expected 81 tests, saw 30
    ../t/dist/threads-shared/t/hv_refs.t....FAILED--expected 20 tests, saw 3
    ../t/dist/Storable/t/threads.t..........FAILED--expected 2 tests, saw 1
    ../lib/Thread.t.........................FAILED--expected 13 tests, saw 5
    ../t/dist/threads-shared/t/object.t.....FAILED--expected 28 tests, saw 9
    ../t/cpan/Test-Simple/t/diag.t..........FAILED--non-zero wait status: 11
    ../t/dist/threads/t/blocks.t............FAILED--expected 5 tests, saw 0
    ../t/dist/threads-shared/t/av_simple.t..FAILED--expected 44 tests, saw 9
    ../t/dist/threads/t/err.t...............FAILED--expected 10 tests, saw 7
    ../t/dist/Thread-Queue/t/05_extract.t...FAILED--expected 20 tests, saw 7
    ../t/op/reset.t.........................FAILED at test 21
    ../t/cpan/Tie-RefHash/t/threaded.t......FAILED--non-zero wait status: 11
    ../t/dist/threads/t/stress_cv.t.........FAILED--expected 61 tests, saw 31
    ../t/re/pat_special_cc_thr.t............FAILED--non-zero wait status: 11
    ../t/dist/threads/t/exit.t..............FAILED--expected 18 tests, saw 2
    ../t/dist/threads-shared/t/cond.t.......FAILED--expected 32 tests, saw 4
    ../t/re/pat_rt_report_thr.t.............FAILED--non-zero wait status: 11
    ../t/dist/Thread-Queue/t/02_refs.t......FAILED--expected 46 tests, saw 37
    ../t/dist/threads/t/context.t...........FAILED--expected 31 tests, saw 2
    ../ext/XS-APItest/t/my_cxt.t............FAILED--expected 16 tests, saw 13
    ../t/dist/threads-shared/t/blessed.t....FAILED--expected 37 tests, saw 13
    ../t/dist/threads/t/state.t.............FAILED--expected 59 tests, saw 13
    ../t/dist/threads/t/problems.t..........FAILED--expected 15 tests, saw 3
    ../t/dist/threads/t/list.t..............FAILED--expected 15 tests, saw 2
    ../t/dist/threads-shared/t/stress.t.....FAILED--expected 1 tests, saw 0
    ../t/dist/threads/t/end.t...............FAILED--expected 6 tests, saw 2
    ../t/dist/threads-shared/t/wait.t.......FAILED--expected 91 tests, saw 10
    ../t/re/pat_re_eval_thr.t...............FAILED--non-zero wait status: 11
    ../t/dist/threads/t/stress_re.t.........FAILED--expected 61 tests, saw 31
    ../t/dist/threads/t/kill.t..............FAILED--no leader found
    ../ext/ODBM_File/t/odbm.t...............FAILED--no leader found
    ../t/cpan/Test-Simple/t/overload_threads.tFAILED--non-zero wait status: 11
    ../t/op/index_thr.t.....................FAILED--non-zero wait status: 11
    ../t/dist/threads-shared/t/no_share.t...FAILED--expected 6 tests, saw 4
    ../t/re/pat_advanced_thr.t..............FAILED--non-zero wait status: 11
    ../t/dist/threads-shared/t/waithires.t..FAILED--expected 57 tests, saw 6
    ../t/re/reg_email_thr.t.................FAILED--non-zero wait status: 11
    ../t/dist/threads/t/free.t..............FAILED--expected 29 tests, saw 1

[perlio] -Duseithreads -Accflags=-DPERL_POISON
Inconsistent test results (between TEST and harness):
    ../t/dist/threads/t/stack_env.t.........FAILED--non-zero wait status: 11
    ../t/dist/Thread-Queue/t/03_peek.t......FAILED--expected 19 tests, saw 13
    ../t/dist/threads-shared/t/clone.t......FAILED--expected 34 tests, saw 4
    ../t/re/regexp_unicode_prop_thr.t.......FAILED--non-zero wait status: 11
    ../t/dist/threads/t/stack.t.............FAILED--expected 18 tests, saw 9
    ../t/dist/Thread-Semaphore/t/01_basic.t.FAILED--expected 10 tests, saw 9
    ../t/dist/threads-shared/t/hv_simple.t..FAILED--expected 16 tests, saw 2
    ../t/dist/threads-shared/t/sv_refs.t....FAILED--expected 21 tests, saw 6
    ../t/cpan/Test-Simple/t/threads.t.......FAILED--expected 6 tests, saw 1
    ../t/re/pat_thr.t.......................FAILED--non-zero wait status: 11
    ../t/op/threads.t.......................FAILED at test 1
    ../t/dist/threads-shared/t/av_refs.t....FAILED--expected 14 tests, saw 3
    ../ext/Hash-Util-FieldHash/t/04_thread.tFAILED--expected 30 tests, saw 18
    ../t/dist/threads/t/join.t..............FAILED--expected 20 tests, saw 1
    ../t/dist/threads-shared/t/utf8.t.......FAILED--non-zero wait status: 11
    ../ext/Hash-Util-FieldHash/t/03_class.t.FAILED--expected 7 tests, saw 2
    ../t/dist/Thread-Queue/t/06_insert.t....FAILED--expected 16 tests, saw 1
    ../t/op/getpid.t........................FAILED--expected 3 tests, saw 1
    ../t/re/pat_psycho_thr.t................FAILED--non-zero wait status: 11
    ../t/dist/Thread-Queue/t/07_lock.t......FAILED--non-zero wait status: 11
    ../t/dist/threads-shared/t/sv_simple.t..FAILED--expected 11 tests, saw 5
    ../t/dist/threads/t/stress_string.t.....FAILED--expected 61 tests, saw 31
    ../t/dist/threads/t/free2.t.............FAILED--expected 78 tests, saw 16
    ../t/dist/threads/t/thread.t............FAILED--expected 34 tests, saw 2
    ../t/dist/threads-shared/t/shared_attr.tFAILED--expected 101 tests, saw 2
    ../t/cpan/Test-Simple/t/is_deeply_with_threads.tFAILED--non-zero wait status: 11
    ../t/re/substr_thr.t....................FAILED--non-zero wait status: 11
    ../t/cpan/Memoize/t/errors.t............FAILED--expected 11 tests, saw 6
    ../t/dist/threads/t/libc.t..............FAILED--expected 11 tests, saw 1
    ../lib/DBM_Filter/t/01error.t...........FAILED--expected 21 tests, saw 3
    ../t/dist/threads/t/basic.t.............FAILED--expected 33 tests, saw 3
    ../t/re/regexp_qr_embed_thr.t...........FAILED--expected 1452 tests, saw 3
    ../t/dist/Thread-Queue/t/01_basic.t.....FAILED--expected 81 tests, saw 30
    ../t/dist/threads-shared/t/hv_refs.t....FAILED--expected 20 tests, saw 3
    ../t/dist/Storable/t/threads.t..........FAILED--expected 2 tests, saw 1
    ../t/dist/threads-shared/t/object.t.....FAILED--expected 28 tests, saw 9
    ../lib/Thread.t.........................FAILED--expected 13 tests, saw 5
    ../t/cpan/Test-Simple/t/diag.t..........FAILED--non-zero wait status: 11
    ../t/dist/threads/t/blocks.t............FAILED--expected 5 tests, saw 0
    ../t/dist/threads-shared/t/av_simple.t..FAILED--expected 44 tests, saw 9
    ../t/dist/threads/t/err.t...............FAILED--expected 10 tests, saw 7
    ../t/dist/Thread-Queue/t/05_extract.t...FAILED--expected 20 tests, saw 7
    ../t/op/reset.t.........................FAILED at test 21
    ../t/cpan/Tie-RefHash/t/threaded.t......FAILED--non-zero wait status: 11
    ../t/dist/threads/t/stress_cv.t.........FAILED--expected 61 tests, saw 31
    ../t/re/pat_special_cc_thr.t............FAILED--non-zero wait status: 11
    ../t/dist/threads/t/exit.t..............FAILED--expected 18 tests, saw 2
    ../t/dist/threads-shared/t/cond.t.......FAILED--expected 32 tests, saw 4
    ../t/re/pat_rt_report_thr.t.............FAILED--non-zero wait status: 11
    ../t/dist/Thread-Queue/t/02_refs.t......FAILED--expected 46 tests, saw 37
    ../t/dist/threads/t/context.t...........FAILED--expected 31 tests, saw 2
    ../ext/XS-APItest/t/my_cxt.t............FAILED--expected 16 tests, saw 13
    ../t/dist/threads-shared/t/blessed.t....FAILED--expected 37 tests, saw 13
    ../t/dist/threads/t/state.t.............FAILED--expected 59 tests, saw 13
    ../t/dist/threads/t/problems.t..........FAILED--expected 15 tests, saw 3
    ../t/dist/threads/t/list.t..............FAILED--expected 15 tests, saw 2
    ../t/dist/threads-shared/t/stress.t.....FAILED--expected 1 tests, saw 0
    ../t/dist/threads/t/end.t...............FAILED--expected 6 tests, saw 2
    ../t/dist/threads-shared/t/wait.t.......FAILED--expected 91 tests, saw 10
    ../t/re/pat_re_eval_thr.t...............FAILED--non-zero wait status: 11
    ../t/dist/threads/t/stress_re.t.........FAILED--expected 61 tests, saw 31
    ../t/dist/threads/t/kill.t..............FAILED--no leader found
    ../ext/ODBM_File/t/odbm.t...............FAILED--no leader found
    ../t/op/index_thr.t.....................FAILED--non-zero wait status: 11
    ../t/cpan/Test-Simple/t/overload_threads.tFAILED--non-zero wait status: 11
    ../t/dist/threads-shared/t/no_share.t...FAILED--expected 6 tests, saw 4
    ../t/re/pat_advanced_thr.t..............FAILED--non-zero wait status: 11
    ../t/dist/threads-shared/t/waithires.t..FAILED--expected 57 tests, saw 6
    ../t/re/reg_email_thr.t.................FAILED--non-zero wait status: 11
    ../t/dist/threads/t/free.t..............FAILED--expected 29 tests, saw 1

[en_US.utf8] -Duseithreads -Accflags=-DPERL_POISON
Inconsistent test results (between TEST and harness):
    ../t/dist/threads/t/stack_env.t.........FAILED--non-zero wait status: 11
    ../t/dist/Thread-Queue/t/03_peek.t......FAILED--expected 19 tests, saw 13
    ../t/dist/threads-shared/t/clone.t......FAILED--expected 34 tests, saw 4
    ../t/re/regexp_unicode_prop_thr.t.......FAILED--non-zero wait status: 11
    ../t/dist/threads/t/stack.t.............FAILED--expected 18 tests, saw 9
    ../t/dist/Thread-Semaphore/t/01_basic.t.FAILED--expected 10 tests, saw 8
    ../t/dist/threads-shared/t/hv_simple.t..FAILED--expected 16 tests, saw 2
    ../t/dist/threads-shared/t/sv_refs.t....FAILED--expected 21 tests, saw 6
    ../t/cpan/Test-Simple/t/threads.t.......FAILED--expected 6 tests, saw 1
    ../t/re/pat_thr.t.......................FAILED--non-zero wait status: 11
    ../t/op/threads.t.......................FAILED at test 1
    ../t/dist/threads-shared/t/av_refs.t....FAILED--expected 14 tests, saw 3
    ../ext/Hash-Util-FieldHash/t/04_thread.tFAILED--expected 30 tests, saw 6
    ../t/dist/threads/t/join.t..............FAILED--expected 20 tests, saw 1
    ../t/dist/threads-shared/t/utf8.t.......FAILED--non-zero wait status: 11
    ../ext/Hash-Util-FieldHash/t/03_class.t.FAILED--expected 7 tests, saw 2
    ../t/dist/Thread-Queue/t/06_insert.t....FAILED--expected 16 tests, saw 1
    ../t/op/getpid.t........................FAILED--expected 3 tests, saw 1
    ../t/re/pat_psycho_thr.t................FAILED--non-zero wait status: 11
    ../t/dist/Thread-Queue/t/07_lock.t......FAILED--expected 3 tests, saw 2
    ../t/dist/threads-shared/t/sv_simple.t..FAILED--expected 11 tests, saw 5
    ../t/dist/threads/t/stress_string.t.....FAILED--expected 61 tests, saw 31
    ../t/dist/threads/t/free2.t.............FAILED--expected 78 tests, saw 11
    ../t/dist/threads/t/thread.t............FAILED--expected 34 tests, saw 2
    ../t/dist/threads-shared/t/shared_attr.tFAILED--expected 101 tests, saw 2
    ../t/cpan/Test-Simple/t/is_deeply_with_threads.tFAILED--non-zero wait status: 11
    ../t/re/substr_thr.t....................FAILED--non-zero wait status: 11
    ../t/cpan/Memoize/t/errors.t............FAILED--expected 11 tests, saw 6
    ../t/dist/threads/t/libc.t..............FAILED--expected 11 tests, saw 1
    ../lib/DBM_Filter/t/01error.t...........FAILED--expected 21 tests, saw 3
    ../t/dist/threads/t/basic.t.............FAILED--expected 33 tests, saw 3
    ../t/re/regexp_qr_embed_thr.t...........FAILED--expected 1452 tests, saw 3
    ../t/dist/Thread-Queue/t/01_basic.t.....FAILED--expected 81 tests, saw 31
    ../t/dist/threads-shared/t/hv_refs.t....FAILED--expected 20 tests, saw 3
    ../t/dist/Storable/t/threads.t..........FAILED--expected 2 tests, saw 1
    ../t/dist/threads-shared/t/object.t.....FAILED--expected 28 tests, saw 9
    ../lib/Thread.t.........................FAILED--expected 13 tests, saw 5
    ../t/cpan/Test-Simple/t/diag.t..........FAILED--non-zero wait status: 11
    ../t/dist/threads/t/blocks.t............FAILED--expected 5 tests, saw 0
    ../t/dist/threads-shared/t/av_simple.t..FAILED--expected 44 tests, saw 9
    ../t/dist/threads/t/err.t...............FAILED--expected 10 tests, saw 7
    ../t/dist/Thread-Queue/t/05_extract.t...FAILED--expected 20 tests, saw 7
    ../t/op/reset.t.........................FAILED at test 21
    ../t/cpan/Tie-RefHash/t/threaded.t......FAILED--non-zero wait status: 11
    ../t/dist/threads/t/stress_cv.t.........FAILED--expected 61 tests, saw 31
    ../t/re/pat_special_cc_thr.t............FAILED--non-zero wait status: 11
    ../t/dist/threads/t/exit.t..............FAILED--expected 18 tests, saw 2
    ../t/dist/threads-shared/t/cond.t.......FAILED--expected 32 tests, saw 4
    ../t/re/pat_rt_report_thr.t.............FAILED--non-zero wait status: 11
    ../t/dist/Thread-Queue/t/02_refs.t......FAILED--expected 46 tests, saw 37
    ../t/dist/threads/t/context.t...........FAILED--expected 31 tests, saw 2
    ../ext/XS-APItest/t/my_cxt.t............FAILED--expected 16 tests, saw 13
    ../t/dist/threads-shared/t/blessed.t....FAILED--expected 37 tests, saw 13
    ../t/dist/threads/t/state.t.............FAILED--expected 59 tests, saw 13
    ../t/dist/threads/t/problems.t..........FAILED--expected 15 tests, saw 3
    ../t/dist/threads/t/list.t..............FAILED--expected 15 tests, saw 2
    ../t/dist/threads-shared/t/stress.t.....FAILED--expected 1 tests, saw 0
    ../t/dist/threads/t/end.t...............FAILED--expected 6 tests, saw 2
    ../t/dist/threads-shared/t/wait.t.......FAILED--expected 91 tests, saw 10
    ../t/re/pat_re_eval_thr.t...............FAILED--non-zero wait status: 11
    ../t/dist/threads/t/stress_re.t.........FAILED--expected 61 tests, saw 31
    ../t/dist/threads/t/kill.t..............FAILED--expected 18 tests, saw 14
    ../ext/ODBM_File/t/odbm.t...............FAILED--no leader found
    ../t/op/index_thr.t.....................FAILED--non-zero wait status: 11
    ../t/cpan/Test-Simple/t/overload_threads.tFAILED--non-zero wait status: 11
    ../t/dist/threads-shared/t/no_share.t...FAILED--expected 6 tests, saw 4
    ../t/re/pat_advanced_thr.t..............FAILED--non-zero wait status: 11
    ../t/dist/threads-shared/t/waithires.t..FAILED--expected 57 tests, saw 6
    ../t/re/reg_email_thr.t.................FAILED--non-zero wait status: 11
    ../t/dist/threads/t/free.t..............FAILED--expected 29 tests, saw 1

[minitest] -DDEBUGGING -Duseithreads -Accflags=-DPERL_POISON
    t/base/cond.....................FAILED--non-zero wait status: 11

[stdio/perlio/en_US.utf8] -DDEBUGGING -Duseithreads -Duse64bitall
[stdio/perlio/en_US.utf8] -DDEBUGGING -Duseithreads -Dusemorebits
[stdio/perlio/en_US.utf8] -DDEBUGGING -Duseithreads -Dmad
Inconsistent test results (between TEST and harness):
    ../t/re/regexp_qr.t.....................FAILED--expected 1452 tests, saw 1403
    ../t/re/pat_advanced.t..................FAILED--no leader found
    ../t/re/regexp.t........................FAILED--expected 1452 tests, saw 1403
    ../t/re/pat_re_eval.t...................FAILED--expected 123 tests, saw 16
    ../t/re/regexp_qr_embed.t...............FAILED--expected 1452 tests, saw 1403
    ../t/cpan/Memoize/t/errors.t............FAILED--expected 11 tests, saw 6
    ../lib/DBM_Filter/t/01error.t...........FAILED--expected 21 tests, saw 3
    ../t/re/regexp_qr_embed_thr.t...........FAILED--expected 1452 tests, saw 1403
    ../t/re/regexp_noamp.t..................FAILED--expected 1452 tests, saw 1403
    ../t/re/regexp_notrie.t.................FAILED--expected 1452 tests, saw 1403
    ../t/re/regexp_trielist.t...............FAILED--expected 1452 tests, saw 1403
    ../t/dist/IO/t/io_file.t................FAILED--no leader found
    ../t/re/pat_re_eval_thr.t...............FAILED--expected 123 tests, saw 16
    ../ext/ODBM_File/t/odbm.t...............FAILED--no leader found
    ../t/cpan/Archive-Tar/t/02_methods.t....FAILED--no leader found
    ../t/re/pat_advanced_thr.t..............FAILED--no leader found

Compiler messages(gcc):
try.c:5737:17: warning: extra tokens at end of #ifdef directive [-Wextra-tokens]
try.c:5740:18: warning: extra tokens at end of #ifdef directive [-Wextra-tokens]
try.c:5743:19: warning: extra tokens at end of #ifdef directive [-Wextra-tokens]
try.c:5746:19: warning: extra tokens at end of #ifdef directive [-Wextra-tokens]
try.c:5773:17: warning: extra tokens at end of #ifdef directive [-Wextra-tokens]
try.c:5776:18: warning: extra tokens at end of #ifdef directive [-Wextra-tokens]
try.c:5779:19: warning: extra tokens at end of #ifdef directive [-Wextra-tokens]
try.c:5782:19: warning: extra tokens at end of #ifdef directive [-Wextra-tokens]
try.c:5809:17: warning: extra tokens at end of #ifdef directive [-Wextra-tokens]
try.c:5812:18: warning: extra tokens at end of #ifdef directive [-Wextra-tokens]
try.c:5815:19: warning: extra tokens at end of #ifdef directive [-Wextra-tokens]
try.c:5818:19: warning: extra tokens at end of #ifdef directive [-Wextra-tokens]
try.c:5845:16: warning: extra tokens at end of #ifdef directive [-Wextra-tokens]
try.c:5848:17: warning: extra tokens at end of #ifdef directive [-Wextra-tokens]
try.c:5851:18: warning: extra tokens at end of #ifdef directive [-Wextra-tokens]
try.c:5854:18: warning: extra tokens at end of #ifdef directive [-Wextra-tokens]
try.c:5881:18: warning: extra tokens at end of #ifdef directive [-Wextra-tokens]
try.c:5884:19: warning: extra tokens at end of #ifdef directive [-Wextra-tokens]
try.c:5887:20: warning: extra tokens at end of #ifdef directive [-Wextra-tokens]
try.c:5890:20: warning: extra tokens at end of #ifdef directive [-Wextra-tokens]
try.c:6721:18: warning: extra tokens at end of #ifdef directive [-Wextra-tokens]
try.c:6724:19: warning: extra tokens at end of #ifdef directive [-Wextra-tokens]
try.c:6727:20: warning: extra tokens at end of #ifdef directive [-Wextra-tokens]
try.c:6730:20: warning: extra tokens at end of #ifdef directive [-Wextra-tokens]
try.c:6757:18: warning: extra tokens at end of #ifdef directive [-Wextra-tokens]
try.c:6760:19: warning: extra tokens at end of #ifdef directive [-Wextra-tokens]
try.c:6763:20: warning: extra tokens at end of #ifdef directive [-Wextra-tokens]
try.c:6766:20: warning: extra tokens at end of #ifdef directive [-Wextra-tokens]
try.c:6793:18: warning: extra tokens at end of #ifdef directive [-Wextra-tokens]
try.c:6796:19: warning: extra tokens at end of #ifdef directive [-Wextra-tokens]
try.c:6799:20: warning: extra tokens at end of #ifdef directive [-Wextra-tokens]
try.c:6802:20: warning: extra tokens at end of #ifdef directive [-Wextra-tokens]
try.c:6829:17: warning: extra tokens at end of #ifdef directive [-Wextra-tokens]
try.c:6832:18: warning: extra tokens at end of #ifdef directive [-Wextra-tokens]
try.c:6835:19: warning: extra tokens at end of #ifdef directive [-Wextra-tokens]
try.c:6838:19: warning: extra tokens at end of #ifdef directive [-Wextra-tokens]
try.c:6865:19: warning: extra tokens at end of #ifdef directive [-Wextra-tokens]
try.c:6868:20: warning: extra tokens at end of #ifdef directive [-Wextra-tokens]
try.c:6871:21: warning: extra tokens at end of #ifdef directive [-Wextra-tokens]
try.c:6874:21: warning: extra tokens at end of #ifdef directive [-Wextra-tokens]
toke.c:2113:3: warning: expression result unused [-Wunused-value]
toke.c:2627:3: warning: expression result unused [-Wunused-value]
toke.c:3734:5: warning: expression result unused [-Wunused-value]
toke.c:3810:6: warning: expression result unused [-Wunused-value]
toke.c:7191:7: warning: expression result unused [-Wunused-value]
toke.c:12262:5: warning: expression result unused [-Wunused-value]
toke.c:12758:2: warning: expression result unused [-Wunused-value]
toke.c:12672:5: warning: expression result unused [-Wunused-value]
toke.c:13783:2: warning: expression result unused [-Wunused-value]
regcomp.c:3368:5: warning: expression result unused [-Wunused-value]
regcomp.c:9431:11: warning: expression result unused [-Wunused-value]
util.c:530:5: warning: expression result unused [-Wunused-value]
util.c:2346:5: warning: expression result unused [-Wunused-value]
util.c:2513:5: warning: expression result unused [-Wunused-value]
mro.c:532:2: warning: expression result unused [-Wunused-value]
pp_hot.c:141:3: warning: expression result unused [-Wunused-value]
pp_hot.c:1195:5: warning: expression result unused [-Wunused-value]
pp_hot.c:1618:3: warning: expression result unused [-Wunused-value]
pp_hot.c:1623:6: warning: expression result unused [-Wunused-value]
pp_hot.c:1632:3: warning: expression result unused [-Wunused-value]
pp_hot.c:1625:2: warning: expression result unused [-Wunused-value]
pp_hot.c:2291:6: warning: expression result unused [-Wunused-value]
sv.c:917:29: warning: comparison of 0 <= unsigned expression is always true [-Wsign-compare]
sv.c:931:7: warning: comparison of 0 <= unsigned expression is always true [-Wsign-compare]
sv.c:936:7: warning: comparison of 0 <= unsigned expression is always true [-Wsign-compare]
sv.c:954:17: warning: comparison of 0 <= unsigned expression is always true [-Wsign-compare]
sv.c:958:17: warning: comparison of 0 <= unsigned expression is always true [-Wsign-compare]
sv.c:970:17: warning: comparison of 0 <= unsigned expression is always true [-Wsign-compare]
sv.c:974:17: warning: comparison of 0 <= unsigned expression is always true [-Wsign-compare]
sv.c:2786:3: warning: expression result unused [-Wunused-value]
sv.c:3235:14: warning: expression result unused [-Wunused-value]
sv.c:3244:13: warning: expression result unused [-Wunused-value]
sv.c:3254:13: warning: expression result unused [-Wunused-value]
sv.c:3259:13: warning: expression result unused [-Wunused-value]
sv.c:3625:6: warning: expression result unused [-Wunused-value]
sv.c:3950:6: warning: expression result unused [-Wunused-value]
sv.c:3952:6: warning: expression result unused [-Wunused-value]
sv.c:3966:13: warning: expression result unused [-Wunused-value]
sv.c:4097:13: warning: expression result unused [-Wunused-value]
sv.c:4337:5: warning: expression result unused [-Wunused-value]
sv.c:4387:5: warning: expression result unused [-Wunused-value]
sv.c:4389:5: warning: expression result unused [-Wunused-value]
sv.c:4442:5: warning: expression result unused [-Wunused-value]
sv.c:4608:6: warning: expression result unused [-Wunused-value]
sv.c:4711:6: warning: expression result unused [-Wunused-value]
sv.c:4780:5: warning: expression result unused [-Wunused-value]
sv.c:4875:5: warning: expression result unused [-Wunused-value]
sv.c:4927:2: warning: expression result unused [-Wunused-value]
sv.c:4959:5: warning: expression result unused [-Wunused-value]
sv.c:5503:2: warning: expression result unused [-Wunused-value]
sv.c:5500:5: warning: expression result unused [-Wunused-value]
sv.c:7162:6: warning: expression result unused [-Wunused-value]
sv.c:7198:6: warning: expression result unused [-Wunused-value]
sv.c:7233:2: warning: expression result unused [-Wunused-value]
sv.c:7002:5: warning: expression result unused [-Wunused-value]
sv.c:7493:5: warning: expression result unused [-Wunused-value]
sv.c:8473:6: warning: expression result unused [-Wunused-value]
sv.c:8474:6: warning: expression result unused [-Wunused-value]
sv.c:8843:5: warning: expression result unused [-Wunused-value]
sv.c:10368:6: warning: expression result unused [-Wunused-value]
sv.c:10406:2: warning: expression result unused [-Wunused-value]
sv.c:12649:6: warning: expression result unused [-Wunused-value]
pp.c:1599:3: warning: expression result unused [-Wunused-value]
pp.c:1589:2: warning: expression result unused [-Wunused-value]
pp.c:3256:7: warning: expression result unused [-Wunused-value]
pp.c:3261:7: warning: expression result unused [-Wunused-value]
pp.c:3498:2: warning: expression result unused [-Wunused-value]
pp.c:3520:6: warning: expression result unused [-Wunused-value]
pp.c:3495:5: warning: expression result unused [-Wunused-value]
pp.c:3508:5: warning: expression result unused [-Wunused-value]
pp.c:3875:2: warning: expression result unused [-Wunused-value]
pp.c:4013:2: warning: expression result unused [-Wunused-value]
pp.c:4098:4: warning: expression result unused [-Wunused-value]
pp.c:4150:8: warning: expression result unused [-Wunused-value]
pp.c:4279:2: warning: expression result unused [-Wunused-value]
pp.c:4396:4: warning: expression result unused [-Wunused-value]
pp.c:4459:2: warning: expression result unused [-Wunused-value]
pp.c:4460:2: warning: expression result unused [-Wunused-value]
pp_ctl.c:270:2: warning: expression result unused [-Wunused-value]
pp_ctl.c:353:2: warning: expression result unused [-Wunused-value]
pp_ctl.c:365:8: warning: expression result unused [-Wunused-value]
pp_ctl.c:868:7: warning: expression result unused [-Wunused-value]
pp_ctl.c:934:3: warning: expression result unused [-Wunused-value]
pp_ctl.c:506:5: warning: expression result unused [-Wunused-value]
pp_ctl.c:1256:6: warning: expression result unused [-Wunused-value]
pp_ctl.c:1597:7: warning: expression result unused [-Wunused-value]
pp_ctl.c:2012:3: warning: expression result unused [-Wunused-value]
pp_ctl.c:2027:6: warning: expression result unused [-Wunused-value]
pp_ctl.c:4057:5: warning: expression result unused [-Wunused-value]
pp_ctl.c:4879:2: warning: expression result unused [-Wunused-value]
pp_ctl.c:4991:5: warning: expression result unused [-Wunused-value]
pp_sys.c:426:2: warning: expression result unused [-Wunused-value]
pp_sys.c:463:2: warning: expression result unused [-Wunused-value]
pp_sys.c:1025:6: warning: expression result unused [-Wunused-value]
pp_sys.c:1239:6: warning: expression result unused [-Wunused-value]
pp_sys.c:1697:2: warning: expression result unused [-Wunused-value]
doop.c:696:3: warning: expression result unused [-Wunused-value]
doop.c:701:2: warning: expression result unused [-Wunused-value]
doop.c:691:5: warning: expression result unused [-Wunused-value]
doop.c:1231:2: warning: expression result unused [-Wunused-value]
doio.c:633:17: warning: expression result unused [-Wunused-value]
doio.c:637:17: warning: expression result unused [-Wunused-value]
doio.c:2088:6: warning: expression result unused [-Wunused-value]
doio.c:2194:5: warning: expression result unused [-Wunused-value]
doio.c:2302:2: warning: expression result unused [-Wunused-value]
regexec.c:3904:19: warning: expression result unused [-Wunused-value]
regexec.c:5134:3: warning: expression result unused [-Wunused-value]
perlio.c:5345:21: warning: comparison of integers of different signs: 'size_t' (aka 'unsigned long') and 'int' [-Wsign-compare]
pp_pack.c:2409:5: warning: expression result unused [-Wunused-value]
op.c:3668:6: warning: expression result unused [-Wunused-value]
op.c:4731:5: warning: expression result unused [-Wunused-value]
op.c:4787:5: warning: expression result unused [-Wunused-value]
op.c:5246:5: warning: expression result unused [-Wunused-value]
op.c:7082:5: warning: expression result unused [-Wunused-value]
op.c:8610:4: warning: expression result unused [-Wunused-value]
perl.c:365:6: warning: expression result unused [-Wunused-value]
perl.c:259:5: warning: expression result unused [-Wunused-value]
perl.c:260:5: warning: expression result unused [-Wunused-value]
perl.c:267:5: warning: expression result unused [-Wunused-value]
perl.c:268:5: warning: expression result unused [-Wunused-value]
perl.c:1752:5: warning: expression result unused [-Wunused-value]
perl.c:2960:8: warning: expression result unused [-Wunused-value]
Bzip2.xs:326:5: warning: expression result unused [-Wunused-value]
Zlib.xs:593:5: warning: expression result unused [-Wunused-value]
Dumper.xs:239:2: warning: expression result unused [-Wunused-value]
Dumper.xs:646:4: warning: expression result unused [-Wunused-value]
Dumper.xs:813:37: warning: conversion specifies type 'long' but the argument has type 'U32' (aka 'unsigned int') [-Wformat]
DProf.xs:357:2: warning: expression result unused [-Wunused-value]
Unicode.xs:166:6: warning: expression result unused [-Wunused-value]
Unicode.xs:320:6: warning: expression result unused [-Wunused-value]
Unicode.xs:312:5: warning: expression result unused [-Wunused-value]
./const-c.inc:33:2: warning: expression result unused [-Wunused-value]
./const-c.inc:67:5: warning: expression result unused [-Wunused-value]
Call.xs:62:58: warning: conversion specifies type 'int' but the argument has type 'STRLEN' (aka 'unsigned long') [-Wformat]
Call.xs:62:78: warning: conversion specifies type 'int' but the argument has type 'STRLEN' (aka 'unsigned long') [-Wformat]
Call.xs:99:53: warning: conversion specifies type 'int' but the argument has type 'STRLEN' (aka 'unsigned long') [-Wformat]
Call.xs:155:46: warning: conversion specifies type 'int' but the argument has type 'STRLEN' (aka 'unsigned long') [-Wformat]
Call.xs:174:57: warning: conversion specifies type 'int' but the argument has type 'STRLEN' (aka 'unsigned long') [-Wformat]
Util.xs:40:17: warning: expression result unused [-Wunused-value]
Util.xs:43:17: warning: expression result unused [-Wunused-value]
Util.xs:103:9: warning: expression result unused [-Wunused-value]
FieldHash.xs:128:20: warning: using the result of an assignment as a condition without parentheses [-Wparentheses]
FieldHash.xs:131:13: warning: expression result unused [-Wunused-value]
FieldHash.xs:136:9: warning: expression result unused [-Wunused-value]
FieldHash.xs:157:5: warning: expression result unused [-Wunused-value]
FieldHash.xs:165:13: warning: using the result of an assignment as a condition without parentheses [-Wparentheses]
FieldHash.xs:193:5: warning: expression result unused [-Wunused-value]
FieldHash.xs:216:26: warning: using the result of an assignment as a condition without parentheses [-Wparentheses]
FieldHash.xs:285:16: warning: using the result of an assignment as a condition without parentheses [-Wparentheses]
FieldHash.xs:293:17: warning: using the result of an assignment as a condition without parentheses [-Wparentheses]
FieldHash.xs:294:13: warning: expression result unused [-Wunused-value]
FieldHash.xs:291:9: warning: expression result unused [-Wunused-value]
FieldHash.xs:310:15: warning: using the result of an assignment as a condition without parentheses [-Wparentheses]
FieldHash.xs:331:9: warning: expression result unused [-Wunused-value]
FieldHash.xs:438:24: warning: using the result of an assignment as a condition without parentheses [-Wparentheses]
IO.xs:229:6: warning: expression result unused [-Wunused-value]
SysV.xs:364:5: warning: expression result unused [-Wunused-value]
Base64.xs:370:8: warning: expression result unused [-Wunused-value]
FastCalc.xs:460:5: warning: expression result unused [-Wunused-value]
FastCalc.xs:500:5: warning: expression result unused [-Wunused-value]
FastCalc.xs:501:5: warning: expression result unused [-Wunused-value]
No such file or directoryOpcode.xs:55:2: warning: expression result unused [-Wunused-value]
Opcode.xs:273:9: warning: expression result unused [-Wunused-value]
Opcode.xs:274:9: warning: expression result unused [-Wunused-value]
POSIX.xs:1121:3: warning: expression result unused [-Wunused-value]
POSIX.xs:1124:3: warning: expression result unused [-Wunused-value]
POSIX.xs:1128:3: warning: expression result unused [-Wunused-value]
POSIX.xs:1132:3: warning: expression result unused [-Wunused-value]
POSIX.xs:1135:3: warning: expression result unused [-Wunused-value]
POSIX.xs:1138:3: warning: expression result unused [-Wunused-value]
POSIX.xs:1142:3: warning: expression result unused [-Wunused-value]
POSIX.xs:1147:3: warning: expression result unused [-Wunused-value]
POSIX.xs:1151:3: warning: expression result unused [-Wunused-value]
POSIX.xs:1154:3: warning: expression result unused [-Wunused-value]
POSIX.xs:1158:3: warning: expression result unused [-Wunused-value]
POSIX.xs:1161:3: warning: expression result unused [-Wunused-value]
POSIX.xs:1164:3: warning: expression result unused [-Wunused-value]
POSIX.xs:1167:3: warning: expression result unused [-Wunused-value]
POSIX.xs:1170:3: warning: expression result unused [-Wunused-value]
POSIX.xs:1173:3: warning: expression result unused [-Wunused-value]
POSIX.xs:1176:3: warning: expression result unused [-Wunused-value]
POSIX.xs:1179:3: warning: expression result unused [-Wunused-value]
POSIX.xs:1665:2: warning: expression result unused [-Wunused-value]
POSIX.xs:1784:15: warning: expression result unused [-Wunused-value]
scalar.xs:47:5: warning: expression result unused [-Wunused-value]
via.xs:96:7: warning: expression result unused [-Wunused-value]
Storable.xs:1840:3: warning: expression result unused [-Wunused-value]
Storable.xs:4140:2: warning: null passed to a callee which requires a non-null argument [-Wnonnull]
Storable.xs:4571:2: warning: expression result unused [-Wunused-value]
Storable.xs:4874:3: warning: expression result unused [-Wunused-value]
Storable.xs:5448:3: warning: expression result unused [-Wunused-value]
Storable.xs:5493:2: warning: expression result unused [-Wunused-value]
Storable.xs:5532:2: warning: null passed to a callee which requires a non-null argument [-Wnonnull]
Storable.xs:5594:2: warning: null passed to a callee which requires a non-null argument [-Wnonnull]
Storable.xs:5905:4: warning: expression result unused [-Wunused-value]
Storable.xs:5946:3: warning: expression result unused [-Wunused-value]
Storable.xs:6105:5: warning: expression result unused [-Wunused-value]
HiRes.xs:768:5: warning: expression result unused [-Wunused-value]
HiRes.xs:769:5: warning: expression result unused [-Wunused-value]
APItest.xs:81:5: warning: expression result unused [-Wunused-value]
APItest.xs:82:5: warning: expression result unused [-Wunused-value]
APItest.xs:95:5: warning: expression result unused [-Wunused-value]
APItest.xs:531:2: warning: expression result unused [-Wunused-value]
APItest.xs:823:2: warning: expression result unused [-Wunused-value]
APItest.xs:930:2: warning: 'Perl_pmflag' is deprecated [-Wdeprecated-declarations]
KeywordRPN.xs:207:3: warning: expression result unused [-Wunused-value]
Typemap.xs:87:3: warning: expression result unused [-Wunused-value]
mro.xs:117:7: warning: expression result unused [-Wunused-value]
re_exec.c:3904:19: warning: expression result unused [-Wunused-value]
re_exec.c:5134:3: warning: expression result unused [-Wunused-value]
re_comp.c:3368:5: warning: expression result unused [-Wunused-value]
ExtTest.xs:39:2: warning: expression result unused [-Wunused-value]
ExtTest.xs:73:5: warning: expression result unused [-Wunused-value]
pp_hot.c:170:3: warning: result of comparison against a string literal is unspecified (use strncmp instead)
pp_hot.c:729:2: warning: result of comparison against a string literal is unspecified (use strncmp instead)
pp_hot.c:1550:6: warning: result of comparison against a string literal is unspecified (use strncmp instead)
pp_hot.c:1885:5: warning: result of comparison against a string literal is unspecified (use strncmp instead)
pp_hot.c:2372:5: warning: result of comparison against a string literal is unspecified (use strncmp instead)
pp_hot.c:2379:2: warning: result of comparison against a string literal is unspecified (use strncmp instead)
pp.c:5117:2: warning: result of comparison against a string literal is unspecified (use strncmp instead)
pp.c:5313:2: warning: result of comparison against a string literal is unspecified (use strncmp instead)
pp.c:5362:2: warning: result of comparison against a string literal is unspecified (use strncmp instead)
pp.c:5927:6: warning: result of comparison against a string literal is unspecified (use strncmp instead)
pp_ctl.c:1108:5: warning: result of comparison against a string literal is unspecified (use strncmp instead)
pp_ctl.c:1114:2: warning: result of comparison against a string literal is unspecified (use strncmp instead)
pp_ctl.c:2098:5: warning: result of comparison against a string literal is unspecified (use strncmp instead)
pp_ctl.c:2099:5: warning: result of comparison against a string literal is unspecified (use strncmp instead)
pp_ctl.c:2995:5: warning: result of comparison against a string literal is unspecified (use strncmp instead)
pp_ctl.c:3135:2: warning: result of comparison against a string literal is unspecified (use strncmp instead)
pp_ctl.c:3344:3: warning: result of comparison against a string literal is unspecified (use strncmp instead)
pp_ctl.c:3500:7: warning: result of comparison against a string literal is unspecified (use strncmp instead)
pp_ctl.c:3899:2: warning: result of comparison against a string literal is unspecified (use strncmp instead)
pp_ctl.c:3922:5: warning: result of comparison against a string literal is unspecified (use strncmp instead)
pp_ctl.c:4004:5: warning: result of comparison against a string literal is unspecified (use strncmp instead)
pp_ctl.c:4043:5: warning: result of comparison against a string literal is unspecified (use strncmp instead)
pp_ctl.c:4090:5: warning: result of comparison against a string literal is unspecified (use strncmp instead)
pp_ctl.c:4189:3: warning: result of comparison against a string literal is unspecified (use strncmp instead)
pp_ctl.c:4221:3: warning: result of comparison against a string literal is unspecified (use strncmp instead)
pp_ctl.c:4243:6: warning: result of comparison against a string literal is unspecified (use strncmp instead)
pp_ctl.c:4614:5: warning: result of comparison against a string literal is unspecified (use strncmp instead)
pp_ctl.c:5025:2: warning: result of comparison against a string literal is unspecified (use strncmp instead)
pp_sys.c:327:6: warning: result of comparison against a string literal is unspecified (use strncmp instead)
pp_sys.c:392:5: warning: result of comparison against a string literal is unspecified (use strncmp instead)
pp_sys.c:539:6: warning: result of comparison against a string literal is unspecified (use strncmp instead)
pp_sys.c:579:3: warning: result of comparison against a string literal is unspecified (use strncmp instead)
pp_sys.c:670:2: warning: result of comparison against a string literal is unspecified (use strncmp instead)
pp_sys.c:745:6: warning: result of comparison against a string literal is unspecified (use strncmp instead)
pp_sys.c:866:5: warning: result of comparison against a string literal is unspecified (use strncmp instead)
pp_sys.c:895:9: warning: result of comparison against a string literal is unspecified (use strncmp instead)
pp_sys.c:4537:17: warning: conversion specifies type 'double' but the argument has type 'Time64_T' (aka 'long double') [-Wformat]
pp_sys.c:4542:17: warning: conversion specifies type 'double' but the argument has type 'Time64_T' (aka 'long double') [-Wformat]
pad.c:134:26: warning: unused parameter 's' [-Wunused-parameter]
pp_sys.c:1632:10: warning: passing 'int *' to parameter of type 'socklen_t *' (aka 'unsigned int *') converts between pointers to integer types with different sign [-Wpointer-sign]
pp_sys.c:2608:10: warning: passing 'int *' to parameter of type 'socklen_t *' (aka 'unsigned int *') converts between pointers to integer types with different sign [-Wpointer-sign]
pp_sys.c:2711:6: warning: passing 'int *' to parameter of type 'socklen_t *' (aka 'unsigned int *') converts between pointers to integer types with different sign [-Wpointer-sign]
pp_sys.c:2787:6: warning: passing 'int *' to parameter of type 'socklen_t *' (aka 'unsigned int *') converts between pointers to integer types with different sign [-Wpointer-sign]
pp_sys.c:2791:6: warning: passing 'int *' to parameter of type 'socklen_t *' (aka 'unsigned int *') converts between pointers to integer types with different sign [-Wpointer-sign]
doio.c:580:11: warning: passing 'int *' to parameter of type 'socklen_t *' (aka 'unsigned int *') converts between pointers to integer types with different sign [-Wpointer-sign]
regexec.c:2446:2: warning: expression result unused [-Wunused-value]
re_exec.c:2446:2: warning: expression result unused [-Wunused-value]
shared.xs:980:9: warning: expression result unused [-Wunused-value]
-- 
Report by Test::Smoke v1.44 build 1285 running on perl 5.10.1
(Reporter v0.035 / Smoker v0.045)


Thread Previous


nntp.perl.org: Perl Programming lists via nntp and http.
Comments to Ask Bjørn Hansen at ask@perl.org | Group listing | About