develooper Front page | perl.perl5.porters | Postings from August 2011

Smoke [maint-5.12] v5.12.4-22-gfe2b140 FAIL(XF) linux 2.6.38-10-generic [debian] (x86_64/8 cpu)

From:
George Greer
Date:
August 31, 2011 01:22
Subject:
Smoke [maint-5.12] v5.12.4-22-gfe2b140 FAIL(XF) linux 2.6.38-10-generic [debian] (x86_64/8 cpu)
Message ID:
201108310803.p7V831YA030200@m-l.org
Smoke logs available at http://m-l.org/~perl/smoke/perl/

Automated smoke report for 5.12.4 patch fe2b14024013434281bd9a6383f9d4d84312b355 v5.12.4-22-gfe2b140
zwei: Intel(R) Core(TM) i7 CPU 920 @ 2.67GHz (GenuineIntel 2668MHz) (x86_64/8 cpu)
    on        linux - 2.6.38-10-generic [debian]
    using     g++ version 4.5.2
    smoketime 13 hours 2 minutes (average 39 minutes 8 seconds)

Summary: FAIL(XF)

O = OK  F = Failure(s), extended report at the bottom
X = Failure(s) under TEST but not under harness
? = still running or test results not (yet) available
Build failures during:       - = unknown or N/A
c = Configure, m = make, M = make (after miniperl), t = make test-prep

v5.12.4-22-gfe2b140  Configuration (common) -Dcc=g++ -O
----------- ---------------------------------------------------------
O O F O O O F O -Uusenm
O O F O X X F X -Uusenm -Accflags=-DPERL_POISON
O O F O O O F O -Uusenm -Duse64bitall
O O F O O O F O -Uusenm -Dusemorebits
O O F O O O F F -Uusenm -Dmad
O O F O O O F O -Uusenm -Duseithreads
X X F X X X F X -Uusenm -Duseithreads -Accflags=-DPERL_POISON
O O F O O O F O -Uusenm -Duseithreads -Duse64bitall
O O F O O O F O -Uusenm -Duseithreads -Dusemorebits
O O F O O O F O -Uusenm -Duseithreads -Dmad
| | | | | +- LC_ALL = en_US.utf8 -DDEBUGGING
| | | | +--- PERLIO = perlio -DDEBUGGING
| | | +----- PERLIO = stdio  -DDEBUGGING
| | +------- LC_ALL = en_US.utf8
| +--------- PERLIO = perlio
+----------- PERLIO = stdio 

Locally applied patches:
    uncommitted-changes
    SMOKEfe2b14024013434281bd9a6383f9d4d84312b355

Failures: (common-args) -Dcc=g++ -O
[minitest] -Uusenm
[minitest] -DDEBUGGING -Uusenm
[minitest] -Uusenm -Accflags=-DPERL_POISON
[minitest] -Uusenm -Duse64bitall
[minitest] -DDEBUGGING -Uusenm -Duse64bitall
[minitest] -Uusenm -Dusemorebits
[minitest] -DDEBUGGING -Uusenm -Dusemorebits
[minitest] -Uusenm -Dmad
[minitest] -DDEBUGGING -Uusenm -Dmad
[minitest] -Uusenm -Duseithreads
[minitest] -DDEBUGGING -Uusenm -Duseithreads
[minitest] -Uusenm -Duseithreads -Accflags=-DPERL_POISON
[minitest] -Uusenm -Duseithreads -Duse64bitall
[minitest] -DDEBUGGING -Uusenm -Duseithreads -Duse64bitall
[minitest] -Uusenm -Duseithreads -Dusemorebits
[minitest] -DDEBUGGING -Uusenm -Duseithreads -Dusemorebits
[minitest] -Uusenm -Duseithreads -Dmad
[minitest] -DDEBUGGING -Uusenm -Duseithreads -Dmad
    t/op/filehandle.................FAILED--no leader found
    t/op/groups.....................FAILED--no leader found

[stdio/perlio/en_US.utf8] -DDEBUGGING -Uusenm -Accflags=-DPERL_POISON
[stdio/perlio/en_US.utf8] -DDEBUGGING -Uusenm -Duseithreads -Accflags=-DPERL_POISON
Inconsistent test results (between TEST and harness):
    ../t/base/cond.t........................FAILED--non-zero wait status: 11

[minitest] -DDEBUGGING -Uusenm -Accflags=-DPERL_POISON
    t/base/lex......................FAILED--non-zero wait status: 11

[en_US.utf8] -DDEBUGGING -Uusenm -Dmad
    ../t/op/runlevel.t..........................................FAILED
        9
    ../lib/warnings.t...........................................FAILED
        244

[stdio] -Uusenm -Duseithreads -Accflags=-DPERL_POISON
Inconsistent test results (between TEST and harness):
    ../t/dist/threads/t/stack_env.t.........FAILED--non-zero wait status: 11
    ../t/dist/Thread-Queue/t/03_peek.t......FAILED--expected 19 tests, saw 13
    ../t/dist/threads-shared/t/clone.t......FAILED--expected 34 tests, saw 4
    ../t/re/regexp_unicode_prop_thr.t.......FAILED--non-zero wait status: 11
    ../t/dist/threads/t/stack.t.............FAILED--expected 18 tests, saw 9
    ../t/dist/threads-shared/t/sv_refs.t....FAILED--expected 21 tests, saw 6
    ../t/dist/threads-shared/t/hv_simple.t..FAILED--expected 16 tests, saw 2
    ../t/cpan/Test-Simple/t/threads.t.......FAILED--expected 6 tests, saw 1
    ../t/re/pat_thr.t.......................FAILED--non-zero wait status: 11
    ../t/op/threads.t.......................FAILED at test 1
    ../ext/Hash-Util-FieldHash/t/04_thread.tFAILED--expected 30 tests, saw 18
    ../t/dist/threads-shared/t/av_refs.t....FAILED--expected 14 tests, saw 3
    ../t/dist/threads/t/join.t..............FAILED--expected 20 tests, saw 1
    ../t/dist/threads-shared/t/utf8.t.......FAILED--non-zero wait status: 11
    ../ext/Hash-Util-FieldHash/t/03_class.t.FAILED--expected 7 tests, saw 2
    ../t/dist/Thread-Queue/t/06_insert.t....FAILED--expected 16 tests, saw 1
    ../t/op/getpid.t........................FAILED--expected 3 tests, saw 1
    ../t/re/pat_psycho_thr.t................FAILED--non-zero wait status: 11
    ../t/dist/threads/t/stress_string.t.....FAILED--expected 61 tests, saw 31
    ../t/dist/threads-shared/t/sv_simple.t..FAILED--expected 11 tests, saw 5
    ../t/dist/threads/t/free2.t.............FAILED--expected 78 tests, saw 31
    ../t/dist/threads/t/thread.t............FAILED--expected 34 tests, saw 2
    ../t/dist/threads-shared/t/shared_attr.tFAILED--expected 101 tests, saw 2
    ../t/cpan/Test-Simple/t/is_deeply_with_threads.tFAILED--non-zero wait status: 11
    ../t/re/substr_thr.t....................FAILED--non-zero wait status: 11
    ../t/dist/threads/t/libc.t..............FAILED--expected 11 tests, saw 1
    ../t/dist/threads/t/basic.t.............FAILED--expected 33 tests, saw 3
    ../t/re/regexp_qr_embed_thr.t...........FAILED--expected 1452 tests, saw 3
    ../t/dist/Thread-Queue/t/01_basic.t.....FAILED--expected 81 tests, saw 31
    ../t/dist/threads-shared/t/hv_refs.t....FAILED--expected 20 tests, saw 3
    ../t/dist/Storable/t/threads.t..........FAILED--expected 2 tests, saw 1
    ../t/dist/threads-shared/t/object.t.....FAILED--expected 28 tests, saw 9
    ../lib/Thread.t.........................FAILED--expected 13 tests, saw 5
    ../t/cpan/Test-Simple/t/diag.t..........FAILED--non-zero wait status: 11
    ../t/dist/threads/t/blocks.t............FAILED--expected 5 tests, saw 0
    ../t/dist/threads-shared/t/av_simple.t..FAILED--expected 44 tests, saw 9
    ../t/dist/threads/t/err.t...............FAILED--expected 10 tests, saw 7
    ../t/dist/Thread-Queue/t/05_extract.t...FAILED--expected 20 tests, saw 7
    ../t/op/reset.t.........................FAILED at test 21
    ../t/cpan/Tie-RefHash/t/threaded.t......FAILED--non-zero wait status: 11
    ../t/dist/threads/t/stress_cv.t.........FAILED--expected 61 tests, saw 31
    ../t/re/pat_special_cc_thr.t............FAILED--non-zero wait status: 11
    ../t/dist/threads/t/exit.t..............FAILED--expected 18 tests, saw 2
    ../t/dist/threads-shared/t/cond.t.......FAILED--expected 32 tests, saw 4
    ../t/re/pat_rt_report_thr.t.............FAILED--non-zero wait status: 11
    ../t/dist/Thread-Queue/t/02_refs.t......FAILED--expected 46 tests, saw 37
    ../t/dist/threads/t/context.t...........FAILED--expected 31 tests, saw 2
    ../ext/XS-APItest/t/my_cxt.t............FAILED--expected 16 tests, saw 13
    ../t/dist/threads-shared/t/blessed.t....FAILED--expected 37 tests, saw 13
    ../t/dist/threads/t/state.t.............FAILED--expected 59 tests, saw 13
    ../t/dist/threads/t/problems.t..........FAILED--expected 15 tests, saw 3
    ../t/dist/threads/t/list.t..............FAILED--expected 15 tests, saw 2
    ../t/dist/threads-shared/t/stress.t.....FAILED--expected 1 tests, saw 0
    ../t/dist/threads/t/end.t...............FAILED--expected 6 tests, saw 2
    ../t/dist/threads-shared/t/wait.t.......FAILED--expected 91 tests, saw 10
    ../t/re/pat_re_eval_thr.t...............FAILED--non-zero wait status: 11
    ../t/dist/threads/t/stress_re.t.........FAILED--expected 61 tests, saw 31
    ../t/dist/threads/t/kill.t..............FAILED--no leader found
    ../t/cpan/Test-Simple/t/overload_threads.tFAILED--non-zero wait status: 11
    ../t/op/index_thr.t.....................FAILED--non-zero wait status: 11
    ../t/dist/threads-shared/t/no_share.t...FAILED--expected 6 tests, saw 4
    ../t/re/pat_advanced_thr.t..............FAILED--non-zero wait status: 11
    ../t/dist/threads-shared/t/waithires.t..FAILED--expected 57 tests, saw 6
    ../t/re/reg_email_thr.t.................FAILED--non-zero wait status: 11
    ../t/dist/threads/t/free.t..............FAILED--expected 29 tests, saw 1

[perlio] -Uusenm -Duseithreads -Accflags=-DPERL_POISON
Inconsistent test results (between TEST and harness):
    ../t/dist/threads/t/stack_env.t.........FAILED--non-zero wait status: 11
    ../t/dist/Thread-Queue/t/03_peek.t......FAILED--expected 19 tests, saw 13
    ../t/dist/threads-shared/t/clone.t......FAILED--expected 34 tests, saw 4
    ../t/re/regexp_unicode_prop_thr.t.......FAILED--non-zero wait status: 11
    ../t/dist/threads/t/stack.t.............FAILED--expected 18 tests, saw 9
    ../t/dist/threads-shared/t/hv_simple.t..FAILED--expected 16 tests, saw 2
    ../t/dist/threads-shared/t/sv_refs.t....FAILED--expected 21 tests, saw 6
    ../t/cpan/Test-Simple/t/threads.t.......FAILED--expected 6 tests, saw 1
    ../t/re/pat_thr.t.......................FAILED--non-zero wait status: 11
    ../t/op/threads.t.......................FAILED at test 1
    ../t/dist/threads-shared/t/av_refs.t....FAILED--expected 14 tests, saw 3
    ../ext/Hash-Util-FieldHash/t/04_thread.tFAILED--expected 30 tests, saw 18
    ../t/dist/threads/t/join.t..............FAILED--expected 20 tests, saw 1
    ../t/dist/threads-shared/t/utf8.t.......FAILED--non-zero wait status: 11
    ../ext/Hash-Util-FieldHash/t/03_class.t.FAILED--expected 7 tests, saw 2
    ../t/dist/Thread-Queue/t/06_insert.t....FAILED--expected 16 tests, saw 1
    ../t/op/getpid.t........................FAILED--expected 3 tests, saw 1
    ../t/re/pat_psycho_thr.t................FAILED--non-zero wait status: 11
    ../t/dist/threads-shared/t/sv_simple.t..FAILED--expected 11 tests, saw 5
    ../t/dist/threads/t/stress_string.t.....FAILED--expected 61 tests, saw 31
    ../t/dist/threads/t/free2.t.............FAILED--expected 78 tests, saw 12
    ../t/dist/threads/t/thread.t............FAILED--expected 34 tests, saw 2
    ../t/dist/threads-shared/t/shared_attr.tFAILED--expected 101 tests, saw 2
    ../t/cpan/Test-Simple/t/is_deeply_with_threads.tFAILED--non-zero wait status: 11
    ../t/re/substr_thr.t....................FAILED--non-zero wait status: 11
    ../t/dist/threads/t/libc.t..............FAILED--expected 11 tests, saw 1
    ../t/dist/threads/t/basic.t.............FAILED--expected 33 tests, saw 3
    ../t/re/regexp_qr_embed_thr.t...........FAILED--expected 1452 tests, saw 3
    ../t/dist/Thread-Queue/t/01_basic.t.....FAILED--expected 81 tests, saw 30
    ../t/dist/threads-shared/t/hv_refs.t....FAILED--expected 20 tests, saw 3
    ../t/dist/Storable/t/threads.t..........FAILED--expected 2 tests, saw 1
    ../t/dist/threads-shared/t/object.t.....FAILED--expected 28 tests, saw 9
    ../lib/Thread.t.........................FAILED--expected 13 tests, saw 5
    ../t/cpan/Test-Simple/t/diag.t..........FAILED--non-zero wait status: 11
    ../t/dist/threads/t/blocks.t............FAILED--expected 5 tests, saw 0
    ../t/dist/threads-shared/t/av_simple.t..FAILED--expected 44 tests, saw 9
    ../t/dist/threads/t/err.t...............FAILED--expected 10 tests, saw 7
    ../t/dist/Thread-Queue/t/05_extract.t...FAILED--expected 20 tests, saw 7
    ../t/op/reset.t.........................FAILED at test 21
    ../t/cpan/Tie-RefHash/t/threaded.t......FAILED--non-zero wait status: 11
    ../t/dist/threads/t/stress_cv.t.........FAILED--expected 61 tests, saw 31
    ../t/re/pat_special_cc_thr.t............FAILED--non-zero wait status: 11
    ../t/dist/threads/t/exit.t..............FAILED--expected 18 tests, saw 2
    ../t/dist/threads-shared/t/cond.t.......FAILED--expected 32 tests, saw 4
    ../t/re/pat_rt_report_thr.t.............FAILED--non-zero wait status: 11
    ../t/dist/Thread-Queue/t/02_refs.t......FAILED--expected 46 tests, saw 37
    ../t/dist/threads/t/context.t...........FAILED--expected 31 tests, saw 2
    ../ext/XS-APItest/t/my_cxt.t............FAILED--expected 16 tests, saw 13
    ../t/dist/threads-shared/t/blessed.t....FAILED--expected 37 tests, saw 13
    ../t/dist/threads/t/state.t.............FAILED--expected 59 tests, saw 13
    ../t/dist/threads/t/problems.t..........FAILED--expected 15 tests, saw 3
    ../t/dist/threads/t/list.t..............FAILED--expected 15 tests, saw 2
    ../t/dist/threads-shared/t/stress.t.....FAILED--expected 1 tests, saw 0
    ../t/dist/threads/t/end.t...............FAILED--expected 6 tests, saw 2
    ../t/dist/threads-shared/t/wait.t.......FAILED--expected 91 tests, saw 10
    ../t/re/pat_re_eval_thr.t...............FAILED--non-zero wait status: 11
    ../t/dist/threads/t/stress_re.t.........FAILED--expected 61 tests, saw 31
    ../t/dist/threads/t/kill.t..............FAILED--no leader found
    ../t/op/index_thr.t.....................FAILED--non-zero wait status: 11
    ../t/cpan/Test-Simple/t/overload_threads.tFAILED--non-zero wait status: 11
    ../t/dist/threads-shared/t/no_share.t...FAILED--expected 6 tests, saw 4
    ../t/re/pat_advanced_thr.t..............FAILED--non-zero wait status: 11
    ../t/dist/threads-shared/t/waithires.t..FAILED--expected 57 tests, saw 6
    ../t/re/reg_email_thr.t.................FAILED--non-zero wait status: 11
    ../t/dist/threads/t/free.t..............FAILED--expected 29 tests, saw 1

[en_US.utf8] -Uusenm -Duseithreads -Accflags=-DPERL_POISON
Inconsistent test results (between TEST and harness):
    ../t/dist/threads/t/stack_env.t.........FAILED--non-zero wait status: 11
    ../t/dist/Thread-Queue/t/03_peek.t......FAILED--expected 19 tests, saw 13
    ../t/dist/threads-shared/t/clone.t......FAILED--expected 34 tests, saw 4
    ../t/re/regexp_unicode_prop_thr.t.......FAILED--non-zero wait status: 11
    ../t/dist/threads/t/stack.t.............FAILED--expected 18 tests, saw 9
    ../t/dist/Thread-Semaphore/t/01_basic.t.FAILED--expected 10 tests, saw 9
    ../t/dist/threads-shared/t/hv_simple.t..FAILED--expected 16 tests, saw 2
    ../t/dist/threads-shared/t/sv_refs.t....FAILED--expected 21 tests, saw 6
    ../t/cpan/Test-Simple/t/threads.t.......FAILED--expected 6 tests, saw 1
    ../t/re/pat_thr.t.......................FAILED--non-zero wait status: 11
    ../t/op/threads.t.......................FAILED at test 1
    ../t/dist/threads-shared/t/av_refs.t....FAILED--expected 14 tests, saw 3
    ../ext/Hash-Util-FieldHash/t/04_thread.tFAILED--expected 30 tests, saw 6
    ../t/dist/threads/t/join.t..............FAILED--expected 20 tests, saw 1
    ../t/dist/threads-shared/t/utf8.t.......FAILED--non-zero wait status: 11
    ../ext/Hash-Util-FieldHash/t/03_class.t.FAILED--expected 7 tests, saw 2
    ../t/dist/Thread-Queue/t/06_insert.t....FAILED--expected 16 tests, saw 1
    ../t/op/getpid.t........................FAILED--expected 3 tests, saw 1
    ../t/re/pat_psycho_thr.t................FAILED--non-zero wait status: 11
    ../t/dist/threads-shared/t/sv_simple.t..FAILED--expected 11 tests, saw 5
    ../t/dist/threads/t/stress_string.t.....FAILED--expected 61 tests, saw 31
    ../t/dist/threads/t/free2.t.............FAILED--expected 78 tests, saw 29
    ../t/dist/threads/t/thread.t............FAILED--expected 34 tests, saw 2
    ../t/dist/threads-shared/t/shared_attr.tFAILED--expected 101 tests, saw 2
    ../t/cpan/Test-Simple/t/is_deeply_with_threads.tFAILED--non-zero wait status: 11
    ../t/re/substr_thr.t....................FAILED--non-zero wait status: 11
    ../t/dist/threads/t/libc.t..............FAILED--expected 11 tests, saw 1
    ../t/dist/threads/t/basic.t.............FAILED--expected 33 tests, saw 3
    ../t/re/regexp_qr_embed_thr.t...........FAILED--expected 1452 tests, saw 3
    ../t/dist/Thread-Queue/t/01_basic.t.....FAILED--expected 81 tests, saw 32
    ../t/dist/threads-shared/t/hv_refs.t....FAILED--expected 20 tests, saw 3
    ../t/dist/Storable/t/threads.t..........FAILED--expected 2 tests, saw 1
    ../t/dist/threads-shared/t/object.t.....FAILED--expected 28 tests, saw 9
    ../lib/Thread.t.........................FAILED--expected 13 tests, saw 5
    ../t/cpan/Test-Simple/t/diag.t..........FAILED--non-zero wait status: 11
    ../t/dist/threads/t/blocks.t............FAILED--expected 5 tests, saw 0
    ../t/dist/threads-shared/t/av_simple.t..FAILED--expected 44 tests, saw 9
    ../t/dist/threads/t/err.t...............FAILED--expected 10 tests, saw 7
    ../t/dist/Thread-Queue/t/05_extract.t...FAILED--expected 20 tests, saw 7
    ../t/op/reset.t.........................FAILED at test 21
    ../t/cpan/Tie-RefHash/t/threaded.t......FAILED--non-zero wait status: 11
    ../t/dist/threads/t/stress_cv.t.........FAILED--expected 61 tests, saw 31
    ../t/re/pat_special_cc_thr.t............FAILED--non-zero wait status: 11
    ../t/dist/threads/t/exit.t..............FAILED--expected 18 tests, saw 2
    ../t/dist/threads-shared/t/cond.t.......FAILED--expected 32 tests, saw 4
    ../t/re/pat_rt_report_thr.t.............FAILED--non-zero wait status: 11
    ../t/dist/Thread-Queue/t/02_refs.t......FAILED--expected 46 tests, saw 37
    ../t/dist/threads/t/context.t...........FAILED--expected 31 tests, saw 2
    ../ext/XS-APItest/t/my_cxt.t............FAILED--expected 16 tests, saw 13
    ../t/dist/threads-shared/t/blessed.t....FAILED--expected 37 tests, saw 13
    ../t/dist/threads/t/state.t.............FAILED--expected 59 tests, saw 13
    ../t/dist/threads/t/problems.t..........FAILED--expected 15 tests, saw 3
    ../t/dist/threads/t/list.t..............FAILED--expected 15 tests, saw 2
    ../t/dist/threads-shared/t/stress.t.....FAILED--expected 1 tests, saw 0
    ../t/dist/threads/t/end.t...............FAILED--expected 6 tests, saw 2
    ../t/dist/threads-shared/t/wait.t.......FAILED--expected 91 tests, saw 10
    ../t/re/pat_re_eval_thr.t...............FAILED--non-zero wait status: 11
    ../t/dist/threads/t/stress_re.t.........FAILED--expected 61 tests, saw 31
    ../t/dist/threads/t/kill.t..............FAILED--expected 18 tests, saw 14
    ../t/op/index_thr.t.....................FAILED--non-zero wait status: 11
    ../t/cpan/Test-Simple/t/overload_threads.tFAILED--non-zero wait status: 11
    ../t/dist/threads-shared/t/no_share.t...FAILED--expected 6 tests, saw 4
    ../t/re/pat_advanced_thr.t..............FAILED--non-zero wait status: 11
    ../t/dist/threads-shared/t/waithires.t..FAILED--expected 57 tests, saw 6
    ../t/re/reg_email_thr.t.................FAILED--non-zero wait status: 11
    ../t/dist/threads/t/free.t..............FAILED--expected 29 tests, saw 1

[minitest] -DDEBUGGING -Uusenm -Duseithreads -Accflags=-DPERL_POISON
    t/base/cond.....................FAILED--non-zero wait status: 11

Compiler messages(gcc):
try.c: In function ‘int main()’:
try.c:36:10: warning: ignoring return value of ‘int pipe(int*)’, declared with attribute warn_unused_result
try.c:37:10: warning: ignoring return value of ‘int pipe(int*)’, declared with attribute warn_unused_result
try.c:53:35: warning: ignoring return value of ‘ssize_t write(int, const void*, size_t)’, declared with attribute warn_unused_result
try.c:66:23: warning: ignoring return value of ‘ssize_t write(int, const void*, size_t)’, declared with attribute warn_unused_result
try.c:72:35: warning: ignoring return value of ‘ssize_t write(int, const void*, size_t)’, declared with attribute warn_unused_result
try.c:78:21: warning: ignoring return value of ‘ssize_t read(int, void*, size_t)’, declared with attribute warn_unused_result
try.c:5737:17: warning: extra tokens at end of #ifdef directive
try.c:5740:18: warning: extra tokens at end of #ifdef directive
try.c:5743:19: warning: extra tokens at end of #ifdef directive
try.c:5746:19: warning: extra tokens at end of #ifdef directive
try.c:5773:17: warning: extra tokens at end of #ifdef directive
try.c:5776:18: warning: extra tokens at end of #ifdef directive
try.c:5779:19: warning: extra tokens at end of #ifdef directive
try.c:5782:19: warning: extra tokens at end of #ifdef directive
try.c:5809:17: warning: extra tokens at end of #ifdef directive
try.c:5812:18: warning: extra tokens at end of #ifdef directive
try.c:5815:19: warning: extra tokens at end of #ifdef directive
try.c:5818:19: warning: extra tokens at end of #ifdef directive
try.c:5845:16: warning: extra tokens at end of #ifdef directive
try.c:5848:17: warning: extra tokens at end of #ifdef directive
try.c:5851:18: warning: extra tokens at end of #ifdef directive
try.c:5854:18: warning: extra tokens at end of #ifdef directive
try.c:5881:18: warning: extra tokens at end of #ifdef directive
try.c:5884:19: warning: extra tokens at end of #ifdef directive
try.c:5887:20: warning: extra tokens at end of #ifdef directive
try.c:5890:20: warning: extra tokens at end of #ifdef directive
try.c:6721:18: warning: extra tokens at end of #ifdef directive
try.c:6724:19: warning: extra tokens at end of #ifdef directive
try.c:6727:20: warning: extra tokens at end of #ifdef directive
try.c:6730:20: warning: extra tokens at end of #ifdef directive
try.c:6757:18: warning: extra tokens at end of #ifdef directive
try.c:6760:19: warning: extra tokens at end of #ifdef directive
try.c:6763:20: warning: extra tokens at end of #ifdef directive
try.c:6766:20: warning: extra tokens at end of #ifdef directive
try.c:6793:18: warning: extra tokens at end of #ifdef directive
try.c:6796:19: warning: extra tokens at end of #ifdef directive
try.c:6799:20: warning: extra tokens at end of #ifdef directive
try.c:6802:20: warning: extra tokens at end of #ifdef directive
try.c:6829:17: warning: extra tokens at end of #ifdef directive
try.c:6832:18: warning: extra tokens at end of #ifdef directive
try.c:6835:19: warning: extra tokens at end of #ifdef directive
try.c:6838:19: warning: extra tokens at end of #ifdef directive
try.c:6865:19: warning: extra tokens at end of #ifdef directive
try.c:6868:20: warning: extra tokens at end of #ifdef directive
try.c:6871:21: warning: extra tokens at end of #ifdef directive
try.c:6874:21: warning: extra tokens at end of #ifdef directive
util.c: In function ‘char* S_write_no_mem()’:
util.c:68:34: warning: ignoring return value of ‘ssize_t write(int, const void*, size_t)’, declared with attribute warn_unused_result
sv.c: In function ‘void Perl_sv_vcatpvfn(SV*, const char*, STRLEN, __va_list_tag (*)[1], SV**, I32, bool*)’:
sv.c:9422:41: warning: ignoring return value of ‘char* gcvt(double, int, char*)’, declared with attribute warn_unused_result
sv.c:10227:53: warning: ignoring return value of ‘char* gcvt(double, int, char*)’, declared with attribute warn_unused_result
sv.c: In function ‘char* Perl_sv_2pv_flags(SV*, STRLEN*, I32)’:
sv.c:2772:39: warning: ignoring return value of ‘char* gcvt(double, int, char*)’, declared with attribute warn_unused_result
sv.c:2965:39: warning: ignoring return value of ‘char* gcvt(double, int, char*)’, declared with attribute warn_unused_result
doio.c: In function ‘void S_exec_failed(const char*, int, int)’:
doio.c:1380:43: warning: ignoring return value of ‘ssize_t write(int, const void*, size_t)’, declared with attribute warn_unused_result
doio.c: In function ‘PerlIOl** Perl_nextargv(GV*)’:
doio.c:870:46: warning: ignoring return value of ‘int fchown(int, __uid_t, __gid_t)’, declared with attribute warn_unused_result
utf8.c: In function ‘STRLEN Perl_utf8_length(const U8*, const U8*)’:
utf8.c:742:55: warning: format not a string literal and no format arguments
perlio.c: In function ‘void S_more_refcounted_fds(int)’:
perlio.c:2302:38: warning: ignoring return value of ‘ssize_t write(int, const void*, size_t)’, declared with attribute warn_unused_result
perlio.c: In function ‘void PerlIO_debug(const char*, ...)’:
perlio.c:517:43: warning: ignoring return value of ‘ssize_t write(int, const void*, size_t)’, declared with attribute warn_unused_result
pp_pack.c: In function ‘I32 S_unpack_rec(tempsym*, const char*, const char*, const char*, const char**)’:
pp_pack.c:1228:9: warning: ‘sv’ may be used uninitialized in this function
pp_pack.c:1561:12: warning: ‘str’ may be used uninitialized in this function
Dumper.xs: In function ‘I32 DD_dump(SV*, const char*, STRLEN, SV*, HV*, AV*, I32*, I32, SV*, SV*, SV*, SV*, SV*, SV*, SV*, I32, I32, I32, SV*, I32, SV*)’:
Dumper.xs:813:49: warning: format ‘%ld’ expects type ‘long int’, but argument 2 has type ‘U32’
MD5.xs: In function ‘void XS_Digest__MD5_md5(CV*)’:
MD5.xs:702:17: warning: deprecated conversion from string constant to ‘char*’
MD5.xs:704:10: warning: deprecated conversion from string constant to ‘char*’
MD5.xs:710:13: warning: deprecated conversion from string constant to ‘char*’
MD5.xs:715:17: warning: deprecated conversion from string constant to ‘char*’
Call.xs: In function ‘I32 filter_call(int, SV*, int)’:
Call.xs:63:58: warning: format ‘%d’ expects type ‘int’, but argument 3 has type ‘STRLEN’
Call.xs:63:58: warning: format ‘%d’ expects type ‘int’, but argument 5 has type ‘STRLEN’
Call.xs:100:41: warning: format ‘%d’ expects type ‘int’, but argument 4 has type ‘STRLEN’
Call.xs:156:38: warning: format ‘%d’ expects type ‘int’, but argument 3 has type ‘STRLEN’
Call.xs:175:51: warning: format ‘%d’ expects type ‘int’, but argument 4 has type ‘long unsigned int’
Base64.xs: In function ‘void XS_MIME__Base64_encode_base64(CV*)’:
Base64.xs:140:12: warning: deprecated conversion from string constant to ‘char*’
Base64.xs: In function ‘void XS_MIME__QuotedPrint_encode_qp(CV*)’:
Base64.xs:292:12: warning: deprecated conversion from string constant to ‘char*’
sdbm.c: In function ‘int makroom(DBM*, long int, int)’:
sdbm.c:371:70: warning: ignoring return value of ‘ssize_t write(int, const void*, size_t)’, declared with attribute warn_unused_result
APItest.xs: In function ‘void XS_XS__APItest_pmflag(CV*)’:
APItest.xs:930:2: warning: ‘void Perl_pmflag(U32*, int)’ is deprecated (declared at ../../proto.h:2621)
APItest.xs:930:22: warning: ‘void Perl_pmflag(U32*, int)’ is deprecated (declared at ../../proto.h:2621)
KeywordRPN.xs: In function ‘OP* THX_parse_keyword_stufftest()’:
KeywordRPN.xs:169:38: warning: deprecated conversion from string constant to ‘char*’
sv.c:10227:53: warning: ignoring return value of ‘char* qgcvt(long double, int, char*)’, declared with attribute warn_unused_result
sv.c:2772:39: warning: ignoring return value of ‘char* qgcvt(long double, int, char*)’, declared with attribute warn_unused_result
sv.c:2965:39: warning: ignoring return value of ‘char* qgcvt(long double, int, char*)’, declared with attribute warn_unused_result
pp_sys.c: In function ‘OP* Perl_pp_gmtime()’:
pp_sys.c:4537:44: warning: format ‘%.0f’ expects type ‘double’, but argument 4 has type ‘Time64_T’
pp_sys.c:4542:44: warning: format ‘%.0f’ expects type ‘double’, but argument 4 has type ‘Time64_T’
util.c: In function ‘char* S_write_no_mem(PerlInterpreter*)’:
sv.c: In function ‘void Perl_sv_vcatpvfn(PerlInterpreter*, SV*, const char*, STRLEN, __va_list_tag (*)[1], SV**, I32, bool*)’:
sv.c: In function ‘char* Perl_sv_2pv_flags(PerlInterpreter*, SV*, STRLEN*, I32)’:
doio.c: In function ‘void S_exec_failed(PerlInterpreter*, const char*, int, int)’:
doio.c: In function ‘PerlIOl** Perl_nextargv(PerlInterpreter*, GV*)’:
utf8.c: In function ‘STRLEN Perl_utf8_length(PerlInterpreter*, const U8*, const U8*)’:
perlio.c: In function ‘void S_more_refcounted_fds(PerlInterpreter*, int)’:
perlio.c:508:56: warning: ignoring return value of ‘ssize_t write(int, const void*, size_t)’, declared with attribute warn_unused_result
pp_pack.c: In function ‘I32 S_unpack_rec(PerlInterpreter*, tempsym*, const char*, const char*, const char*, const char**)’:
perl.c: In function ‘void S_init_tls_and_interp(PerlInterpreter*)’:
perl.c:107:2: warning: ignoring return value of ‘ssize_t write(int, const void*, size_t)’, declared with attribute warn_unused_result
Dumper.xs: In function ‘I32 DD_dump(PerlInterpreter*, SV*, const char*, STRLEN, SV*, HV*, AV*, I32*, I32, SV*, SV*, SV*, SV*, SV*, SV*, SV*, I32, I32, I32, SV*, I32, SV*)’:
MD5.xs: In function ‘void XS_Digest__MD5_md5(PerlInterpreter*, CV*)’:
Call.xs: In function ‘I32 filter_call(PerlInterpreter*, int, SV*, int)’:
Base64.xs: In function ‘void XS_MIME__Base64_encode_base64(PerlInterpreter*, CV*)’:
Base64.xs: In function ‘void XS_MIME__QuotedPrint_encode_qp(PerlInterpreter*, CV*)’:
APItest.xs: In function ‘void XS_XS__APItest_pmflag(PerlInterpreter*, CV*)’:
APItest.xs:930:2: warning: ‘void Perl_pmflag(PerlInterpreter*, U32*, int)’ is deprecated (declared at ../../proto.h:2621)
KeywordRPN.xs: In function ‘OP* THX_parse_keyword_stufftest(PerlInterpreter*)’:
KeywordRPN.xs:169:15: warning: deprecated conversion from string constant to ‘char*’
threads.xs: In function ‘ithread* S_ithread_create(PerlInterpreter*, SV*, IV, int, int, SV*)’:
threads.xs:701:83: warning: ignoring return value of ‘ssize_t write(int, const void*, size_t)’, declared with attribute warn_unused_result
shared.xs: In function ‘user_lock* S_get_userlock(PerlInterpreter*, SV*, bool)’:
shared.xs:345:5: warning: deprecated conversion from string constant to ‘char*’
shared.xs: In function ‘void S_sharedsv_dec(PerlInterpreter*, SV*)’:
shared.xs:518:5: warning: deprecated conversion from string constant to ‘char*’
shared.xs: In function ‘void Perl_sharedsv_share(PerlInterpreter*, SV*)’:
shared.xs:547:9: warning: deprecated conversion from string constant to ‘char*’
shared.xs: In function ‘int sharedsv_scalar_mg_get(PerlInterpreter*, SV*, MAGIC*)’:
shared.xs:713:5: warning: deprecated conversion from string constant to ‘char*’
shared.xs: In function ‘int sharedsv_scalar_mg_set(PerlInterpreter*, SV*, MAGIC*)’:
shared.xs:791:5: warning: deprecated conversion from string constant to ‘char*’
shared.xs: In function ‘int sharedsv_scalar_mg_local(PerlInterpreter*, SV*, MAGIC*)’:
shared.xs:832:9: warning: deprecated conversion from string constant to ‘char*’
shared.xs: In function ‘int sharedsv_elem_mg_FETCH(PerlInterpreter*, SV*, MAGIC*)’:
shared.xs:869:5: warning: deprecated conversion from string constant to ‘char*’
shared.xs: In function ‘int sharedsv_elem_mg_STORE(PerlInterpreter*, SV*, MAGIC*)’:
shared.xs:924:5: warning: deprecated conversion from string constant to ‘char*’
shared.xs: In function ‘int sharedsv_elem_mg_DELETE(PerlInterpreter*, SV*, MAGIC*)’:
shared.xs:960:5: warning: deprecated conversion from string constant to ‘char*’
shared.xs: In function ‘U32 sharedsv_array_mg_FETCHSIZE(PerlInterpreter*, SV*, MAGIC*)’:
shared.xs:1021:5: warning: deprecated conversion from string constant to ‘char*’
shared.xs: In function ‘int sharedsv_array_mg_CLEAR(PerlInterpreter*, SV*, MAGIC*)’:
shared.xs:1039:5: warning: deprecated conversion from string constant to ‘char*’
shared.xs: In function ‘void Perl_sharedsv_lock(PerlInterpreter*, SV*)’:
shared.xs:1125:63: warning: deprecated conversion from string constant to ‘char*’
shared.xs: In function ‘void XS_threads__shared__tie_PUSH(PerlInterpreter*, CV*)’:
shared.xs:1197:13: warning: deprecated conversion from string constant to ‘char*’
shared.xs: In function ‘void XS_threads__shared__tie_UNSHIFT(PerlInterpreter*, CV*)’:
shared.xs:1214:9: warning: deprecated conversion from string constant to ‘char*’
shared.xs: In function ‘void XS_threads__shared__tie_POP(PerlInterpreter*, CV*)’:
shared.xs:1237:9: warning: deprecated conversion from string constant to ‘char*’
shared.xs: In function ‘void XS_threads__shared__tie_SHIFT(PerlInterpreter*, CV*)’:
shared.xs:1254:9: warning: deprecated conversion from string constant to ‘char*’
shared.xs: In function ‘void XS_threads__shared__tie_EXTEND(PerlInterpreter*, CV*)’:
shared.xs:1270:9: warning: deprecated conversion from string constant to ‘char*’
shared.xs: In function ‘void XS_threads__shared__tie_STORESIZE(PerlInterpreter*, CV*)’:
shared.xs:1280:9: warning: deprecated conversion from string constant to ‘char*’
shared.xs: In function ‘void XS_threads__shared__tie_EXISTS(PerlInterpreter*, CV*)’:
shared.xs:1292:13: warning: deprecated conversion from string constant to ‘char*’
shared.xs:1302:13: warning: deprecated conversion from string constant to ‘char*’
shared.xs: In function ‘void XS_threads__shared__tie_FIRSTKEY(PerlInterpreter*, CV*)’:
shared.xs:1318:9: warning: deprecated conversion from string constant to ‘char*’
shared.xs: In function ‘void XS_threads__shared__tie_NEXTKEY(PerlInterpreter*, CV*)’:
shared.xs:1346:9: warning: deprecated conversion from string constant to ‘char*’
shared.xs: In function ‘void XS_threads__shared_bless(PerlInterpreter*, CV*)’:
shared.xs:1606:13: warning: deprecated conversion from string constant to ‘char*’
pp_sys.c: In function ‘OP* Perl_pp_gmtime(PerlInterpreter*)’:
pp_sys.c:4537:44: warning: format ‘%.0f’ expects type ‘double’, but argument 5 has type ‘Time64_T’
pp_sys.c:4542:44: warning: format ‘%.0f’ expects type ‘double’, but argument 5 has type ‘Time64_T’
-- 
Report by Test::Smoke v1.44 build 1285 running on perl 5.10.1
(Reporter v0.035 / Smoker v0.045)




nntp.perl.org: Perl Programming lists via nntp and http.
Comments to Ask Bjørn Hansen at ask@perl.org | Group listing | About