develooper Front page | perl.perl5.porters | Postings from August 2011

Smoke [blead] v5.15.2-134-g94ec06b FAIL(F) MSWin32 Win2000 SP4 (x86/1 cpu)

From:
George Greer
Date:
August 27, 2011 01:58
Subject:
Smoke [blead] v5.15.2-134-g94ec06b FAIL(F) MSWin32 Win2000 SP4 (x86/1 cpu)
Message ID:
201108270858.p7R8w2TZ019587@m-l.org
Smoke logs available at http://m-l.org/~perl/smoke/perl/

Automated smoke report for 5.15.2 patch 94ec06bc74ba3a61d5daddf3adeaa53459960136 v5.15.2-134-g94ec06b
perl-win2k: Intel(R) Core(TM) i7 CPU 920 @ 2.67GHz(~2672 MHz) (x86/1 cpu)
    on        MSWin32 - Win2000 SP4
    using     cl version 14.00.50727.762
    smoketime 3 hours 46 minutes (average 56 minutes 33 seconds)

Summary: FAIL(F)

O = OK  F = Failure(s), extended report at the bottom
X = Failure(s) under TEST but not under harness
? = still running or test results not (yet) available
Build failures during:       - = unknown or N/A
c = Configure, m = make, M = make (after miniperl), t = make test-prep

v5.15.2-134-g94ec06b  Configuration (common) none
----------- ---------------------------------------------------------
F F         
F F         -Duseithreads
| +--------- -DDEBUGGING
+----------- no debugging


Locally applied patches:
    uncommitted-changes
    SMOKE94ec06bc74ba3a61d5daddf3adeaa53459960136

Failures: (common-args) none
[default] 
../t/op/alarm.t.............................................FAILED
    2
../cpan/ExtUtils-MakeMaker/t/basic.t........................FAILED
    19, 62, 67, 72, 82
    Non-zero exit status: 2
    Bad plan.  You planned 171 tests but ran 84.
../cpan/ExtUtils-MakeMaker/t/oneliner.t.....................FAILED
    4, 7-11
    Non-zero exit status: 6

[default] -DDEBUGGING
[default] -Duseithreads
[default] -DDEBUGGING -Duseithreads
../cpan/ExtUtils-MakeMaker/t/basic.t........................FAILED
    19, 62, 67, 72, 82
    Non-zero exit status: 2
    Bad plan.  You planned 171 tests but ran 84.
../cpan/ExtUtils-MakeMaker/t/oneliner.t.....................FAILED
    4, 7-11
    Non-zero exit status: 6
../cpan/Memoize/t/expmod_t.t................................FAILED
    7

Passed Todo tests: (common-args) none
[default] 
[default] -DDEBUGGING
[default] -Duseithreads
[default] -DDEBUGGING -Duseithreads
../cpan/CGI/t/tmpdir.t......................................PASSED
    3-9

Compiler messages(MSWin32):
op.c(10349) : warning C4028: formal parameter 1 different from declaration
..\pp.c(6113) : warning C4244: 'function' : conversion from 'U32' to 'const char', possible loss of data
..\pp_hot.c(2658) : warning C4244: 'initializing' : conversion from 'I32' to 'U8', possible loss of data
..\pp_sort.c(1650) : warning C4244: 'initializing' : conversion from 'I32' to 'U8', possible loss of data
ListUtil.xs(297) : warning C4244: 'initializing' : conversion from 'I32' to 'U8', possible loss of data
ListUtil.xs(335) : warning C4244: 'initializing' : conversion from 'I32' to 'U8', possible loss of data
Base64.xs(394) : warning C4146: unary minus operator applied to unsigned type, result still unsigned
Base64.xs(396) : warning C4146: unary minus operator applied to unsigned type, result still unsigned
Piece.xs(950) : warning C4101: 'ret' : unreferenced local variable
APItest.xs(2744) : warning C4244: 'initializing' : conversion from 'I32' to 'U8', possible loss of data
# NMAKE : fatal error U1077: 'D:\smoke\perl\blead\build\t\perl.exe' : return code '0xff'
op.c(10349) : warning C4028: formal parameter 2 different from declaration

-- 
Report by Test::Smoke v1.42 build 1267 running on perl 5.10.0
(Reporter v0.035 / Smoker v0.045)




nntp.perl.org: Perl Programming lists via nntp and http.
Comments to Ask Bjørn Hansen at ask@perl.org | Group listing | About