develooper Front page | perl.perl5.porters | Postings from August 2011

Smoke [blead] v5.15.2-110-g766af94 FAIL(XF) linux 2.6.38-10-generic [debian] (x86_64/8 cpu)

From:
George Greer
Date:
August 26, 2011 23:29
Subject:
Smoke [blead] v5.15.2-110-g766af94 FAIL(XF) linux 2.6.38-10-generic [debian] (x86_64/8 cpu)
Message ID:
201108270629.p7R6TjB6006840@m-l.org
Smoke logs available at http://m-l.org/~perl/smoke/perl/

Automated smoke report for 5.15.2 patch 766af94fb242a6c5b6f31e459ea7d2047c0ca242 v5.15.2-110-g766af94
zwei: Intel(R) Core(TM) i7 CPU 920 @ 2.67GHz (GenuineIntel 2133MHz) (x86_64/8 cpu)
    on        linux - 2.6.38-10-generic [debian]
    using     clang version 4.2.1 Compatible Clang Compiler
    smoketime 1 day 8 hours 33 minutes (average 1 hour 37 minutes)

Summary: FAIL(XF)

O = OK  F = Failure(s), extended report at the bottom
X = Failure(s) under TEST but not under harness
? = still running or test results not (yet) available
Build failures during:       - = unknown or N/A
c = Configure, m = make, M = make (after miniperl), t = make test-prep

v5.15.2-110-g766af94  Configuration (common) -A -Dcc=clang append:ccflags=" -fcatch-undefined-behavior "
----------- ---------------------------------------------------------
O O O F O O O F 
O O O F O O O F -Accflags=-DPERL_POISON
O O O F O O O F -Duse64bitall
O O O F O O O F -Dusemorebits
O O O F O O O F -Dmad
O O O F O O O F -Duseithreads
O O O F O O O F -Duseithreads -Accflags=-DPERL_POISON
O O O F X O O F -Duseithreads -Duse64bitall
O O O F O O O F -Duseithreads -Dusemorebits
O O O F O O O F -Duseithreads -Dmad
| | | | | +- LC_ALL = en_US.utf8 -DDEBUGGING
| | | | +--- PERLIO = perlio -DDEBUGGING
| | | +----- PERLIO = stdio  -DDEBUGGING
| | +------- LC_ALL = en_US.utf8
| +--------- PERLIO = perlio
+----------- PERLIO = stdio 

Locally applied patches:
    uncommitted-changes
    SMOKE766af94fb242a6c5b6f31e459ea7d2047c0ca242

Failures: (common-args) -A -Dcc=clang append:ccflags=" -fcatch-undefined-behavior "
[en_US.utf8] 
[en_US.utf8] -Accflags=-DPERL_POISON
[en_US.utf8] -DDEBUGGING -Accflags=-DPERL_POISON
[en_US.utf8] -Duse64bitall
[en_US.utf8] -DDEBUGGING -Duse64bitall
[en_US.utf8] -Dusemorebits
[en_US.utf8] -DDEBUGGING -Dusemorebits
[en_US.utf8] -Dmad
[en_US.utf8] -DDEBUGGING -Dmad
[en_US.utf8] -Duseithreads
[en_US.utf8] -DDEBUGGING -Duseithreads
[en_US.utf8] -Duseithreads -Accflags=-DPERL_POISON
[en_US.utf8] -DDEBUGGING -Duseithreads -Accflags=-DPERL_POISON
[en_US.utf8] -Duseithreads -Duse64bitall
[en_US.utf8] -DDEBUGGING -Duseithreads -Duse64bitall
[en_US.utf8] -Duseithreads -Dusemorebits
[en_US.utf8] -DDEBUGGING -Duseithreads -Dusemorebits
[en_US.utf8] -Duseithreads -Dmad
[en_US.utf8] -DDEBUGGING -Duseithreads -Dmad
    ../t/op/tie_fetch_count.t...................................FAILED
        Non-zero exit status: 2
        Bad plan.  You planned 218 tests but ran 101.
    ../t/op/coresubs.t..........................................FAILED
        46

[en_US.utf8] -DDEBUGGING
    ../t/op/tie_fetch_count.t...................................FAILED
        Non-zero exit status: 2
        Bad plan.  You planned 218 tests but ran 101.
    ../t/op/coresubs.t..........................................FAILED
        46
Inconsistent test results (between TEST and harness):
    ../lib/Benchmark.t......................FAILED at test 15

[stdio] -DDEBUGGING -Duseithreads -Duse64bitall
Inconsistent test results (between TEST and harness):
    ../lib/Benchmark.t......................FAILED at test 15

Compiler messages(gcc):
try.c:5737:17: warning: extra tokens at end of #ifdef directive [-Wextra-tokens]
try.c:5740:18: warning: extra tokens at end of #ifdef directive [-Wextra-tokens]
try.c:5743:19: warning: extra tokens at end of #ifdef directive [-Wextra-tokens]
try.c:5746:19: warning: extra tokens at end of #ifdef directive [-Wextra-tokens]
try.c:5773:17: warning: extra tokens at end of #ifdef directive [-Wextra-tokens]
try.c:5776:18: warning: extra tokens at end of #ifdef directive [-Wextra-tokens]
try.c:5779:19: warning: extra tokens at end of #ifdef directive [-Wextra-tokens]
try.c:5782:19: warning: extra tokens at end of #ifdef directive [-Wextra-tokens]
try.c:5809:17: warning: extra tokens at end of #ifdef directive [-Wextra-tokens]
try.c:5812:18: warning: extra tokens at end of #ifdef directive [-Wextra-tokens]
try.c:5815:19: warning: extra tokens at end of #ifdef directive [-Wextra-tokens]
try.c:5818:19: warning: extra tokens at end of #ifdef directive [-Wextra-tokens]
try.c:5845:16: warning: extra tokens at end of #ifdef directive [-Wextra-tokens]
try.c:5848:17: warning: extra tokens at end of #ifdef directive [-Wextra-tokens]
try.c:5851:18: warning: extra tokens at end of #ifdef directive [-Wextra-tokens]
try.c:5854:18: warning: extra tokens at end of #ifdef directive [-Wextra-tokens]
try.c:5881:18: warning: extra tokens at end of #ifdef directive [-Wextra-tokens]
try.c:5884:19: warning: extra tokens at end of #ifdef directive [-Wextra-tokens]
try.c:5887:20: warning: extra tokens at end of #ifdef directive [-Wextra-tokens]
try.c:5890:20: warning: extra tokens at end of #ifdef directive [-Wextra-tokens]
try.c:6721:18: warning: extra tokens at end of #ifdef directive [-Wextra-tokens]
try.c:6724:19: warning: extra tokens at end of #ifdef directive [-Wextra-tokens]
try.c:6727:20: warning: extra tokens at end of #ifdef directive [-Wextra-tokens]
try.c:6730:20: warning: extra tokens at end of #ifdef directive [-Wextra-tokens]
try.c:6757:18: warning: extra tokens at end of #ifdef directive [-Wextra-tokens]
try.c:6760:19: warning: extra tokens at end of #ifdef directive [-Wextra-tokens]
try.c:6763:20: warning: extra tokens at end of #ifdef directive [-Wextra-tokens]
try.c:6766:20: warning: extra tokens at end of #ifdef directive [-Wextra-tokens]
try.c:6793:18: warning: extra tokens at end of #ifdef directive [-Wextra-tokens]
try.c:6796:19: warning: extra tokens at end of #ifdef directive [-Wextra-tokens]
try.c:6799:20: warning: extra tokens at end of #ifdef directive [-Wextra-tokens]
try.c:6802:20: warning: extra tokens at end of #ifdef directive [-Wextra-tokens]
try.c:6829:17: warning: extra tokens at end of #ifdef directive [-Wextra-tokens]
try.c:6832:18: warning: extra tokens at end of #ifdef directive [-Wextra-tokens]
try.c:6835:19: warning: extra tokens at end of #ifdef directive [-Wextra-tokens]
try.c:6838:19: warning: extra tokens at end of #ifdef directive [-Wextra-tokens]
try.c:6865:19: warning: extra tokens at end of #ifdef directive [-Wextra-tokens]
try.c:6868:20: warning: extra tokens at end of #ifdef directive [-Wextra-tokens]
try.c:6871:21: warning: extra tokens at end of #ifdef directive [-Wextra-tokens]
try.c:6874:21: warning: extra tokens at end of #ifdef directive [-Wextra-tokens]
perl.c:364:6: warning: expression result unused [-Wunused-value]
perl.c:257:5: warning: expression result unused [-Wunused-value]
perl.c:258:5: warning: expression result unused [-Wunused-value]
perl.c:265:5: warning: expression result unused [-Wunused-value]
perl.c:266:5: warning: expression result unused [-Wunused-value]
perl.c:1776:5: warning: expression result unused [-Wunused-value]
util.c:575:5: warning: expression result unused [-Wunused-value]
perl.c:3022:8: warning: expression result unused [-Wunused-value]
util.c:2717:5: warning: expression result unused [-Wunused-value]
util.c:2877:5: warning: expression result unused [-Wunused-value]
regcomp.c:3639:5: warning: expression result unused [-Wunused-value]
toke.c:2188:3: warning: expression result unused [-Wunused-value]
doop.c:696:3: warning: expression result unused [-Wunused-value]
toke.c:2714:3: warning: expression result unused [-Wunused-value]
doop.c:701:2: warning: expression result unused [-Wunused-value]
doop.c:691:5: warning: expression result unused [-Wunused-value]
sv.c:502:5: warning: expression result unused [-Wunused-value]
sv.c:544:5: warning: expression result unused [-Wunused-value]
op.c:3079:5: warning: expression result unused [-Wunused-value]
mro.c:589:21: warning: expression result unused [-Wunused-value]
doop.c:1024:2: warning: expression result unused [-Wunused-value]
sv.c:898:39: warning: comparison of 0 <= unsigned expression is always true [-Wsign-compare]
sv.c:919:17: warning: comparison of 0 <= unsigned expression is always true [-Wsign-compare]
sv.c:925:7: warning: comparison of 0 <= unsigned expression is always true [-Wsign-compare]
sv.c:929:17: warning: comparison of 0 <= unsigned expression is always true [-Wsign-compare]
sv.c:932:17: warning: comparison of 0 <= unsigned expression is always true [-Wsign-compare]
sv.c:938:7: warning: comparison of 0 <= unsigned expression is always true [-Wsign-compare]
sv.c:944:7: warning: comparison of 0 <= unsigned expression is always true [-Wsign-compare]
sv.c:950:7: warning: comparison of 0 <= unsigned expression is always true [-Wsign-compare]
pp_hot.c:144:3: warning: expression result unused [-Wunused-value]
doio.c:634:17: warning: expression result unused [-Wunused-value]
doio.c:638:17: warning: expression result unused [-Wunused-value]
mro.c:634:2: warning: expression result unused [-Wunused-value]
op.c:4254:6: warning: expression result unused [-Wunused-value]
toke.c:3839:5: warning: expression result unused [-Wunused-value]
toke.c:3913:6: warning: expression result unused [-Wunused-value]
regcomp.c:6035:5: warning: expression result unused [-Wunused-value]
sv.c:2757:3: warning: expression result unused [-Wunused-value]
op.c:5088:6: warning: expression result unused [-Wunused-value]
pp_ctl.c:287:2: warning: expression result unused [-Wunused-value]
sv.c:3212:14: warning: expression result unused [-Wunused-value]
sv.c:3221:13: warning: expression result unused [-Wunused-value]
sv.c:3231:13: warning: expression result unused [-Wunused-value]
sv.c:3236:13: warning: expression result unused [-Wunused-value]
pp_hot.c:1196:5: warning: expression result unused [-Wunused-value]
op.c:5482:5: warning: expression result unused [-Wunused-value]
op.c:5556:5: warning: expression result unused [-Wunused-value]
pp_sys.c:438:25op.c:5637:2: warning: expression result unused [-Wunused-value]
op.c:5615:5: warning: expression result unused [-Wunused-value]
pp_sys.c:475:25: warning: expression result unused [-Wunused-value]
pp_hot.c:1611:3: warning: expression result unused [-Wunused-value]
pp_hot.c:1616:6: warning: expression result unused [-Wunused-value]
pp.c:1812:3: warning: expression result unused [-Wunused-value]
pp.c:1802:2: warning: expression result unused [-Wunused-value]
doio.c:2307:2: warning: expression result unused [-Wunused-value]
pp_ctl.c:906:7: warning: expression result unused [-Wunused-value]
toke.c:7532:7sv.c:4092:6: warning: expression result unused [-Wunused-value]
sv.c:4094:6: warning: expression result unused [-Wunused-value]
pp_ctl.c:583:5: warning: expression result unused [-Wunused-value]
sv.c:4108:13: warning: expression result unused [-Wunused-value]
pp_pack.c:2409:5: warning: expression result unused [-Wunused-value]
sv.c:4265:13: warning: expression result unused [-Wunused-value]
regexec.c:4174:19: warning: expression result unused [-Wunused-value]
sv.c:4505:5: warning: expression result unused [-Wunused-value]
regcomp.c:11723:11: warning: expression result unused [-Wunused-value]
sv.c:4555:5: warning: expression result unused [-Wunused-value]
sv.c:4557:5: warning: expression result unused [-Wunused-value]
pp_sys.c:1079:6: warning: expression result unused [-Wunused-value]
pp_ctl.c:1338:6: warning: expression result unused [-Wunused-value]
pp_hot.c:2311:6: warning: expression result unused [-Wunused-value]
pp_sys.c:1287:6: warning: expression result unused [-Wunused-value]
op.c:3079:5: warning: sv.c:4610:5: warning: expression result unused [-Wunused-value]
sv.c:4776:6: warning: expression result unused [-Wunused-value]
sv.c:4879:6: warning: expression result unused [-Wunused-value]
regexec.c:5438:9: warning: expression result unused [-Wunused-value]
sv.c:4948:5: warning: expression result unused [-Wunused-value]
sv.c:5043:5: warning: expression result unused [-Wunused-value]
sv.c:5113:2: warning: expression result unused [-Wunused-value]
sv.c:5145:5: warning: expression result unused [-Wunused-value]
pp_sys.c:1723:2: warning: expression result unused [-Wunused-value]
pp.c:3156:7: warning: expression result unused [-Wunused-value]
op.c:7800:7: warning: expression result unused [-Wunused-value]
op.c:7907:5: warning: expression result unused [-Wunused-value]
sv.c:5696:2: warning: expression result unused [-Wunused-value]
pp.c:3161:7: warning: expression result unused [-Wunused-value]
sv.c:5693:5: warning: expression result unused [-Wunused-value]
pp_ctl.c:2237:3: warning: expression result unused [-Wunused-value]
pp_ctl.c:2252:6: warning: expression result unused [-Wunused-value]
perlio.c:5509:21: warning: comparison of integers of different signs: 'size_t' (aka 'unsigned long') and 'int' [-Wsign-compare]
pp.c:3422:2: warning: expression result unused [-Wunused-value]
op.c:5637:2: warning: expression result unused [-Wunused-value]
pp.c:3444:6: warning: expression result unused [-Wunused-value]
pp.c:3419:5: warning: expression result unused [-Wunused-value]
pp.c:3432:5: warning: expression result unused [-Wunused-value]
pp.c:3792:2: warning: expression result unused [-Wunused-value]
op.c:8635:6: warning: expression result unused [-Wunused-value]
op.c:6120:5: warning: expression result unused [-Wunused-value]
pp.c:3930:2: warning: expression result unused [-Wunused-value]
pp.c:4013:4: warning: expression result unused [-Wunused-value]
pp.c:4064:8: warning: expression result unused [-Wunused-value]
pp.c:4193:2: warning: expression result unused [-Wunused-value]
pp.c:4321:4: warning: expression result unused [-Wunused-value]
pp.c:4384:2: warning: expression result unused [-Wunused-value]
pp.c:4385:2: warning: expression result unused [-Wunused-value]
sv.c:7634:6: warning: expression result unused [-Wunused-value]
sv.c:7672:6: warning: expression result unused [-Wunused-value]
sv.c:7708:2: warning: expression result unused [-Wunused-value]
sv.c:7508:5: warning: expression result unused [-Wunused-value]
op.c:9877:4: warning: expression result unused [-Wunused-value]
sv.c:7984:5: warning: expression result unused [-Wunused-value]
sv.c:9000:6: warning: expression result unused [-Wunused-value]
sv.c:9001:6: warning: expression result unused [-Wunused-value]
toke.c:9333:5: warning: expression result unused [-Wunused-value]
sv.c:9370:5: warning: expression result unused [-Wunused-value]
toke.c:9829:2: warning: expression result unused [-Wunused-value]
toke.c:9743:5: warning: expression result unused [-Wunused-value]
pp_ctl.c:4413:5: warning: expression result unused [-Wunused-value]
sv.c:10936:6: warning: expression result unused [-Wunused-value]
sv.c:10974:2: warning: expression result unused [-Wunused-value]
toke.c:10852:2: warning: expression result unused [-Wunused-value]
sv.c:13550:6: warning: expression result unused [-Wunused-value]
pp_ctl.c:5399:5: warning: expression result unused [-Wunused-value]
Dumper.xs:243:2: warning: expression result unused [-Wunused-value]
Dumper.xs:650:4: warning: expression result unused [-Wunused-value]
./const-c.inc:47:2: warning: expression result unused [-Wunused-value]
./const-c.inc:81:5: warning: expression result unused [-Wunused-value]
Socket.xs:227:2: warning: expression result unused [-Wunused-value]
Opcode.xs:268:9: warning: expression result unused [-Wunused-value]
Call.xs:62:58: warning: conversion specifies type 'int' but the argument has type 'STRLEN' (aka 'unsigned long') [-Wformat]
Call.xs:62:78: warning: conversion specifies type 'int' but the argument has type 'STRLEN' (aka 'unsigned long') [-Wformat]
Call.xs:99:53: warning: conversion specifies type 'int' but the argument has type 'STRLEN' (aka 'unsigned long') [-Wformat]
Call.xs:155:46: warning: conversion specifies type 'int' but the argument has type 'STRLEN' (aka 'unsigned long') [-Wformat]
Call.xs:174:57: warning: conversion specifies type 'int' but the argument has type 'STRLEN' (aka 'unsigned long') [-Wformat]
scalar.xs:48:5: warning: expression result unused [-Wunused-value]
Base64.xs:421:8: warning: expression result unused [-Wunused-value]
Bzip2.xs:326:5: warning: expression result unused [-Wunused-value]
re_comp.c:3639:5: warning: expression result unused [-Wunused-value]
Util.xs:55:9: warning: expression result unused [-Wunused-value]
./const-c.inc:38:2: warning: expression result unused [-Wunused-value]
./const-c.inc:73:5: warning: expression result unused [-Wunused-value]
mro.xs:120:7: warning: expression result unused [-Wunused-value]
re_exec.c:4174:19: warning: expression result unused [-Wunused-value]
Zlib.xs:593:5: warning: expression result unused [-Wunused-value]
SysV.xs:364:5: warning: expression result unused [-Wunused-value]
re_exec.c:5438:9: warning: expression result unused [-Wunused-value]
Storable.xs:1857:3: warning: expression result unused [-Wunused-value]
Typemap.xs:88:3: warning: expression result unused [-Wunused-value]
Storable.xs:4104:2: warning: null passed to a callee which requires a non-null argument [-Wnonnull]
Storable.xs:4537:2: warning: 2 warnings generated.
Storable.xs:4840:3: warning: expression result unused [-Wunused-value]
Storable.xs:5422:3: warning: expression result unused [-Wunused-value]
Storable.xs:5469:2: warning: expression result unused [-Wunused-value]
Storable.xs:5509:2: warning: null passed to a callee which requires a non-null argument [-Wnonnull]
Storable.xs:5572:2: warning: null passed to a callee which requires a non-null argument [-Wnonnull]
Storable.xs:5883:4: warning: expression result unused [-Wunused-value]
Storable.xs:5924:3: warning: expression result unused [-Wunused-value]
Storable.xs:6083:5: warning: expression result unused [-Wunused-value]
APItest.xs:112:5: warning: expression result unused [-Wunused-value]
./const-c.inc:72:5: warning: expression result unused [-Wunused-value]
APItest.xs:1440:2: warning: expression result unused [-Wunused-value]
APItest.xs:1468:9: warning: expression result unused [-Wunused-value]
APItest.xs:1925:2: warning: expression result unused [-Wunused-value]
POSIX.xs:1696:2: warning: expression result unused [-Wunused-value]
POSIX.xs:1815:15: warning: expression result unused [-Wunused-value]
APItest.xs:2676:9: warning: expression result unused [-Wunused-value]
FastCalc.xs:337:5: warning: expression result unused [-Wunused-value]
FastCalc.xs:377:5: warning: expression result unused [-Wunused-value]
FastCalc.xs:378:5: warning: expression result unused [-Wunused-value]
Unicode.xs:176:6: warning: expression result unused [-Wunused-value]
Unicode.xs:334:6: warning: expression result unused [-Wunused-value]
Unicode.xs:326:5: warning: expression result unused [-Wunused-value]
ExtTest.xs:44:2: warning: expression result unused [-Wunused-value]
ExtTest.xs:78:5: warning: expression result unused [-Wunused-value]
pp_hot.c:173:3: warning: result of comparison against a string literal is unspecified (use strncmp instead)
pp_sys.c:327:6: warning: result of comparison against a string literal is unspecified (use strncmp instead)
pp_sys.c:407:5: warning: result of comparison against a string literal is unspecified (use strncmp instead)
pp_ctl.cdoop.c:696:3: warning: expression result unused [-Wunused-value]
doop.c:701:2: warning: expression result unused [-Wutil.c:575:5: warning: expression result unused [-Wunused-value]
pp.c:5306:2: warning: result of comparison against a string literal is unspecified (use strncmp instead)
pp.c:5356:2: warning: result of comparison against a string literal is unspecified (use strncmp instead)
pp.c:5916:6: warning: result of comparison against a string literal is unspecified (use strncmp instead)
pp_ctl.c:980:3: warning: expression result unused [-Wunused-value]
pp_sys.c:566:5: warning: result of comparison against a string literal is unspecified (use strncmp instead)
pp_ctl.c:1190:5: warning: result of comparison against a string literal is unspecified (use strncmp instead)
pp_ctl.c:1196:2: warning: result of comparison against a string literal is unspecified (use strncmp instead)
pp_hot.c:1629:3: warning: expression result unused [-Wunused-value]
pp_hot.c:1618:2: warning: expression result unused [-Wunused-value]
pp_sys.c:920:5: warning: result of comparison against a string literal is unspecified (use strncmp instead)
pp_sys.c:949:9: warning: result of comparison against a string literal is unspecified (use strncmp instead)
pp_hot.c:2415:5: warning: result of comparison against a string literal is unspecified (use strncmp instead)
pp_hot.c:2422:2: warning: result of comparison against a string literal is unspecified (use strncmp instead)
op.c:4647:6: warning: result of comparison against a string literal is unspecified (use strncmp instead)
doio.c:2093:6: warning: expression result unused [-Wunused-value]
pp_ctl.c:2145:5: warning: result of comparison against a string literal is unspecified (use strncmp instead)
doio.c:2199:5: warning: expression result unused [-Wunused-value]
pp_ctl.c:2309:5: warning: result of comparison against a string literal is unspecified (use strncmp instead)
pp_ctl.c:2310:5: warning: result of comparison against a string literal is unspecified (use strncmp instead)
toke.c:7532:7: warning: expression result unused [-Wunused-value]
sv.c:3659:6: warning: expression result unused [-Wunused-value]
sv.c:4092:6: warning: expression result unused [-Wunused-value]
pp_ctl.c:3369:5: warning: result of comparison against a string literal is unspecified (use strncmp instead)
pp_ctl.c:3558:6: warning: result of comparison against a string literal is unspecified (use strncmp instead)
sv.c:4610:5: warning: expression result unused [-Wunused-value]
pp_ctl.c:3903:7: warning: result of comparison against a string literal is unspecified (use strncmp instead)
pp_ctl.c:sv.c:5696:2: warning: expression result unused [-Wunused-value]
pp_ctl.c:4305:5: warning: result of comparison against a string literal is unspecified (use strncmp instead)
pp_ctl.c:4362:5: warning: result of comparison against a string literal is unspecified (use strncmp instead)
pp_ctl.c:4400:5: warning: result of comparison against a string literal is unspecified (use strncmp instead)
pp_ctl.c:4446:5: warning: result of comparison against a string literal is unspecified (use strncmp instead)
pp_ctl.c:4546:3: warning: result of comparison against a string literal is unspecified (use strncmp instead)
pp_ctl.c:4578:3: warning: result of comparison against a string literal is unspecified (use strncmp instead)
pp_ctl.c:4600:6: warning: result of comparison against a string literal is unspecified (use strncmp instead)
pp_ctl.c:4976:5: warning: result of comparison against a string literal is unspecified (use strncmp instead)
pp_ctl.c:5022:5: warning: result of comparison against a string literal is unspecified (use strncmp instead)
pp_ctl.c:5436:2: warning: result of comparison against a string literal is unspecified (use strncmp instead)
X/autosplit.ix in @INC (@INC contains: /home/perl/Call.xs:62:58: warning: conversion specifies type 'int' but the argument has type 'STRLEN' (aka 'unsigned long') [-Wformat]
                                                  re_exec.c:4174:19: warning: expression result unused [-Wunused-value]
Storable.xs:4537:2: warning: expression result unused [-Wunused-value]
Collate.xs:605:2: warning: expression result unused [-Wunused-value]
Collate.xs:595:2: warning: expression result unused [-Wunused-value]
pp_sys.c:438:25: warning: expression result unused [-Wunused-value]
pp_ctl.c:409:2: warning: expression result unused [-Wunused-value]
pp_ctl.c:421:8: warning: expression result unused [-Wunused-value]
pp_ctl.ctoke.c:9333:5: warning: expression result unused [-Wunused-value]
re_comp.c:6035:5: warning: expression result unused [-Wunused-value]
perl.c:3022:8: pp_pack.c:2409:5: warning: expression result unused [-Wunused-value]
op.cperlio.c:5509:21: warning: comparison of integers of different signs: 'size_t' (aka 'unsigned long') and 'int' [-Wsign-compare]
./sv.h:1567pp_ctl.c:2237:3: warning: expression result unused [-Wunused-value]
pp_ctl.c:4282:2: warning: result of comparison against a string literal is unspecified (use strncmp instead)
sv.c:regexec.c5509:21: warning: :4174:19: warning: comparison of integers of different signs
In file included from op.csv.c.c:2307:2: warning: expression result unused [-Wunused-value]
#   :5556:5: warning: expression result unused [-Wunused-value]
./sv.hpp_hot.c:1618:2: warning: expression result unused [-Wunused-value]
./sv.h:1074:pp.c:3161:7: warning: expression result unused [-Wunused-value]
#    define SvPVX(sv) ((sv)->sv_u.svu_pv)pp_sys.c:438:25: warning: expression result unused [-Wunused-value]
pp_ctl.c:sv.c:9000:6: warning: expression result unused [-Wunused-value]
Call.xs:99:53: warning: pemap.xs:12:
regcomp.cop.c:4254:6: warning: expression result unused [-Wunused-value]
op.c:8635:6: warning:             assert(((char*)PL_scopestack_
../../sv.h:233:2:APItest.xs:1440:2: warning: expression result unused [-Wunused-value]
doio.c:581:11: warning: passing 'int *' to parameter of type 'socklen_t *' (aka 'unsigned int *') converts between pointers to integer types with different sign [-Wpointer-sign]
regexec.c:2580:8: warning: expression result unused [-Wunused-value]
op.c:5482:5: warning: pp_pack.c:2409:5: warning: expression result unused [-Wunused-value]
pp_sys.c:1658:10: warning: passing 'int *' to parameter of type 'socklen_t *' (aka 'unsigned int *') converts between pointers to integer types with different sign [-Wpointer-sign]
pp_sys.c:2547:10: warning: passing 'int *' to parameter of type 'socklen_t *' (aka 'unsigned int *') converts between pointers to integer types with different sign [-Wpointer-sign]
pp_sys.c:2638:6: warning: passing 'int *' to parameter of type 'socklen_t *' (aka 'unsigned int *') converts between pointers to integer types with different sign [-Wpointer-sign]
pp_sys.c:2708:6: warning: passing 'int *' to parameter of type 'socklen_t *' (aka 'unsigned int *') converts between pointers to integer types with different sign [-Wpointer-sign]
pp_sys.c:2712:6: warning: passing 'int *' to parameter of type 'socklen_t *' (aka 'unsigned int *') converts between pointers to integer types with different sign [-Wpointer-sign]
re_exec.c:2580:8: warning: expression result unused [-Wunused-value]
pp.c:5306:2: warning: sv.c:5693:5: warning: expression result unused [-Wunused-value]
                ^~~~~~~~~~~~~~~~~~~~~op.c:4254:6: warning: expression result unused [-Wunused-value]
In file included from ./perl.hperl.c:1776:5: warning: expression result unused [-Wunused-value]
./sv.h:1981:63perlio.c:5509:21: warning: comparison of integers of different signs: 'size_t' (aka 'unsigned long') and 'int' [-Wsign-compare]
./sv.h:1981:63: pp.c:4193:2: warning: expression result unused [-Wunused-value]
pp_ctl.cpp.c:5356:2: warning: result of comparison against a string literal is unspecified (use strncmp instead)
./sv.h:1525:31op.c:3079:5: warning: expression result unused [-Wunused-value]
op.cop.c:7800:7: warning: expression result unused [-Wunused-value]
:5482:5: warning: expression result unused [-Wunused-value]
sv.cpp_ctl.c:287:2: warning: expression result unused [-Wunused-value]
In file included from ./perl.ho345:56./:2: warning: note: instantiated from:
./sv.h:1981:63:op.c:4254:6: warning: expression result unused [-Wunused-value]
./sv.h:233:2:doop.c:701:2: warning: expression result unused [-Wunused-value]
./scope.hpp.c:1812:3: warning: expression result unused [-Wunused-value]
op.c:3079regcomp.c:6035:5: warning: expression result unused [-Wunused-value]
pp_sys.c:pp_ctl.c:2237:3: warning: expression result unused [-Wunused-value]
./sv.h:1136toke.c:7532:7: warning: expression result unused [-Wunused-value]
In file included from sv.c:4948:5: warning: expression result unused [-Wunused-value]
pp_ctl.csv.c:5145:5: warning: expression result unused [-Wunused-value]
In file included from APItest.xsStorable.xs:5469:2: warning: expression result unused [-Wunused-value]
-- 
Report by Test::Smoke v1.44 build 1285 running on perl 5.10.1
(Reporter v0.035 / Smoker v0.045)




nntp.perl.org: Perl Programming lists via nntp and http.
Comments to Ask Bjørn Hansen at ask@perl.org | Group listing | About