develooper Front page | perl.perl5.porters | Postings from July 2011

Smoke [5.15.1] v5.15.1-74-gc3ea6d2 FAIL(F) openvms V8.3-1H1 (IA64/2cpu)

From:
Craig A. Berry
Date:
July 27, 2011 21:00
Subject:
Smoke [5.15.1] v5.15.1-74-gc3ea6d2 FAIL(F) openvms V8.3-1H1 (IA64/2cpu)
Message ID:
0LP000K3DZ3RZP40@asmtp017.mac.com
Automated smoke report for 5.15.1 patch c3ea6d286d7ce2cab156ba526ee6161272c45eb3 v5.15.1-74-gc3ea6d2
ALMA: HP rx2600  (1.50GHz/6.0MB) (IA64/2 cpu)
    on        openvms - V8.3-1H1
    using     ? CC/DECC version 70390019
    smoketime 3 hours 44 minutes (average 1 hour 52 minutes)

Summary: FAIL(F)

O = OK  F = Failure(s), extended report at the bottom
X = Failure(s) under TEST but not under harness
? = still running or test results not (yet) available
Build failures during:       - = unknown or N/A
c = Configure, m = make, M = make (after miniperl), t = make test-prep

v5.15.1-74-gc3ea6d2  Configuration (common) none
----------- ---------------------------------------------------------
F -         -Duser_c_flags=/WARN=(ENABLE=LEVEL3,INFORMATIONAL=ALL)
F -         -Duser_c_flags=/WARN=(ENABLE=LEVEL3,INFORMATIONAL=ALL) -Dusethreads
| +--------- -DDEBUGGING
+----------- no debugging


Locally applied patches:
    uncommitted-changes
    SMOKEc3ea6d286d7ce2cab156ba526ee6161272c45eb3

Failures: (common-args) none
[default] -Duser_c_flags=/WARN=(ENABLE=LEVEL3,INFORMATIONAL=ALL)
    cpan/CGI/t/url.................................................FAILED--no leader found
    cpan/Module-Build/t/PL_files...................................FAILED at test 3
    cpan/Module-Build/t/properties/dist_suffix.....................FAILED at test 2
    cpan/Module-Build/t/runthrough.................................FAILED at test 11
    cpan/Module-Build/t/tilde......................................FAILED at test 16
    t/porting/podcheck.............................................FAILED at test 1

[default] -Duser_c_flags=/WARN=(ENABLE=LEVEL3,INFORMATIONAL=ALL) -Dusethreads
    t/op/threads...................................................FAILED--unexpected output at test 23
    cpan/CGI/t/url.................................................FAILED--no leader found
    cpan/Module-Build/t/PL_files...................................FAILED at test 3
    cpan/Module-Build/t/properties/dist_suffix.....................FAILED at test 2
    cpan/Module-Build/t/runthrough.................................FAILED at test 11
    cpan/Module-Build/t/tilde......................................FAILED at test 16
    t/porting/podcheck.............................................FAILED at test 1

Compiler messages(VMS):

		if (invariant_head <= 0) {
....................^
%CC-I-QUESTCOMPARE, In this statement, the unsigned expression "invariant_head" is being compared with a relational operator to a constant whose value is not greater than zero.  This might not be what you intended.
at line number 3355 in file MDA0:[SMOKE.blead]sv.c;1

            if (ulen == -1) {
................^
%CC-I-QUESTCOMPARE1, In this statement, the unsigned expression "ulen" is being compared with an equality operator to a constant whose value is negative.  This might not be what you intended.
at line number 356 in file MDA0:[SMOKE.blead.cpan.Encode]Encode.xs;1

                    if (ulen == -1)
........................^
%CC-I-QUESTCOMPARE1, In this statement, the unsigned expression "ulen" is being compared with an equality operator to a constant whose value is negative.  This might not be what you intended.
at line number 360 in file MDA0:[SMOKE.blead.cpan.Encode]Encode.xs;1

-- 
Report by Test::Smoke v1.39 build 1235 running on perl 5.12.3
(Reporter v0.035 / Smoker v0.044)



nntp.perl.org: Perl Programming lists via nntp and http.
Comments to Ask Bjørn Hansen at ask@perl.org | Group listing | About