develooper Front page | perl.perl5.porters | Postings from July 2011

Smoke [blead] v5.15.0-215-g7e03b51 FAIL(F) linux 2.6.38-8-generic [debian] (x86_64/8 cpu)

From:
George Greer
Date:
July 4, 2011 00:29
Subject:
Smoke [blead] v5.15.0-215-g7e03b51 FAIL(F) linux 2.6.38-8-generic [debian] (x86_64/8 cpu)
Message ID:
201107040729.p647TPoo008648@m-l.org
Smoke logs available at http://m-l.org/~perl/smoke/perl/

Automated smoke report for 5.15.0 patch 7e03b518f310049554c2f316e4dd3051a0af0acf v5.15.0-215-g7e03b51
zwei: Intel(R) Core(TM) i7 CPU 920 @ 2.67GHz (GenuineIntel 2668MHz) (x86_64/8 cpu)
    on        linux - 2.6.38-8-generic [debian]
    using     clang version 4.2.1 Compatible Clang Compiler
    smoketime 1 hour 25 minutes (average 21 minutes 18 seconds)

Summary: FAIL(F)

O = OK  F = Failure(s), extended report at the bottom
X = Failure(s) under TEST but not under harness
? = still running or test results not (yet) available
Build failures during:       - = unknown or N/A
c = Configure, m = make, M = make (after miniperl), t = make test-prep

v5.15.0-215-g7e03b51  Configuration (common) -A -Dcc=clang append:ccflags=" -fcatch-undefined-behavior "
----------- ---------------------------------------------------------
O F         
O F         -Duseithreads
| +--------- -DDEBUGGING
+----------- no debugging


Locally applied patches:
    uncommitted-changes
    SMOKE7e03b518f310049554c2f316e4dd3051a0af0acf

Testsuite was run only with 'harness'

Failures: (common-args) -A -Dcc=clang append:ccflags=" -fcatch-undefined-behavior "
[default] -DDEBUGGING
../t/re/pat_advanced.t......................................FAILED
    No plan found in TAP output
../t/re/pat_re_eval.t.......................................FAILED
    Bad plan.  You planned 123 tests but ran 16.
../t/re/regexp_noamp.t......................................FAILED
    Bad plan.  You planned 1525 tests but ran 1409.
../t/re/regexp.t............................................FAILED
    Bad plan.  You planned 1525 tests but ran 1409.
../t/re/regexp_qr.t.........................................FAILED
    Bad plan.  You planned 1525 tests but ran 1409.
../t/re/regexp_notrie.t.....................................FAILED
    Bad plan.  You planned 1525 tests but ran 1409.
../t/re/regexp_trielist.t...................................FAILED
    Bad plan.  You planned 1525 tests but ran 1409.
../t/re/regexp_qr_embed.t...................................FAILED
    Bad plan.  You planned 1525 tests but ran 1409.
../t/re/fold_grind.t........................................FAILED
    No plan found in TAP output
../t/uni/fold.t.............................................FAILED
    No plan found in TAP output
../cpan/Archive-Tar/t/02_methods.t..........................FAILED
    No plan found in TAP output
../dist/IO/t/io_file.t......................................FAILED
    No plan found in TAP output

[default] -DDEBUGGING -Duseithreads
../t/re/pat_advanced.t......................................FAILED
    No plan found in TAP output
../t/re/pat_advanced_thr.t..................................FAILED
    No plan found in TAP output
../t/re/pat_re_eval.t.......................................FAILED
    Bad plan.  You planned 123 tests but ran 16.
../t/re/pat_re_eval_thr.t...................................FAILED
    Bad plan.  You planned 123 tests but ran 16.
../t/re/regexp_noamp.t......................................FAILED
    Bad plan.  You planned 1525 tests but ran 1409.
../t/re/regexp.t............................................FAILED
    Bad plan.  You planned 1525 tests but ran 1409.
../t/re/regexp_notrie.t.....................................FAILED
    Bad plan.  You planned 1525 tests but ran 1409.
../t/re/regexp_qr.t.........................................FAILED
    Bad plan.  You planned 1525 tests but ran 1409.
../t/re/regexp_qr_embed.t...................................FAILED
    Bad plan.  You planned 1525 tests but ran 1409.
../t/re/regexp_trielist.t...................................FAILED
    Bad plan.  You planned 1525 tests but ran 1409.
../t/re/fold_grind.t........................................FAILED
    No plan found in TAP output
../t/uni/fold.t.............................................FAILED
    No plan found in TAP output
../t/re/regexp_qr_embed_thr.t...............................FAILED
    Bad plan.  You planned 1525 tests but ran 1409.
../cpan/Archive-Tar/t/02_methods.t..........................FAILED
    No plan found in TAP output
../dist/IO/t/io_file.t......................................FAILED
    No plan found in TAP output

Passed Todo tests: (common-args) -A -Dcc=clang append:ccflags=" -fcatch-undefined-behavior "
[default] 
[default] -DDEBUGGING
[default] -Duseithreads
[default] -DDEBUGGING -Duseithreads
../cpan/CGI/t/tmpdir.t......................................PASSED
    3-9

Compiler messages(gcc):
try.c:5737:17: warning: extra tokens at end of #ifdef directive [-Wextra-tokens]
try.c:5740:18: warning: extra tokens at end of #ifdef directive [-Wextra-tokens]
try.c:5743:19: warning: extra tokens at end of #ifdef directive [-Wextra-tokens]
try.c:5746:19: warning: extra tokens at end of #ifdef directive [-Wextra-tokens]
try.c:5773:17: warning: extra tokens at end of #ifdef directive [-Wextra-tokens]
try.c:5776:18: warning: extra tokens at end of #ifdef directive [-Wextra-tokens]
try.c:5779:19: warning: extra tokens at end of #ifdef directive [-Wextra-tokens]
try.c:5782:19: warning: extra tokens at end of #ifdef directive [-Wextra-tokens]
try.c:5809:17: warning: extra tokens at end of #ifdef directive [-Wextra-tokens]
try.c:5812:18: warning: extra tokens at end of #ifdef directive [-Wextra-tokens]
try.c:5815:19: warning: extra tokens at end of #ifdef directive [-Wextra-tokens]
try.c:5818:19: warning: extra tokens at end of #ifdef directive [-Wextra-tokens]
try.c:5845:16: warning: extra tokens at end of #ifdef directive [-Wextra-tokens]
try.c:5848:17: warning: extra tokens at end of #ifdef directive [-Wextra-tokens]
try.c:5851:18: warning: extra tokens at end of #ifdef directive [-Wextra-tokens]
try.c:5854:18: warning: extra tokens at end of #ifdef directive [-Wextra-tokens]
try.c:5881:18: warning: extra tokens at end of #ifdef directive [-Wextra-tokens]
try.c:5884:19: warning: extra tokens at end of #ifdef directive [-Wextra-tokens]
try.c:5887:20: warning: extra tokens at end of #ifdef directive [-Wextra-tokens]
try.c:5890:20: warning: extra tokens at end of #ifdef directive [-Wextra-tokens]
try.c:6721:18: warning: extra tokens at end of #ifdef directive [-Wextra-tokens]
try.c:6724:19: warning: extra tokens at end of #ifdef directive [-Wextra-tokens]
try.c:6727:20: warning: extra tokens at end of #ifdef directive [-Wextra-tokens]
try.c:6730:20: warning: extra tokens at end of #ifdef directive [-Wextra-tokens]
try.c:6757:18: warning: extra tokens at end of #ifdef directive [-Wextra-tokens]
try.c:6760:19: warning: extra tokens at end of #ifdef directive [-Wextra-tokens]
try.c:6763:20: warning: extra tokens at end of #ifdef directive [-Wextra-tokens]
try.c:6766:20: warning: extra tokens at end of #ifdef directive [-Wextra-tokens]
try.c:6793:18: warning: extra tokens at end of #ifdef directive [-Wextra-tokens]
try.c:6796:19: warning: extra tokens at end of #ifdef directive [-Wextra-tokens]
try.c:6799:20: warning: extra tokens at end of #ifdef directive [-Wextra-tokens]
try.c:6802:20: warning: extra tokens at end of #ifdef directive [-Wextra-tokens]
try.c:6829:17: warning: extra tokens at end of #ifdef directive [-Wextra-tokens]
try.c:6832:18: warning: extra tokens at end of #ifdef directive [-Wextra-tokens]
try.c:6835:19: warning: extra tokens at end of #ifdef directive [-Wextra-tokens]
try.c:6838:19: warning: extra tokens at end of #ifdef directive [-Wextra-tokens]
try.c:6865:19: warning: extra tokens at end of #ifdef directive [-Wextra-tokens]
try.c:6868:20: warning: extra tokens at end of #ifdef directive [-Wextra-tokens]
try.c:6871:21: warning: extra tokens at end of #ifdef directive [-Wextra-tokens]
try.c:6874:21: warning: extra tokens at end of #ifdef directive [-Wextra-tokens]
sv.c:502:5: warning: expression result unused [-Wunused-value]
sv.c:544:5: warning: expression result unused [-Wunused-value]
sv.c:899:39: warning: comparison of 0 <= unsigned expression is always true [-Wsign-compare]
sv.c:924:17: warning: comparison of 0 <= unsigned expression is always true [-Wsign-compare]
sv.c:931:7: warning: comparison of 0 <= unsigned expression is always true [-Wsign-compare]
sv.c:936:17: warning: comparison of 0 <= unsigned expression is always true [-Wsign-compare]
sv.c:940:17: warning: comparison of 0 <= unsigned expression is always true [-Wsign-compare]
sv.c:946:7: warning: comparison of 0 <= unsigned expression is always true [-Wsign-compare]
sv.c:952:7: warning: comparison of 0 <= unsigned expression is always true [-Wsign-compare]
sv.c:959:7: warning: comparison of 0 <= unsigned expression is always true [-Wsign-compare]
util.c:575:5: warning: expression result unused [-Wunused-value]
mro.c:589:21: warning: expression result unused [-Wunused-value]
mro.c:634:2: warning: expression result unused [-Wunused-value]
pp_hot.c:143:3: warning: expression result unused [-Wunused-value]
doop.c:696:3: warning: expression result unused [-Wunused-value]
doop.c:701:2: warning: expression result unused [-Wunused-value]
doop.c:691:5: warning: expression result unused [-Wunused-value]
sv.c:2767:3: warning: expression result unused [-Wunused-value]
doop.c:1024:2: warning: expression result unused [-Wunused-value]
toke.c:2185:3: warning: expression result unused [-Wunused-value]
doio.c:634:17: warning: expression result unused [-Wunused-value]
pp_sys.c:438:25: warning: expression result unused [-Wunused-value]
doio.c:638:17: warning: expression result unused [-Wunused-value]
pp_sys.c:475:25: warning: expression result unused [-Wunused-value]
pp_ctl.c:280:2: warning: expression result unused [-Wunused-value]
toke.c:2711:3: warning: expression result unused [-Wunused-value]
sv.c:3222:14: warning: expression result unused [-Wunused-value]
sv.c:3231:13: warning: expression result unused [-Wunused-value]
sv.c:3241:13: warning: expression result unused [-Wunused-value]
sv.c:3246:13: warning: expression result unused [-Wunused-value]
pp_ctl.c:402:2: warning: expression result unused [-Wunused-value]
pp_ctl.c:414:8: warning: expression result unused [-Wunused-value]
toke.c:3836:5: warning: expression result unused [-Wunused-value]
sv.c:3669:6: warning: expression result unused [-Wunused-value]
pp_ctl.c:973:3: warning: expression result unused [-Wunused-value]
pp_ctl.c:576:5: warning: expression result unused [-Wunused-value]
pp_pack.c:2409:5: warning: expression result unused [-Wunused-value]
pp_hot.c:1196:5: warning: expression result unused [-Wunused-value]
pp_sys.c:1079:6: warning: expression result unused [-Wunused-value]
sv.c:4102:6: warning: expression result unused [-Wunused-value]
sv.c:4104:6: warning: expression result unused [-Wunused-value]
sv.c:4118:13: warning: expression result unused [-Wunused-value]
pp_sys.c:1287:6: warning: expression result unused [-Wunused-value]
sv.c:4275:13: warning: expression result unused [-Wunused-value]
pp_ctl.c:1331:6: warning: expression result unused [-Wunused-value]
regcomp.c:3639:5: warning: expression result unused [-Wunused-value]
pp_sys.c:1723:2: warning: expression result unused [-Wunused-value]
sv.c:4565:5: warning: expression result unused [-Wunused-value]
sv.c:4567:5: warning: expression result unused [-Wunused-value]
pp_hot.c:1616:6: warning: expression result unused [-Wunused-value]
pp_hot.c:1629:3: warning: expression result unused [-Wunused-value]
pp_hot.c:1618:2: warning: expression result unused [-Wunused-value]
doio.c:2199:5: warning: expression result unused [-Wunused-value]
toke.c:7526:7: warning: expression result unused [-Wunused-value]
perl.c:364:6: warning: expression result unused [-Wunused-value]
perl.c:257:5: warning: expression result unused [-Wunused-value]
perl.c:258:5: warning: expression result unused [-Wunused-value]
perl.c:265:5: warning: expression result unused [-Wunused-value]
perl.c:266:5: warning: expression result unused [-Wunused-value]
pp_ctl.c:2213:3: warning: expression result unused [-Wunused-value]
pp_ctl.c:2228:6: warning: expression result unused [-Wunused-value]
sv.c:4620:5: warning: expression result unused [-Wunused-value]
sv.c:4786:6: warning: expression result unused [-Wunused-value]
sv.c:4889:6: warning: expression result unused [-Wunused-value]
doio.c:2307:2: warning: expression result unused [-Wunused-value]
regexec.c:5426:9: warning: expression result unused [-Wunused-value]
In file included from ./perl.h:regcomp.c:6035:5: warning: expression result unused [-Wunused-value]
sv.c:4958:5: warning: expression result unused [-Wunused-value]
sv.c:5053:5: warning: expression result unused [-Wunused-value]
sv.c:5123:2: warning: expression result unused [-Wunused-value]
sv.c:5155:5: warning: expression result unused [-Wunused-value]
pp_hot.c:2309:6: warning: expression result unused [-Wunused-value]
perl.c:1779:5: warning: expression result unused [-Wunused-value]
sv.c:5706:2: warning: expression result unused [-Wunused-value]
sv.c:5703:5: warning: expression result unused [-Wunused-value]
perl.c:3019:8: warning: expression result unused [-Wunused-value]
pp_ctl.c:4408:5: warning: expression result unused [-Wunused-value]
toke.c:9325:5: warning: expression result unused [-Wunused-value]
toke.c:9821:2: warning: expression result unused [-Wunused-value]
toke.c:9735:5: warning: expression result unused [-Wunused-value]
pp_ctl.c:5392:5: warning: expression result unused [-Wunused-value]
pp.c:1831:3: warning: expression result unused [-Wunused-value]
sv.c:7644:6: warning: expression result unused [-Wunused-value]
sv.c:7682:6: warning: expression result unused [-Wunused-value]
sv.c:7718:2: warning: expression result unused [-Wunused-value]
pp.c:1821:2: warning: expression result unused [-Wunused-value]
sv.c:7518:5: warning: expression result unused [-Wunused-value]
op.c:2774:5: warning: expression result unused [-Wunused-value]
sv.c:7994:5: warning: expression result unused [-Wunused-value]
op.c:3942:6: warning: expression result unused [-Wunused-value]
perlio.c:5509:21: warning: comparison of integers of different signs: 'size_t' (aka 'unsigned long') and 'int' [-Wsign-compare]
sv.c:9010:6: warning: expression result unused [-Wunused-value]
sv.c:9011:6: warning: expression result unused [-Wunused-value]
regcomp.c:11718:11: warning: expression result unused [-Wunused-value]
sv.c:9380:5: warning: expression result unused [-Wunused-value]
op.c:5154:5: warning: expression result unused [-Wunused-value]
op.c:5228:5: warning: expression result unused [-Wunused-value]
op.c:5303:2: warning: expression result unused [-Wunused-value]
op.c:5287:5: warning: expression result unused [-Wunused-value]
sv.c:10944:6: warning: expression result unused [-Wunused-value]
pp.c:3175:7: warning: expression result unused [-Wunused-value]
pp.c:3180:7: warning: expression result unused [-Wunused-value]
                    SvPV_force_nolen(sv);op.c:5786:5: warning: expression result unused [-Wunused-value]
op.c:5786:5: warning: expression result unused [-Wunused-value]
sv.c:10982:2: warning: expression result unused [-Wunused-value]
pp.c:3441:2: warning: expression result unused [-Wunused-value]
pp.c:3463:6: warning: expression result unused [-Wunused-value]
pp.c:3438:5: warning: expression result unused [-Wunused-value]
pp.c:3451:5: warning: expression result unused [-Wunused-value]
pp.c:3811:2: warning: expression result unused [-Wunused-value]
pp.c:3949:2: warning: expression result unused [-Wunused-value]
pp.c:4032:4: warning: expression result unused [-Wunused-value]
sv.c:13558:6: warning: expression result unused [-Wunused-value]
pp.c:4083:8: warning: expression result unused [-Wunused-value]
pp.c:4212:2: warning: expression result unused [-Wunused-value]
pp.c:4340:4: warning: expression result unused [-Wunused-value]
pp.c:4403:2: warning: expression result unused [-Wunused-value]
pp.c:4404:2: warning: expression result unused [-Wunused-value]
op.c:7480:7: warning: expression result unused [-Wunused-value]
op.c:7587:5: warning: expression result unused [-Wunused-value]
op.c:8316:6: warning: expression result unused [-Wunused-value]
op.c:9539:4: warning: expression result unused [-Wunused-value]
Dumper.xs:243:2: warning: expression result unused [-Wunused-value]
Dumper.xs:650:4: warning: expression result unused [-Wunused-value]
Dumper.xs:817:37: warning: conversion specifies type 'long' but the argument has type 'U32' (aka 'unsigned int') [-Wformat]
scalar.xs:48:5: warning: expression result unused [-Wunused-value]
./const-c.inc:38:2: warning: expression result unused [-Wunused-value]
./const-c.inc:72:5: warning: expression result unused [-Wunused-value]
./const-c.inc:47:2: warning: expression result unused [-Wunused-value]
./const-c.inc:81:5: warning: expression result unused [-Wunused-value]
Opcode.xs:268:9: warning: expression result unused [-Wunused-value]
Util.xs:55:9: warning: expression result unused [-Wunused-value]
Typemap.xs:88:3: warning: expression result unused [-Wunused-value]
Bzip2.xs:326:5: warning: expression result unused [-Wunused-value]
Socket.xs:227:2: warning: expression result unused [-Wunused-value]
Storable.xs:1852:3: warning: expression result unused [-Wunused-value]
re_comp.c:6035:5: warning: expression result unused [-Wunused-value]
POSIX.xs:1696:2: warning: expression result unused [-Wunused-value]
POSIX.xs:1815:15: warning: expression result unused [-Wunused-value]
Zlib.xs:593:5: warning: expression result unused [-Wunused-value]
SysV.xs:364:5: warning: expression result unused [-Wunused-value]
re_exec.c:4169:19: warning: expression result unused [-Wunused-value]
Storable.xs:4099:2: warning: null passed to a callee which requires a non-null argument [-Wnonnull]
Storable.xs:4532:2: warning: expression result unused [-Wunused-value]
re_exec.c:5426:9: warning: expression result unused [-Wunused-value]
Storable.xs:4835:3: warning: expression result unused [-Wunused-value]
Storable.xs:5417:3: warning: expression result unused [-Wunused-value]
Storable.xs:5464:2: warning: expression result unused [-Wunused-value]
Storable.xs:5504:2: warning: null passed to a callee which requires a non-null argument [-Wnonnull]
Storable.xs:5567:2: warning: null passed to a callee which requires a non-null argument [-Wnonnull]
./const-c.inc:73:5: warning: expression result unused [-Wunused-value]
mro.xs:120:7: warning: expression result unused [-Wunused-value]
Storable.xs:5878:4: warning: expression result unused [-Wunused-value]
Storable.xs:5919:3: warning: expression result unused [-Wunused-value]
Storable.xs:6078:5: warning: expression result unused [-Wunused-value]
APItest.xs:1392:2: warning: expression result unused [-Wunused-value]
APItest.xs:1420:9: warning: expression result unused [-Wunused-value]
APItest.xs:1877:2: warning: expression result unused [-Wunused-value]
APItest.xs:2606:9: warning: expression result unused [-Wunused-value]
FastCalc.xs:337:5: warning: expression result unused [-Wunused-value]
FastCalc.xs:377:5: warning: expression result unused [-Wunused-value]
FastCalc.xs:378:5: warning: expression result unused [-Wunused-value]
Collate.xs:605:2: warning: expression result unused [-Wunused-value]
Collate.xs:595:2: warning: expression result unused [-Wunused-value]
Unicode.xs:176:6: warning: expression result unused [-Wunused-value]
Unicode.xs:331:6: warning: expression result unused [-Wunused-value]
Unicode.xs:323:5: warning: expression result unused [-Wunused-value]
ExtTest.xs:44:2: warning: expression result unused [-Wunused-value]
ExtTest.xs:78:5: warning: expression result unused [-Wunused-value]
pp_hot.c:172:3: warning: result of comparison against a string literal is unspecified (use strncmp instead)
pp_hot.c:1611:3: warning: expression result unused [-Wunused-value]
pp_hot.c:2413:5: warning: result of comparison against a string literal is unspecified (use strncmp instead)
pp_hot.c:2420:2: warning: result of comparison against a string literal is unspecified (use strncmp instead)
util.c:2717:5: warning: expression result unused [-Wunused-value]
pp_sys.c:327:6: warning: result of comparison against a string literal is unspecified (use strncmp instead)
pp_ctl.c:899:7: warning: expression result unused [-Wunused-value]
util.c:2877:5: warning: expression result unused [-Wunused-value]
pp_sys.c:407:5: warning: result of comparison against a string literal is unspecified (use strncmp instead)
pp_ctl.c:1183:5: warning: result of comparison against a string literal is unspecified (use strncmp instead)
pp_ctl.c:1189:2: warning: result of comparison against a string literal is unspecified (use strncmp instead)
pp_sys.c:566:5: warning: result of comparison against a string literal is unspecified (use strncmp instead)
regexec.c:4169:19: warning: expression result unused [-Wunused-value]
regcomp.c:6035:5: warning: expression result unused [-Wunused-value]
toke.c:3910:6: warning: expression result unused [-Wunused-value]
pp_ctl.c:2121:5: warning: result of comparison against a string literal is unspecified (use strncmp instead)
pp_sys.c:920:5: warning: result of comparison against a string literal is unspecified (use strncmp instead)
op.c:4335:6: warning: result of comparison against a string literal is unspecified (use strncmp instead)
pp_sys.c:949:9: warning: result of comparison against a string literal is unspecified (use strncmp instead)
pp_ctl.c:2285:5: warning: result of comparison against a string literal is unspecified (use strncmp instead)
pp_ctl.c:2286:5: warning: result of comparison against a string literal is unspecified (use strncmp instead)
./op.h:638:42: pp_sys.c:1287:6: warning: expression result unused [-Wunused-value]
pp_ctl.c:3358:5: warning: result of comparison against a string literal is unspecified (use strncmp instead)
doio.c:2093:6: warning: expression result unused [-Wunused-value]
pp_ctl.c:3544:6: warning: result of comparison against a string literal is unspecified (use strncmp instead)
pp_ctl.c:3898:7: warning: result of comparison against a string literal is unspecified (use strncmp instead)
pp_ctl.c:4277:2: warning: result of comparison against a string literal is unspecified (use strncmp instead)
pp_ctl.c:4300:5: warning: result of comparison against a string literal is unspecified (use strncmp instead)
pp_ctl.c:4357:5: warning: result of comparison against a string literal is unspecified (use strncmp instead)
pp_ctl.c:4395:5: warning: result of comparison against a string literal is unspecified (use strncmp instead)
pp_ctl.c:4441:5: warning: result of comparison against a string literal is unspecified (use strncmp instead)
pp_ctl.c:4541:3: warning: result of comparison against a string literal is unspecified (use strncmp instead)
pp_ctl.c:4573:3: warning: result of comparison against a string literal is unspecified (use strncmp instead)
pp_ctl.c:4595:6: warning: result of comparison against a string literal is unspecified (use strncmp instead)
pp_ctl.c:4971:5: warning: result of comparison against a string literal is unspecified (use strncmp instead)
pp_ctl.c:5015:5: warning: result of comparison against a string literal is unspecified (use strncmp instead)
pp_ctl.c:5429:2: warning: result of comparison against a string literal is unspecified (use strncmp instead)
sv.c:4515:5: warning: expression result unused [-Wunused-value]
toke.c:10844:2: warning: expression result unused [-Wunused-value]
pp.c:5325:2: warning: result of comparison against a string literal is unspecified (use strncmp instead)
pp.c:5375:2: warning: result of comparison against a string literal is unspecified (use strncmp instead)
pp.c:5935:6: warning: result of comparison against a string literal is unspecified (use strncmp instead)
Call.xs:155:46: warning: conversion specifies type 'int' but the argument has type 'STRLEN' (aka 'unsigned long') [-Wformat]
Call.xs:174:57: warning: conversion specifies type 'int' but the argument has type 'STRLEN' (aka 'unsigned long') [-Wformat]
re_comp.c:3639:5: warning: expression result unused [-Wunused-value]
Base64.xs:421:8: warning: expression result unused [-Wunused-value]
APItest.xs:112:5: warning: expression result unused [-Wunused-value]
doio.c:581:11: warning: passing 'int *' to parameter of type 'socklen_t *' (aka 'unsigned int *') converts between pointers to integer types with different sign [-Wpointer-sign]
pp_sys.c:1658:10: warning: passing 'int *' to parameter of type 'socklen_t *' (aka 'unsigned int *') converts between pointers to integer types with different sign [-Wpointer-sign]
pp_sys.c:2547:10: warning: passing 'int *' to parameter of type 'socklen_t *' (aka 'unsigned int *') converts between pointers to integer types with different sign [-Wpointer-sign]
pp_sys.c:2638:6: warning: passing 'int *' to parameter of type 'socklen_t *' (aka 'unsigned int *') converts between pointers to integer types with different sign [-Wpointer-sign]
pp_sys.c:2708:6: warning: passing 'int *' to parameter of type 'socklen_t *' (aka 'unsigned int *') converts between pointers to integer types with different sign [-Wpointer-sign]
pp_sys.c:2712:6: warning: passing 'int *' to parameter of type 'socklen_t *' (aka 'unsigned int *') converts between pointers to integer types with different sign [-Wpointer-sign]
regexec.c:2580:8: warning: expression result unused [-Wunused-value]
In file included from ./perl.h:op.c:2774:5: warning: expression result unused [-Wunused-value]
Call.xs:62:58: warning: conversion specifies type 'int' but the argument has type 'STRLEN' (aka 'unsigned long') [-Wformat]
Call.xs:62:78: warning: conversion specifies type 'int' but the argument has type 'STRLEN' (aka 'unsigned long') [-Wformat]
Call.xs:99:53: warning: conversion specifies type 'int' but the argument has type 'STRLEN' (aka 'unsigned long') [-Wformat]
re_exec.c:2580:8: warning: expression result unused [-Wunused-value]
op.c:5154:5: warning: expression result unused [-Wunused-value]pp_sys.c:920:5: warning: result of comparison against a string literal is unspecified (use strncmp instead)
pp_hot.c:pp.c:1831:3: warning: expression result unused [-Wunused-value]
toke.c 10844:2: warning: In file included from expr:28:
-- 
Report by Test::Smoke v1.44 build 1285 running on perl 5.10.1
(Reporter v0.035 / Smoker v0.045)




nntp.perl.org: Perl Programming lists via nntp and http.
Comments to Ask Bjørn Hansen at ask@perl.org | Group listing | About