develooper Front page | perl.perl5.porters | Postings from July 2011

Smoke [blead] v5.15.0-152-gde2902a FAIL(F) MSWin32 Win2000 SP4 (x86/1 cpu)

From:
George Greer
Date:
July 3, 2011 02:45
Subject:
Smoke [blead] v5.15.0-152-gde2902a FAIL(F) MSWin32 Win2000 SP4 (x86/1 cpu)
Message ID:
201107030945.p639jcnp018690@m-l.org
Smoke logs available at http://m-l.org/~perl/smoke/perl/

Automated smoke report for 5.15.0 patch de2902a66f5c4d896fc31460aaaf35320b576183 v5.15.0-152-gde2902a
perl-win2k: Intel(R) Core(TM) i7 CPU 920 @ 2.67GHz(~2673 MHz) (x86/1 cpu)
    on        MSWin32 - Win2000 SP4
    using     cl version 14.00.50727.762
    smoketime 2 hours 43 minutes (average 40 minutes 56 seconds)

Summary: FAIL(F)

O = OK  F = Failure(s), extended report at the bottom
X = Failure(s) under TEST but not under harness
? = still running or test results not (yet) available
Build failures during:       - = unknown or N/A
c = Configure, m = make, M = make (after miniperl), t = make test-prep

v5.15.0-152-gde2902a  Configuration (common) none
----------- ---------------------------------------------------------
F F         
O O         -Duseithreads
| +--------- -DDEBUGGING
+----------- no debugging


Locally applied patches:
    uncommitted-changes
    SMOKEde2902a66f5c4d896fc31460aaaf35320b576183

Failures: (common-args) none
[default] 
../cpan/CPANPLUS/t/04_CPANPLUS-Module.t.....................FAILED
    109
    Non-zero exit status: 1
../cpan/CPANPLUS/t/20_CPANPLUS-Dist-MM.t....................FAILED
    11-12, 14, 17-18, 42
    Non-zero exit status: 2
../cpan/ExtUtils-Constant/t/Constant.t......................FAILED
    3
    Bad plan.  You planned 302 tests but ran 3.
../cpan/ExtUtils-MakeMaker/t/basic.t........................FAILED
    22-51, 53-54, 56-62
    Non-zero exit status: 39
../cpan/ExtUtils-MakeMaker/t/INSTALL_BASE.t.................FAILED
    5-17
    Non-zero exit status: 13
../cpan/ExtUtils-MakeMaker/t/miniperl.t.....................FAILED
    5
    Non-zero exit status: 1
../cpan/ExtUtils-MakeMaker/t/PL_FILES.t.....................FAILED
    3-7
    Non-zero exit status: 5
../cpan/ExtUtils-MakeMaker/t/pm_to_blib.t...................FAILED
    4-5, 7
    Non-zero exit status: 2
../cpan/ExtUtils-MakeMaker/t/recurs.t.......................FAILED
    6, 14
    Non-zero exit status: 2
../cpan/ExtUtils-MakeMaker/t/xs.t...........................FAILED
    4-5
    Non-zero exit status: 2
../cpan/Memoize/t/expmod_t.t................................FAILED
    7

[default] -DDEBUGGING
../t/op/alarm.t.............................................FAILED
    4
../cpan/Memoize/t/expmod_t.t................................FAILED
    7
../cpan/Time-HiRes/t/usleep.t...............................FAILED
    3-6
    Non-zero exit status: 4

Passed Todo tests: (common-args) none
[default] 
[default] -DDEBUGGING
[default] -Duseithreads
[default] -DDEBUGGING -Duseithreads
../cpan/CGI/t/tmpdir.t......................................PASSED
    3-9

Compiler messages(MSWin32):
Cwd.xs(74) : warning C4101: 'symlink' : unreferenced local variable
Base64.xs(394) : warning C4146: unary minus operator applied to unsigned type, result still unsigned
Base64.xs(396) : warning C4146: unary minus operator applied to unsigned type, result still unsigned
Piece.xs(950) : warning C4101: 'ret' : unreferenced local variable
# NMAKE : fatal error U1077: 'D:\smoke\perl\blead\build\t\perl.exe' : return code '0x1'
# NMAKE : fatal error U1077: '"C:\Program Files\Microsoft Visual Studio 8\VC\BIN\nmake.EXE"' : return code '0x2'
d:\smoke\perl\blead\build\win32\perlhost.h(1713) : warning C4101: 'tmpgv' : unreferenced local variable
threads.xs(985) : warning C4101: 'num_args' : unreferenced local variable

-- 
Report by Test::Smoke v1.42 build 1267 running on perl 5.10.0
(Reporter v0.035 / Smoker v0.045)




nntp.perl.org: Perl Programming lists via nntp and http.
Comments to Ask Bjørn Hansen at ask@perl.org | Group listing | About