develooper Front page | perl.perl5.porters | Postings from February 2011

Smoke [blead] v5.13.10-111-g2d8e9a3 FAIL(F) MSWin32 Win2000 SP4 (x86/1 cpu)

From:
George Greer
Date:
February 27, 2011 15:30
Subject:
Smoke [blead] v5.13.10-111-g2d8e9a3 FAIL(F) MSWin32 Win2000 SP4 (x86/1 cpu)
Message ID:
201102271636.p1RGaKI5010039@m-l.org
Smoke logs available at http://m-l.org/~perl/smoke/perl/

Automated smoke report for 5.13.10 patch 2d8e9a359dd21666ebf38dd2eadd7eecadaa7363 v5.13.10-111-g2d8e9a3
perl-win2k: Intel(R) Core(TM) i7 CPU 920 @ 2.67GHz(~2676 MHz) (x86/1 cpu)
    on        MSWin32 - Win2000 SP4
    using     cl version 14.00.50727.762
    smoketime 4 hours 10 minutes (average 31 minutes 17 seconds)

Summary: FAIL(F)

O = OK  F = Failure(s), extended report at the bottom
X = Failure(s) under TEST but not under harness
? = still running or test results not (yet) available
Build failures during:       - = unknown or N/A
c = Configure, m = make, M = make (after miniperl), t = make test-prep

v5.13.10-111-g2d8e9a3  Configuration (common) none
----------- ---------------------------------------------------------
F F         
O F         -Duselargefiles
O F         -Duseithreads
F F         -Duseithreads -Duselargefiles
| +--------- -DDEBUGGING
+----------- no debugging


Locally applied patches:
    uncommitted-changes
    SMOKE2d8e9a359dd21666ebf38dd2eadd7eecadaa7363

Failures: (common-args) none
[default] 
[default] -Duseithreads -Duselargefiles
../cpan/Memoize/t/expmod_t.t................................FAILED
    7

[default] -DDEBUGGING
../t/op/alarm.t.............................................FAILED
    4

[default] -DDEBUGGING -Duselargefiles
[default] -DDEBUGGING -Duseithreads
../t/op/alarm.t.............................................FAILED
    4
../cpan/Memoize/t/expmod_t.t................................FAILED
    7

[default] -DDEBUGGING -Duseithreads -Duselargefiles
../t/op/alarm.t.............................................FAILED
    4
../cpan/Memoize/t/expmod_t.t................................FAILED
    7, 10

Compiler messages(MSWin32):
Cwd.xs(75) : warning C4101: 'symlink' : unreferenced local variable
Base64.xs(394) : warning C4146: unary minus operator applied to unsigned type, result still unsigned
Base64.xs(396) : warning C4146: unary minus operator applied to unsigned type, result still unsigned
Piece.xs(950) : warning C4101: 'ret' : unreferenced local variable
threads.xs(985) : warning C4101: 'num_args' : unreferenced local variable

-- 
Report by Test::Smoke v1.42 build 1267 running on perl 5.10.0
(Reporter v0.035 / Smoker v0.045)




nntp.perl.org: Perl Programming lists via nntp and http.
Comments to Ask Bjørn Hansen at ask@perl.org | Group listing | About