develooper Front page | perl.perl5.porters | Postings from February 2011

Smoke [5.13.10] v5.13.10-31-g3097108 FAIL(XF) netbsd 5.1 (i386/1 cpu)

From:
Steven Schubiger
Date:
February 22, 2011 02:29
Subject:
Smoke [5.13.10] v5.13.10-31-g3097108 FAIL(XF) netbsd 5.1 (i386/1 cpu)
Message ID:
4d638ffb.2191d80a.217c.031b@mx.google.com
Automated smoke report for 5.13.10 patch 3097108be5f219f149228ea1c8c8c14b1e4e2199 v5.13.10-31-g3097108
p5netbsd: Intel 686-class (i386/1 cpu)
    on        netbsd - 5.1
    using     cc version 4.1.3 20080704 prerelease (NetBSD nb2 20081120)
    smoketime 12 hours 17 minutes (average 1 hour 32 minutes)

Summary: FAIL(XF)

O = OK  F = Failure(s), extended report at the bottom
X = Failure(s) under TEST but not under harness
? = still running or test results not (yet) available
Build failures during:       - = unknown or N/A
c = Configure, m = make, M = make (after miniperl), t = make test-prep

v5.13.10-31-g3097108  Configuration (common) none
----------- ---------------------------------------------------------
F F F F     
O O O O     -Duse64bitint
O X O O     -Duseithreads
O O O O     -Duseithreads -Duse64bitint
| | | +----- PERLIO = perlio -DDEBUGGING
| | +------- PERLIO = stdio  -DDEBUGGING
| +--------- PERLIO = perlio
+----------- PERLIO = stdio


Locally applied patches:
    uncommitted-changes
    SMOKE3097108be5f219f149228ea1c8c8c14b1e4e2199

Failures: (common-args) none
[stdio] 
    ../t/re/reg_fold.t..........................................FAILED
        12, 14
    ../t/uni/fold.t.............................................FAILED
        465, 666, 763, 1468, 1949, 2166, 3855, 4768
        4777, 4786, 4795, 4804, 4821, 5502, 5511
        5520, 5529, 5634, 5643, 5652, 5661, 5670
        5679, 5688, 5697, 5706, 5715, 5724, 5733
        5742, 5751, 5760, 5769, 5778, 5787, 5796
        5805, 5814, 5823, 5832, 5841, 5850, 5859
        5868, 5877, 5886, 5895, 5904, 5913, 5922
        5931, 5940, 5949, 5958, 5967, 5976, 5985
        5994, 6003, 6012, 6021, 6030, 6039, 6048
        6057, 6066, 6075, 6084, 6093, 6102, 6143
        6160, 6169, 6178, 6187, 6196, 6237, 6246
        6255, 6264, 6273, 6314, 6323, 6332, 6341
        6350, 6399, 6408, 6417, 6426, 6435, 6476
        8485, 8494, 8503, 8512, 8521, 8530, 8539
        8548, 8557, 8566, 8575, 8584
Inconsistent test results (between TEST and harness):
    ../lib/Benchmark.t......................FAILED at test 126

[perlio] 
    ../lib/Benchmark.t..........................................FAILED
        126-127
        Non-zero exit status: 2
    ../t/re/reg_fold.t..........................................FAILED
        12, 14
    ../t/uni/fold.t.............................................FAILED
        465, 666, 763, 1468, 1949, 2166, 3855, 4768
        4777, 4786, 4795, 4804, 4821, 5502, 5511
        5520, 5529, 5634, 5643, 5652, 5661, 5670
        5679, 5688, 5697, 5706, 5715, 5724, 5733
        5742, 5751, 5760, 5769, 5778, 5787, 5796
        5805, 5814, 5823, 5832, 5841, 5850, 5859
        5868, 5877, 5886, 5895, 5904, 5913, 5922
        5931, 5940, 5949, 5958, 5967, 5976, 5985
        5994, 6003, 6012, 6021, 6030, 6039, 6048
        6057, 6066, 6075, 6084, 6093, 6102, 6143
        6160, 6169, 6178, 6187, 6196, 6237, 6246
        6255, 6264, 6273, 6314, 6323, 6332, 6341
        6350, 6399, 6408, 6417, 6426, 6435, 6476
        8485, 8494, 8503, 8512, 8521, 8530, 8539
        8548, 8557, 8566, 8575, 8584

[stdio/perlio] -DDEBUGGING
    ../t/re/reg_fold.t..........................................FAILED
        12, 14
    ../t/uni/fold.t.............................................FAILED
        465, 666, 763, 1468, 1949, 2166, 3855, 4768
        4777, 4786, 4795, 4804, 4821, 5502, 5511
        5520, 5529, 5634, 5643, 5652, 5661, 5670
        5679, 5688, 5697, 5706, 5715, 5724, 5733
        5742, 5751, 5760, 5769, 5778, 5787, 5796
        5805, 5814, 5823, 5832, 5841, 5850, 5859
        5868, 5877, 5886, 5895, 5904, 5913, 5922
        5931, 5940, 5949, 5958, 5967, 5976, 5985
        5994, 6003, 6012, 6021, 6030, 6039, 6048
        6057, 6066, 6075, 6084, 6093, 6102, 6143
        6160, 6169, 6178, 6187, 6196, 6237, 6246
        6255, 6264, 6273, 6314, 6323, 6332, 6341
        6350, 6399, 6408, 6417, 6426, 6435, 6476
        8485, 8494, 8503, 8512, 8521, 8530, 8539
        8548, 8557, 8566, 8575, 8584

[perlio] -Duseithreads
Inconsistent test results (between TEST and harness):
    ../lib/Benchmark.t......................FAILED at test 126

Compiler messages(gcc):
perlio.c: In function 'PerlIOStdio_set_ptrcnt':
perlio.c:3604: warning: pointer targets in assignment differ in signedness
/usr/include/sys/cdefs_elf.h:67:20: error: missing binary operator before token "("
<command line>:1:1: warning: "TIME_HIRES_STAT" redefined
<command line>:1:1: warning: this is the location of the previous definition

-- 
Report by Test::Smoke v1.44 build 1285 running on perl 5.10.1
(Reporter v0.035 / Smoker v0.045)



nntp.perl.org: Perl Programming lists via nntp and http.
Comments to Ask Bjørn Hansen at ask@perl.org | Group listing | About