develooper Front page | perl.perl5.porters | Postings from January 2011

Smoke [5.13.9] v5.13.9-177-gf273d1e FAIL(m) linux 2.6.32-5-686 [debian] (i686/2 cpu)

From:
njh
Date:
January 29, 2011 17:26
Subject:
Smoke [5.13.9] v5.13.9-177-gf273d1e FAIL(m) linux 2.6.32-5-686 [debian] (i686/2 cpu)
Message ID:
201101300126.p0U1QbVN011127@bandsman.co.uk
Automated smoke report for 5.13.9 patch f273d1e71b9adb1a3c7c0328e241b61d2b3de153 v5.13.9-177-gf273d1e
gateway.bandsman.co.uk: AMD Athlon(tm) Dual Core Processor 4850e (AuthenticAMD 2512MHz) (i686/2 cpu)
    on        linux - 2.6.32-5-686 [debian]
    using     cc version 4.4.5
    smoketime 1 minute 14 seconds (average 1 minute 14 seconds)

Summary: FAIL(m)

O = OK  F = Failure(s), extended report at the bottom
X = Failure(s) under TEST but not under harness
? = still running or test results not (yet) available
Build failures during:       - = unknown or N/A
c = Configure, m = make, M = make (after miniperl), t = make test-prep

v5.13.9-177-gf273d1e  Configuration (common) -Accflags="-O2 -W -Wformat=2 -Wall -Wextra -pipe -mtune=native -march=native -fomit-frame-pointer -ffast-math -msse2 -msse -mmmx -mfpmath=sse -D_FORTIFY_SOURCE=2 -fstack-protector -Wstack-protector -Wfloat-equal"
----------- ---------------------------------------------------------
m -         -Duseithreads
| +--------- -DDEBUGGING
+----------- no debugging


Locally applied patches:
    uncommitted-changes
    SMOKEf273d1e71b9adb1a3c7c0328e241b61d2b3de153

Compiler messages(gcc):
try.c: In function ‘main’:
try.c:1: warning: unused parameter ‘argc’
try.c:1: warning: unused parameter ‘argv’
try.c: In function ‘blech’:
try.c:8: warning: unused parameter ‘s’
try.c: In function ‘blech_in_list’:
try.c:9: warning: unused parameter ‘s’
try.c:31: warning: control reaches end of non-void function
try.c:28: warning: unused parameter ‘x’
try.c:36: warning: ignoring return value of ‘pipe’, declared with attribute warn_unused_result
try.c:37: warning: ignoring return value of ‘pipe’, declared with attribute warn_unused_result
try.c:53: warning: ignoring return value of ‘write’, declared with attribute warn_unused_result
try.c:66: warning: ignoring return value of ‘write’, declared with attribute warn_unused_result
try.c:72: warning: ignoring return value of ‘write’, declared with attribute warn_unused_result
try.c:78: warning: ignoring return value of ‘read’, declared with attribute warn_unused_result
try.c:8: warning: unused parameter ‘x’
try.c:3: warning: unused parameter ‘argc’
try.c:3: warning: unused parameter ‘argv’
try.c: In function ‘bletch’:
try.c:11: warning: unused parameter ‘s’
try.c:41: warning: comparison between signed and unsigned integer expressions
try.c:42: warning: comparison between signed and unsigned integer expressions
try.c:46: warning: format ‘%x’ expects type ‘unsigned int’, but argument 2 has type ‘long unsigned int’
try.c:56: warning: format ‘%x’ expects type ‘unsigned int’, but argument 2 has type ‘long unsigned int’
try.c:12: warning: unused parameter ‘argv’
try.c:52: warning: comparison between signed and unsigned integer expressions
gv.c: In function ‘Perl_Gv_AMupdate’:
gv.c:1809: warning: comparing floating point with == or != is unsafe
gv.c: In function ‘Perl_amagic_call’:
gv.c:2192: warning: comparing floating point with == or != is unsafe
gv.c:2461: warning: comparing floating point with == or != is unsafe
dquote_static.c:19: error: conflicting types for ‘S_regcurly’
toke.c: In function ‘S_printbuf’:
toke.c:470: warning: format not a string literal, argument types not checked
toke.c: In function ‘S_scan_const’:
toke.c:2902: warning: passing argument 1 of ‘S_regcurly’ from incompatible pointer type
toke.c:2902: error: too many arguments to function ‘S_regcurly’
toke.c: In function ‘S_intuit_more’:
toke.c:3543: warning: passing argument 1 of ‘S_regcurly’ from incompatible pointer type
toke.c:3543: error: too many arguments to function ‘S_regcurly’
toke.c: In function ‘Perl_yylex’:
toke.c:6862: warning: format not a string literal, argument types not checked
toke.c: In function ‘S_pending_ident’:
toke.c:8284: warning: format not a string literal, argument types not checked
toke.c: In function ‘S_new_constant’:
toke.c:8521: warning: comparing floating point with == or != is unsafe

-- 
Report by Test::Smoke v1.44 build 1285 running on perl 5.10.1
(Reporter v0.035 / Smoker v0.045)



nntp.perl.org: Perl Programming lists via nntp and http.
Comments to Ask Bjørn Hansen at ask@perl.org | Group listing | About