develooper Front page | perl.perl5.porters | Postings from September 2010

Smoke [5.13.5] v5.13.5-251-g6c2fd45 FAIL(F) openvms V8.3-1H1 (IA64/2cpu)

From:
Craig A. Berry
Date:
September 30, 2010 02:15
Subject:
Smoke [5.13.5] v5.13.5-251-g6c2fd45 FAIL(F) openvms V8.3-1H1 (IA64/2cpu)
Message ID:
0L9J002ZMZ2DUK70@asmtp013.mac.com
Automated smoke report for 5.13.5 patch 6c2fd45e9787b7da8a64f6f86ec33cadd21655b8 v5.13.5-251-g6c2fd45
ALMA: HP rx2600  (1.50GHz/6.0MB) (IA64/2 cpu)
    on        openvms - V8.3-1H1
    using     ? CC/DECC version 70390019
    smoketime 3 hours 55 minutes (average 1 hour 57 minutes)

Summary: FAIL(F)

O = OK  F = Failure(s), extended report at the bottom
X = Failure(s) under TEST but not under harness
? = still running or test results not (yet) available
Build failures during:       - = unknown or N/A
c = Configure, m = make, M = make (after miniperl), t = make test-prep

v5.13.5-251-g6c2fd45  Configuration (common) none
----------- ---------------------------------------------------------
? -         
F -         -Duseithreads
| +--------- -DDEBUGGING
+----------- no debugging


Locally applied patches:
    uncommitted-changes
    SMOKE6c2fd45e9787b7da8a64f6f86ec33cadd21655b8

Failures: (common-args) none
[default] -Duseithreads
    t/op/alarm.....................................................FAILED--unexpected output at test 2
    cpan/autodie/t/open............................................FAILED at test 13
    cpan/ExtUtils-MakeMaker/t/prereq...............................FAILED--expected 13 tests, saw 5
    cpan/Module-Build/t/tilde......................................FAILED at test 16
    cpan/Test-Harness/t/source.....................................FAILED at test 36
    cpan/Time-HiRes/t/HiRes........................................FAILED at test 41
    dist/ExtUtils-ParseXS/t/basic..................................FAILED--expected 10 tests, saw 7
    dist/ExtUtils-ParseXS/t/more...................................FAILED--expected 25 tests, saw 6
    dist/ExtUtils-ParseXS/t/usage..................................FAILED--expected 24 tests, saw 6
    lib/File/DosGlob...............................................FAILED--expected 17 tests, saw 10
    lib/perl5db....................................................FAILED at test 9
    t/porting/exec-bit.............................................FAILED at test 1

-- 
Report by Test::Smoke v1.39 build 1235 running on perl 5.10.0
(Reporter v0.035 / Smoker v0.044)



nntp.perl.org: Perl Programming lists via nntp and http.
Comments to Ask Bjørn Hansen at ask@perl.org | Group listing | About