develooper Front page | perl.perl5.porters | Postings from September 2010

Smoke [5.13.5] v5.13.5-247-g5233ad2 FAIL(XF) linux 2.6.26-2-openvz-686 [slackware] (i686/4 cpu)

From:
Steven Schubiger
Date:
September 29, 2010 23:49
Subject:
Smoke [5.13.5] v5.13.5-247-g5233ad2 FAIL(XF) linux 2.6.26-2-openvz-686 [slackware] (i686/4 cpu)
Message ID:
4ca432de.cf7d0e0a.4d6c.0e08@mx.google.com
Automated smoke report for 5.13.5 patch 5233ad255ae7fe1debb56a6b67e408e699ea4fe0 v5.13.5-247-g5233ad2
p5slackware: Intel(R) Xeon(R) CPU X3320 @ 2.50GHz (GenuineIntel 2500MHz) (i686/4 cpu)
    on        linux - 2.6.26-2-openvz-686 [slackware]
    using     cc version 4.4.4
    smoketime 7 hours 48 minutes (average 29 minutes 17 seconds)

Summary: FAIL(XF)

O = OK  F = Failure(s), extended report at the bottom
X = Failure(s) under TEST but not under harness
? = still running or test results not (yet) available
Build failures during:       - = unknown or N/A
c = Configure, m = make, M = make (after miniperl), t = make test-prep

v5.13.5-247-g5233ad2  Configuration (common) none
----------- ---------------------------------------------------------
O O F F     
O O O O     -Duse64bitint
O O F F     -Duselongdouble
O O O O     -Dusemorebits
O O X O     -Duseithreads
X O F O     -Duseithreads -Duse64bitint
X O X O     -Duseithreads -Duselongdouble
O X O O     -Duseithreads -Dusemorebits
| | | +----- PERLIO = perlio -DDEBUGGING
| | +------- PERLIO = stdio  -DDEBUGGING
| +--------- PERLIO = perlio
+----------- PERLIO = stdio


Locally applied patches:
    uncommitted-changes
    SMOKE5233ad255ae7fe1debb56a6b67e408e699ea4fe0

Failures: (common-args) none
[stdio/perlio] -DDEBUGGING
[stdio/perlio] -DDEBUGGING -Duselongdouble
    ../t/op/gv.t................................................??????
Inconsistent test results (between TEST and harness):
    ../t/op/gv.t............................FAILED--non-zero wait status: 6

[stdio] -DDEBUGGING -Duseithreads
[stdio] -Duseithreads -Duse64bitint
[stdio] -Duseithreads -Duselongdouble
[stdio] -DDEBUGGING -Duseithreads -Duselongdouble
[perlio] -Duseithreads -Dusemorebits
Inconsistent test results (between TEST and harness):
    ../t/op/threads.t.......................FAILED--expected 23 tests, saw 9

[stdio] -DDEBUGGING -Duseithreads -Duse64bitint
    ../t/op/threads.t...........................................FAILED
        Bad plan.  You planned 23 tests but ran 9.

Compiler messages(gcc):
regcomp.c: In function 'Perl_re_compile':
regcomp.c:4276: warning: variable 'exp' might be clobbered by 'longjmp' or 'vfork'
regcomp.c:4277: warning: variable 'xend' might be clobbered by 'longjmp' or 'vfork'
regcomp.c:4292: warning: variable 're_debug_flags' might be clobbered by 'longjmp' or 'vfork'

-- 
Report by Test::Smoke v1.43 build 1271 running on perl 5.10.1
(Reporter v0.035 / Smoker v0.045)



nntp.perl.org: Perl Programming lists via nntp and http.
Comments to Ask Bjørn Hansen at ask@perl.org | Group listing | About