develooper Front page | perl.perl5.porters | Postings from September 2010

Smoke [5.13.5] v5.13.5-48-g125218e FAIL(XF) linux 2.6.26-2-openvz-686 [slackware] (i686/4 cpu)

From:
Steven Schubiger
Date:
September 21, 2010 23:42
Subject:
Smoke [5.13.5] v5.13.5-48-g125218e FAIL(XF) linux 2.6.26-2-openvz-686 [slackware] (i686/4 cpu)
Message ID:
4c99a541.487e0e0a.1f06.652f@mx.google.com
Automated smoke report for 5.13.5 patch 125218eb5a6d12e7435d3243190b94fc5bb0c7d4 v5.13.5-48-g125218e
p5slackware: Intel(R) Xeon(R) CPU X3320 @ 2.50GHz (GenuineIntel 2500MHz) (i686/4 cpu)
    on        linux - 2.6.26-2-openvz-686 [slackware]
    using     cc version 4.4.4
    smoketime 7 hours 41 minutes (average 28 minutes 51 seconds)

Summary: FAIL(XF)

O = OK  F = Failure(s), extended report at the bottom
X = Failure(s) under TEST but not under harness
? = still running or test results not (yet) available
Build failures during:       - = unknown or N/A
c = Configure, m = make, M = make (after miniperl), t = make test-prep

v5.13.5-48-g125218e  Configuration (common) none
----------- ---------------------------------------------------------
O O O O     
O O O O     -Duse64bitint
O O O X     -Duselongdouble
O O O O     -Dusemorebits
O O O O     -Duseithreads
O O O O     -Duseithreads -Duse64bitint
O O X O     -Duseithreads -Duselongdouble
O X F O     -Duseithreads -Dusemorebits
| | | +----- PERLIO = perlio -DDEBUGGING
| | +------- PERLIO = stdio  -DDEBUGGING
| +--------- PERLIO = perlio
+----------- PERLIO = stdio


Locally applied patches:
    uncommitted-changes
    SMOKE125218eb5a6d12e7435d3243190b94fc5bb0c7d4

Failures: (common-args) none
[perlio] -DDEBUGGING -Duselongdouble
Inconsistent test results (between TEST and harness):
    ../lib/File/stat.t......................FAILED at test 11

[stdio] -DDEBUGGING -Duseithreads -Duselongdouble
[perlio] -Duseithreads -Dusemorebits
Inconsistent test results (between TEST and harness):
    ../t/op/threads.t.......................FAILED--expected 23 tests, saw 9

[stdio] -DDEBUGGING -Duseithreads -Dusemorebits
    ../t/op/threads.t...........................................FAILED
        Bad plan.  You planned 23 tests but ran 9.

Compiler messages(gcc):
regcomp.c: In function 'Perl_re_compile':
regcomp.c:4273: warning: variable 'exp' might be clobbered by 'longjmp' or 'vfork'
regcomp.c:4274: warning: variable 'xend' might be clobbered by 'longjmp' or 'vfork'
./const-xs.inc:829:14: warning: extra tokens at end of #else directive
./const-xs.inc:494:14: warning: extra tokens at end of #else directive
./const-xs.inc:497:14: warning: extra tokens at end of #else directive
./const-xs.inc:500:14: warning: extra tokens at end of #else directive
./const-xs.inc:503:14: warning: extra tokens at end of #else directive
./const-xs.inc:506:14: warning: extra tokens at end of #else directive
./const-xs.inc:509:14: warning: extra tokens at end of #else directive
ExtTest.xs:121:14: warning: extra tokens at end of #else directive
regcomp.c:4289: warning: variable 're_debug_flags' might be clobbered by 'longjmp' or 'vfork'

-- 
Report by Test::Smoke v1.43 build 1271 running on perl 5.10.1
(Reporter v0.035 / Smoker v0.045)



nntp.perl.org: Perl Programming lists via nntp and http.
Comments to Ask Bjørn Hansen at ask@perl.org | Group listing | About