develooper Front page | perl.perl5.porters | Postings from September 2010

Smoke [5.13.4] v5.13.4-301-gab296a2 FAIL(F) MSWin32 WinXP/.Net SP3 (x86/2 cpu)

From:
Steve Hay
Date:
September 16, 2010 01:10
Subject:
Smoke [5.13.4] v5.13.4-301-gab296a2 FAIL(F) MSWin32 WinXP/.Net SP3 (x86/2 cpu)
Message ID:
UKMAIL02wakzNFfhWVz000011e2@ukmail02.planit.group
Automated smoke report for 5.13.4 patch ab296a20b432e195903c2794a3ea834e03f0134b v5.13.4-301-gab296a2
maldoror.bath.planit.group: Intel(R) Core(TM)2 CPU 6700 @ 2.66GHz(~2660 MHz) (x86/2 cpu)
    on        MSWin32 - WinXP/.Net SP3
    using     cl version 13.10.3077
    smoketime 7 hours 9 minutes (average 42 minutes 57 seconds)

Summary: FAIL(F)

O = OK  F = Failure(s), extended report at the bottom
X = Failure(s) under TEST but not under harness
? = still running or test results not (yet) available
Build failures during:       - = unknown or N/A
c = Configure, m = make, M = make (after miniperl), t = make test-prep

v5.13.4-301-gab296a2  Configuration (common) -DCCTYPE=MSVC70FREE -DINST_TOP=$(INST_DRV)\Smoke\doesntexist
----------- ---------------------------------------------------------
F F         -Duselargefiles
F F         -Duselargefiles -Dusemymalloc
F F         -Duselargefiles -Duseithreads -Uuseimpsys
F F         -Duselargefiles -Duseithreads -Uuseimpsys -Dusemymalloc
F F         -Duselargefiles -Duseithreads
| +--------- -DDEBUGGING
+----------- no debugging


Locally applied patches:
    uncommitted-changes
    SMOKEab296a20b432e195903c2794a3ea834e03f0134b

Failures: (common-args) -DCCTYPE=MSVC70FREE -DINST_TOP=$(INST_DRV)\Smoke\doesntexist
[default] -Duselargefiles
[default] -DDEBUGGING -Duselargefiles
[default] -Duselargefiles -Dusemymalloc
[default] -DDEBUGGING -Duselargefiles -Dusemymalloc
[default] -Duselargefiles -Duseithreads -Uuseimpsys
[default] -DDEBUGGING -Duselargefiles -Duseithreads -Uuseimpsys
[default] -Duselargefiles -Duseithreads -Uuseimpsys -Dusemymalloc
[default] -DDEBUGGING -Duselargefiles -Duseithreads -Uuseimpsys -Dusemymalloc
[default] -DDEBUGGING -Duselargefiles -Duseithreads
../cpan/B-Debug/t/debug.t...................................FAILED
    9
    Non-zero exit status: 1

[default] -Duselargefiles -Duseithreads
../cpan/B-Debug/t/debug.t...................................FAILED
    9
    Non-zero exit status: 1
../dist/IO/t/io_sock.t......................................FAILED
    25
    Non-zero exit status: 54
    Bad plan.  You planned 26 tests but ran 25.

Compiler messages(MSWin32):
..\hv.c(2982) : warning C4028: formal parameter 1 different from declaration
..\hv.c(3018) : warning C4028: formal parameter 1 different from declaration
Cwd.xs(75) : warning C4101: 'symlink' : unreferenced local variable
Base64.xs(343) : warning C4146: unary minus operator applied to unsigned type, result still unsigned
Base64.xs(345) : warning C4146: unary minus operator applied to unsigned type, result still unsigned
Piece.xs(950) : warning C4101: 'ret' : unreferenced local variable
..\hv.c(2982) : warning C4028: formal parameter 2 different from declaration
..\hv.c(3018) : warning C4028: formal parameter 2 different from declaration

-- 
Report by Test::Smoke v1.43 build 1271 running on perl 5.11.0
(Reporter v0.035 / Smoker v0.045)




nntp.perl.org: Perl Programming lists via nntp and http.
Comments to Ask Bjørn Hansen at ask@perl.org | Group listing | About