develooper Front page | perl.perl5.porters | Postings from September 2010

Smoke [5.13.4] v5.13.4-180-gf83b46a FAIL(Xm) netbsd 5.0.2 (i386/1 cpu)

From:
Steven Schubiger
Date:
September 8, 2010 19:10
Subject:
Smoke [5.13.4] v5.13.4-180-gf83b46a FAIL(Xm) netbsd 5.0.2 (i386/1 cpu)
Message ID:
4c884219.5f25e30a.6046.225e@mx.google.com
Automated smoke report for 5.13.4 patch f83b46a0147ba6f476add85d17f61a7e7fb00f21 v5.13.4-180-gf83b46a
p5netbsd: Intel 686-class (i386/1 cpu)
    on        netbsd - 5.0.2
    using     cc version 4.1.3 20080704 prerelease (NetBSD nb2 20081120)
    smoketime 4 hours 32 minutes (average 34 minutes 2 seconds)

Summary: FAIL(Xm)

O = OK  F = Failure(s), extended report at the bottom
X = Failure(s) under TEST but not under harness
? = still running or test results not (yet) available
Build failures during:       - = unknown or N/A
c = Configure, m = make, M = make (after miniperl), t = make test-prep

v5.13.4-180-gf83b46a  Configuration (common) none
----------- ---------------------------------------------------------
m - m -     
m - m -     -Duse64bitint
O O O O     -Duseithreads
X X O O     -Duseithreads -Duse64bitint
| | | +----- PERLIO = perlio -DDEBUGGING
| | +------- PERLIO = stdio  -DDEBUGGING
| +--------- PERLIO = perlio
+----------- PERLIO = stdio


Locally applied patches:
    uncommitted-changes
    SMOKEf83b46a0147ba6f476add85d17f61a7e7fb00f21

Failures: (common-args) none
[stdio] -Duseithreads -Duse64bitint
Inconsistent test results (between TEST and harness):
    ../lib/Benchmark.t......................FAILED at test 126

[perlio] -Duseithreads -Duse64bitint
Inconsistent test results (between TEST and harness):
    ../lib/Benchmark.t......................FAILED at test 127

Compiler messages(gcc):
pp_hot.c: In function 'Perl_pp_iter':
pp_hot.c:1938: warning: implicit declaration of function 'CxPADLOOP'
perlio.c: In function 'PerlIOStdio_set_ptrcnt':
perlio.c:3440: warning: pointer targets in assignment differ in signedness
pp_hot.o: In function `Perl_pp_iter':
pp_hot.c:(.text+0x3be5): undefined reference to `CxPADLOOP'
scope.c: In function 'Perl_cx_dump':
scope.c:1247: warning: implicit declaration of function 'CxPADLOOP'
/home/sts/source/p5-current/pp_hot.c:1938: undefined reference to `CxPADLOOP'
scope.o: In function `Perl_cx_dump':
/home/sts/source/p5-current/scope.c:1246: undefined reference to `CxPADLOOP'
pp_hot.c:(.text+0x3d42): undefined reference to `CxPADLOOP'
/usr/include/sys/cdefs_elf.h:67:20: error: missing binary operator before token "("
<command line>:1:1: warning: "TIME_HIRES_STAT" redefined
<command line>:1:1: warning: this is the location of the previous definition

-- 
Report by Test::Smoke v1.43 build 1271 running on perl 5.10.1
(Reporter v0.035 / Smoker v0.045)



nntp.perl.org: Perl Programming lists via nntp and http.
Comments to Ask Bjørn Hansen at ask@perl.org | Group listing | About