develooper Front page | perl.perl5.porters | Postings from September 2010

Smoke [5.13.4] v5.13.4-180-gf83b46a FAIL(m) MSWin32 WinXP/.Net SP3 (x86/2 cpu)

From:
Steve Hay
Date:
September 8, 2010 18:03
Subject:
Smoke [5.13.4] v5.13.4-180-gf83b46a FAIL(m) MSWin32 WinXP/.Net SP3 (x86/2 cpu)
Message ID:
UKMAIL026byoxxSQWBL00000c03@ukmail02.planit.group
Automated smoke report for 5.13.4 patch f83b46a0147ba6f476add85d17f61a7e7fb00f21 v5.13.4-180-gf83b46a
maldoror.bath.planit.group: Intel(R) Core(TM)2 CPU 6700 @ 2.66GHz(~2660 MHz) (x86/2 cpu)
    on        MSWin32 - WinXP/.Net SP3
    using     ? unknown cc version 
    smoketime 4 minutes 42 seconds (average 28.200 seconds)

Summary: FAIL(m)

O = OK  F = Failure(s), extended report at the bottom
X = Failure(s) under TEST but not under harness
? = still running or test results not (yet) available
Build failures during:       - = unknown or N/A
c = Configure, m = make, M = make (after miniperl), t = make test-prep

v5.13.4-180-gf83b46a  Configuration (common) -DCCTYPE=MSVC70FREE -DINST_TOP=$(INST_DRV)\Smoke\doesntexist
----------- ---------------------------------------------------------
m m         -Duselargefiles
m m         -Duselargefiles -Dusemymalloc
m m         -Duselargefiles -Duseithreads -Uuseimpsys
m m         -Duselargefiles -Duseithreads -Uuseimpsys -Dusemymalloc
m m         -Duselargefiles -Duseithreads
| +--------- -DDEBUGGING
+----------- no debugging


Locally applied patches:
    uncommitted-changes
    SMOKEf83b46a0147ba6f476add85d17f61a7e7fb00f21

Compiler messages(MSWin32):
..\hv.c(2982) : warning C4028: formal parameter 1 different from declaration
..\hv.c(3018) : warning C4028: formal parameter 1 different from declaration
..\pp_hot.c(1938) : warning C4013: 'CxPADLOOP' undefined; assuming extern returning int
pp_hot.obj : error LNK2019: unresolved external symbol _CxPADLOOP referenced in function _Perl_pp_iter
..\miniperl.exe : fatal error LNK1120: 1 unresolved externals
..\scope.c(1247) : warning C4013: 'CxPADLOOP' undefined; assuming extern returning int
scope.obj : error LNK2019: unresolved external symbol _CxPADLOOP referenced in function _Perl_cx_dump

-- 
Report by Test::Smoke v1.43 build 1271 running on perl 5.11.0
(Reporter v0.035 / Smoker v0.045)




nntp.perl.org: Perl Programming lists via nntp and http.
Comments to Ask Bjørn Hansen at ask@perl.org | Group listing | About