develooper Front page | perl.perl5.porters | Postings from September 2010

Smoke [5.13.4] v5.13.4-123-g45b279e FAIL(FM) openvms V8.3-1H1 (IA64/2cpu)

From:
Craig A. Berry
Date:
September 2, 2010 23:59
Subject:
Smoke [5.13.4] v5.13.4-123-g45b279e FAIL(FM) openvms V8.3-1H1 (IA64/2cpu)
Message ID:
0L85008JYSRHR430@asmtp022.mac.com
Automated smoke report for 5.13.4 patch 45b279ec91f88dd43ca9900abb46e1a7d5838322 v5.13.4-123-g45b279e
ALMA: HP rx2600  (1.50GHz/6.0MB) (IA64/2 cpu)
    on        openvms - V8.3-1H1
    using     ? CC/DECC version 70390019
    smoketime 3 hours 30 minutes (average 1 hour 45 minutes)

Summary: FAIL(FM)

O = OK  F = Failure(s), extended report at the bottom
X = Failure(s) under TEST but not under harness
? = still running or test results not (yet) available
Build failures during:       - = unknown or N/A
c = Configure, m = make, M = make (after miniperl), t = make test-prep

v5.13.4-123-g45b279e  Configuration (common) none
----------- ---------------------------------------------------------
M -         
F -         -Duseithreads
| +--------- -DDEBUGGING
+----------- no debugging


Locally applied patches:
    uncommitted-changes
    SMOKE45b279ec91f88dd43ca9900abb46e1a7d5838322

Failures: (common-args) none
[minitest] 
    t/run/switchx.............FAILED--unexpected output at test 0
    t/io/argv.................FAILED--unexpected output at test 0
    t/io/fs...................FAILED--unexpected output at test 0
    t/op/alarm................FAILED--unexpected output at test 2
    t/op/chdir................FAILED--unexpected output at test 0
    t/op/filehandle...........FAILED--unexpected output at test 0
    t/op/groups...............FAILED--unexpected output at test 0
    t/op/hashassign...........FAILED--unexpected output at test 0
    t/op/inccode-tie..........FAILED--unexpected output at test 0
    t/op/inccode..............FAILED--unexpected output at test 0
    t/op/mkdir................FAILED--unexpected output at test 0
    t/op/readline.............FAILED--unexpected output at test 0
    t/op/split................FAILED--unexpected output at test 0
    t/op/stash................FAILED--expected 38 tests, saw 32
    t/op/stat.................FAILED--unexpected output at test 0
    t/op/switch...............FAILED--unexpected output at test 111
    t/op/taint................FAILED--unexpected output at test 0
    t/uni/fold................FAILED--unexpected output at test 0
    t/uni/lex_utf8............FAILED--unexpected output at test 0
    t/uni/lower...............FAILED--unexpected output at test 0
    t/uni/title...............FAILED--unexpected output at test 0
    t/uni/upper...............FAILED--unexpected output at test 0

[default] -Duseithreads
    t/op/alarm.....................................................FAILED--unexpected output at test 2
    cpan/autodie/t/open............................................FAILED at test 13
    cpan/ExtUtils-MakeMaker/t/prereq...............................FAILED--expected 13 tests, saw 5
    cpan/Module-Build/t/tilde......................................FAILED at test 16
    cpan/Test-Harness/t/source.....................................FAILED at test 36
    cpan/Time-HiRes/t/HiRes........................................FAILED--expected 48 tests, saw 39
    dist/ExtUtils-ParseXS/t/basic..................................FAILED at test 8
    dist/ExtUtils-ParseXS/t/more...................................FAILED at test 7
    dist/ExtUtils-ParseXS/t/usage..................................FAILED at test 7
    dist/XSLoader/t/XSLoader.......................................FAILED at test 5
    ext/DynaLoader/t/DynaLoader....................................FAILED at test 14
    lib/perl5db....................................................FAILED at test 9
    t/porting/exec-bit.............................................FAILED at test 1

-- 
Report by Test::Smoke v1.39 build 1235 running on perl 5.10.0
(Reporter v0.035 / Smoker v0.044)



nntp.perl.org: Perl Programming lists via nntp and http.
Comments to Ask Bjørn Hansen at ask@perl.org | Group listing | About