develooper Front page | perl.perl5.porters | Postings from August 2010

Smoke [5.13.3] v5.13.3-270-g1cefca6 FAIL(F) MSWin32 Win2000 SP4 (x86/1 cpu)

From:
George Greer
Date:
August 19, 2010 18:28
Subject:
Smoke [5.13.3] v5.13.3-270-g1cefca6 FAIL(F) MSWin32 Win2000 SP4 (x86/1 cpu)
Message ID:
201008200128.o7K1S3gu001439@m-l.org
Automated smoke report for 5.13.3 patch 1cefca6bb1a10d1e546d9a399299813645f0aac0 v5.13.3-270-g1cefca6
perl-win2k: Intel(R) Core(TM) i7 CPU 920 @ 2.67GHz(~2926 MHz) (x86/1 cpu)
    on        MSWin32 - Win2000 SP4
    using     cl version 14.00.50727.762
    smoketime 4 hours 18 minutes (average 32 minutes 18 seconds)

Summary: FAIL(F)

O = OK  F = Failure(s), extended report at the bottom
X = Failure(s) under TEST but not under harness
? = still running or test results not (yet) available
Build failures during:       - = unknown or N/A
c = Configure, m = make, M = make (after miniperl), t = make test-prep

v5.13.3-270-g1cefca6  Configuration (common) none
----------- ---------------------------------------------------------
F F         
F F         -Duselargefiles
F F         -Duseithreads
F F         -Duseithreads -Duselargefiles
| +--------- -DDEBUGGING
+----------- no debugging


Locally applied patches:
    uncommitted-changes
    SMOKE1cefca6bb1a10d1e546d9a399299813645f0aac0

Failures: (common-args) none
[default] 
[default] -DDEBUGGING
[default] -Duselargefiles
[default] -DDEBUGGING -Duselargefiles
[default] -Duseithreads
[default] -DDEBUGGING -Duseithreads
[default] -Duseithreads -Duselargefiles
[default] -DDEBUGGING -Duseithreads -Duselargefiles
../cpan/Test-Harness/t/regression.t.........................FAILED
    Non-zero exit status: 255
../cpan/Test-Harness/t/testargs.t...........................FAILED
    Non-zero exit status: 255
    Bad plan.  You planned 13 tests but ran 4.
../cpan/Test-Harness/t/compat/inc-propagation.t.............FAILED
    Non-zero exit status: 2
    Bad plan.  You planned 2 tests but ran 1.
../cpan/Test-Harness/t/compat/test-harness-compat.t.........FAILED
    Non-zero exit status: 25
    Bad plan.  You planned 120 tests but ran 116.

MANIFEST did not declare 'T/RE/OVERLOAD.T'

Passed Todo tests: (common-args) none
[default] -Duseithreads
[default] -DDEBUGGING -Duseithreads
[default] -Duseithreads -Duselargefiles
[default] -DDEBUGGING -Duseithreads -Duselargefiles
../t/re/overload.t..........................................PASSED
    2

Compiler messages(MSWin32):
Cwd.xs(75) : warning C4101: 'symlink' : unreferenced local variable
Base64.xs(343) : warning C4146: unary minus operator applied to unsigned type, result still unsigned
Base64.xs(345) : warning C4146: unary minus operator applied to unsigned type, result still unsigned
Piece.xs(950) : warning C4101: 'ret' : unreferenced local variable

-- 
Report by Test::Smoke v1.42 build 1267 running on perl 5.10.0
(Reporter v0.035 / Smoker v0.045)




nntp.perl.org: Perl Programming lists via nntp and http.
Comments to Ask Bjørn Hansen at ask@perl.org | Group listing | About