develooper Front page | perl.perl5.porters | Postings from August 2010

Smoke [5.13.3] v5.13.3-164-g45f6403 FAIL(F) MSWin32 WinXP/.Net SP3 (x86/2 cpu)

From:
Steve Hay
Date:
August 7, 2010 23:35
Subject:
Smoke [5.13.3] v5.13.3-164-g45f6403 FAIL(F) MSWin32 WinXP/.Net SP3 (x86/2 cpu)
Message ID:
UKMAIL02tKufVma0osA00004229@ukmail02.planit.group
Automated smoke report for 5.13.3 patch 45f6403b40da58011eab17ad0159b353c7d92509 v5.13.3-164-g45f6403
maldoror.bath.planit.group: Intel(R) Core(TM)2 CPU 6700 @ 2.66GHz(~2660 MHz) (x86/2 cpu)
    on        MSWin32 - WinXP/.Net SP3
    using     bcc32 version 5.5.1
    smoketime 7 hours 43 minutes (average 46 minutes 23 seconds)

Summary: FAIL(F)

O = OK  F = Failure(s), extended report at the bottom
X = Failure(s) under TEST but not under harness
? = still running or test results not (yet) available
Build failures during:       - = unknown or N/A
c = Configure, m = make, M = make (after miniperl), t = make test-prep

v5.13.3-164-g45f6403  Configuration (common) -DCCTYPE=BORLAND -DINST_TOP=$(INST_DRV)\Smoke\doesntexist
----------- ---------------------------------------------------------
F F         -Duselargefiles
F F         -Duselargefiles -Dusemymalloc
F F         -Duselargefiles -Duseithreads -Uuseimpsys
F F         -Duselargefiles -Duseithreads -Uuseimpsys -Dusemymalloc
F F         -Duselargefiles -Duseithreads
| +--------- -DDEBUGGING
+----------- no debugging


Locally applied patches:
    uncommitted-changes
    SMOKE45f6403b40da58011eab17ad0159b353c7d92509

Failures: (common-args) -DCCTYPE=BORLAND -DINST_TOP=$(INST_DRV)\Smoke\doesntexist
[default] -Duselargefiles
[default] -DDEBUGGING -Duselargefiles
[default] -Duselargefiles -Dusemymalloc
[default] -DDEBUGGING -Duselargefiles -Dusemymalloc
[default] -DDEBUGGING -Duselargefiles -Duseithreads -Uuseimpsys
[default] -DDEBUGGING -Duselargefiles -Duseithreads -Uuseimpsys -Dusemymalloc
[default] -Duselargefiles -Duseithreads
../t/io/errno.t.............................................FAILED
    1-16

[default] -Duselargefiles -Duseithreads -Uuseimpsys
[default] -Duselargefiles -Duseithreads -Uuseimpsys -Dusemymalloc
../t/io/errno.t.............................................FAILED
    1-16
../t/op/threads.t...........................................FAILED
    Non-zero exit status: 5
    Bad plan.  You planned 23 tests but ran 9.

[default] -DDEBUGGING -Duselargefiles -Duseithreads
../t/io/errno.t.............................................FAILED
    1-16
../dist/IO/t/io_sock.t......................................FAILED
    25
    Non-zero exit status: 54
    Bad plan.  You planned 26 tests but ran 25.

Compiler messages(bcc32):
Warning W8013 ..\pp_ctl.c 3149: Possible use of 'newsp' before definition in function S_doeval
Warning W8013 ..\pp_ctl.c 3150: Possible use of 'optype' before definition in function S_doeval
Warning W8004 blocksort.c 901: 'numQSorted' is assigned a value that is never used in function mainSort
Warning W8004 compress.c 225: 'zPend' is assigned a value that is never used in function generateMTFValues
Warning W8004 compress.c 598: 'nBytes' is assigned a value that is never used in function sendMTFValues
Warning W8008 decompress.c 588: Condition is always true in function BZ2_decompress
Warning W8008 decompress.c 591: Condition is always true in function BZ2_decompress
Warning W8008 bzlib.c 93: Condition is always false in function bz_config_ok
Warning W8066 bzlib.c 93: Unreachable code in function bz_config_ok
Warning W8008 bzlib.c 94: Condition is always false in function bz_config_ok
Warning W8066 bzlib.c 94: Unreachable code in function bz_config_ok
Warning W8008 bzlib.c 95: Condition is always false in function bz_config_ok
Warning W8066 bzlib.c 95: Unreachable code in function bz_config_ok
Warning W8057 bzlib.c 111: Parameter 'opaque' is never used in function default_bzalloc
Warning W8057 bzlib.c 117: Parameter 'opaque' is never used in function default_bzfree
Warning W8004 bzlib.c 454: 'progress' is assigned a value that is never used in function BZ2_bzCompress
Warning W8066 bzlib.c 866: Unreachable code in function BZ2_bzDecompress
Warning W8008 bzlib.c 866: Condition is always true in function BZ2_bzDecompress
Warning W8012 deflate.c 1767: Comparing signed and unsigned values in function deflate_rle
Warning W8012 deflate.c 1770: Comparing signed and unsigned values in function deflate_rle
Warning W8012 deflate.c 1771: Comparing signed and unsigned values in function deflate_rle
Warning W8012 deflate.c 1772: Comparing signed and unsigned values in function deflate_rle
Warning W8012 deflate.c 1773: Comparing signed and unsigned values in function deflate_rle
Warning W8041 Base64.xs 343: Negating unsigned value in function XS_MIME__QuotedPrint_encode_qp
Warning W8041 Base64.xs 345: Negating unsigned value in function XS_MIME__QuotedPrint_encode_qp

-- 
Report by Test::Smoke v1.42 build 1267 running on perl 5.11.0
(Reporter v0.035 / Smoker v0.045)




nntp.perl.org: Perl Programming lists via nntp and http.
Comments to Ask Bjørn Hansen at ask@perl.org | Group listing | About