develooper Front page | perl.perl5.porters | Postings from August 2010

Smoke [5.13.3] v5.13.3-160-g77db647 FAIL(F) MSWin32 WinXP/.Net SP3 (x86/2 cpu)

Thread Next
From:
Steve Hay
Date:
August 4, 2010 23:09
Subject:
Smoke [5.13.3] v5.13.3-160-g77db647 FAIL(F) MSWin32 WinXP/.Net SP3 (x86/2 cpu)
Message ID:
UKMAIL02WtIIZS2TRqf00003fd1@ukmail02.planit.group
Automated smoke report for 5.13.3 patch 77db6475b99dada0ff1239a4df9b8e365b2ee260 v5.13.3-160-g77db647
maldoror.bath.planit.group: Intel(R) Core(TM)2 CPU 6700 @ 2.66GHz(~2660 MHz) (x86/2 cpu)
    on        MSWin32 - WinXP/.Net SP3
    using     cl version 13.10.3077
    smoketime 7 hours 25 minutes (average 44 minutes 31 seconds)

Summary: FAIL(F)

O = OK  F = Failure(s), extended report at the bottom
X = Failure(s) under TEST but not under harness
? = still running or test results not (yet) available
Build failures during:       - = unknown or N/A
c = Configure, m = make, M = make (after miniperl), t = make test-prep

v5.13.3-160-g77db647  Configuration (common) -DCCTYPE=MSVC70FREE -DINST_TOP=$(INST_DRV)\Smoke\doesntexist
----------- ---------------------------------------------------------
F F         -Duselargefiles
F F         -Duselargefiles -Dusemymalloc
F F         -Duselargefiles -Duseithreads -Uuseimpsys
F F         -Duselargefiles -Duseithreads -Uuseimpsys -Dusemymalloc
F F         -Duselargefiles -Duseithreads
| +--------- -DDEBUGGING
+----------- no debugging


Locally applied patches:
    uncommitted-changes
    SMOKE77db6475b99dada0ff1239a4df9b8e365b2ee260

Failures: (common-args) -DCCTYPE=MSVC70FREE -DINST_TOP=$(INST_DRV)\Smoke\doesntexist
[default] -Duselargefiles
[default] -DDEBUGGING -Duselargefiles
[default] -Duselargefiles -Dusemymalloc
[default] -DDEBUGGING -Duselargefiles -Dusemymalloc
[default] -Duselargefiles -Duseithreads -Uuseimpsys
[default] -DDEBUGGING -Duselargefiles -Duseithreads -Uuseimpsys
[default] -Duselargefiles -Duseithreads -Uuseimpsys -Dusemymalloc
[default] -DDEBUGGING -Duselargefiles -Duseithreads -Uuseimpsys -Dusemymalloc
[default] -DDEBUGGING -Duselargefiles -Duseithreads
../ext/POSIX/t/time.t.......................................FAILED
    6
    Non-zero exit status: 1

[default] -Duselargefiles -Duseithreads
../dist/IO/t/io_sock.t......................................FAILED
    25
    Non-zero exit status: 54
    Bad plan.  You planned 26 tests but ran 25.
../ext/POSIX/t/time.t.......................................FAILED
    6
    Non-zero exit status: 1

Compiler messages(MSWin32):
Cwd.xs(75) : warning C4101: 'symlink' : unreferenced local variable
Base64.xs(343) : warning C4146: unary minus operator applied to unsigned type, result still unsigned
Base64.xs(345) : warning C4146: unary minus operator applied to unsigned type, result still unsigned
Piece.xs(950) : warning C4101: 'ret' : unreferenced local variable

-- 
Report by Test::Smoke v1.42 build 1267 running on perl 5.11.0
(Reporter v0.035 / Smoker v0.045)


Thread Next


nntp.perl.org: Perl Programming lists via nntp and http.
Comments to Ask Bjørn Hansen at ask@perl.org | Group listing | About